##TITLE=Bruna Simoes PF75 22-11-2014 R4-2 $$ Begin of the data block
##JCAMP-DX=5.00 $$ ACD/SpecManager v 10.08
##SPECTROMETER/DATA SYSTEM=Alpha
##DATE=15 Dec 2014 08:06:22
##DATA TYPE=INFRARED SPECTRUM
##DATA CLASS=XYDATA
##ORIGIN=
##OWNER=
##NPOINTS=1765
##FIRSTX=399.76428223
##LASTX=3997.64306641
##MAXX=3997.64306641
##MINX=399.76428223
##MAXY=0.88444251
##MINY=0.49133259
##XFACTOR=1.0000000000
##YFACTOR=1.000000000000000e-9
##FIRSTY=0.83579332
##DELTAX=2.03961372
##XUNITS=1/CM
##YUNITS=ARBITRARY UNITS
##XYDATA=(X++(Y..Y))
399.8H35793316j721441J678109K470076l69609l179907k230585J213312K561748k59876
$$ 835793316 834071875 835749984 838220060 837850451 834670544 832439959 833653271 836215019 835955143
418.1H35955143m201889k837479J401961L502309J422822j625001j803637L97563J502932
$$ 835955143 831753254 828915775 830317736 833820045 835242867 833617866 831814229 832211792 833714724
436.5H33714724O0498j917064k291739r42528j62721j091182j610339r4235K054036
$$ 833714724 833775222 831858158 829566419 828623891 828461170 827369988 825759649 825665414 827719450
454.8H27719450K901435J399457j243591k147853j239837o72936j934052m774808p005513
$$ 827719450 830620885 832020342 830776751 828628898 827389061 826716125 824782073 820007265 813001752
473.2H13001752n136728J77383M945457O146252M273176J434565q77678j067877Q49366
$$ 813001752 807865024 808042407 812987864 819134116 823407292 824841857 823964179 822896302 823745668
491.5H23745668J899123Q81612n96940k192199m410744n642056l502965m4406J32859
$$ 823745668 825644791 826526403 825929463 823737264 819326520 813684464 810181499 810137093 810269952
509.9H10269952l516376p518411p889449j433015P615745J0321796P394313M309297
$$ 810269952 806753576 799235165 791345716 789912701 797528446 807850242 815244555 819553852
526.2H19553852K051652q8335j236081l26395J636386K420187J170337o64234j043319
$$ 819553852 821605504 821517169 820281088 819954693 821591079 824011266 825181603 824517369 823474050
544.6H23474050Q9764J060128N41985r92775j674115n52297R52244R19878o49690j751900
$$ 823474050 823563814 824623942 825165927 824173152 822499037 821946740 822898984 823818862 823169172 821417272
565H21417272q47220Q96930J149595l90410j717270j105308P76946J619101L86417
$$ 821417272 820570052 821466982 822616577 822226167 820508897 819403589 820180535 821799636 822186053
583.3H22186053j322150j271129M34041J637995Q85546r07242j484990J0192J823008
$$ 822186053 820863903 819592774 820026815 821664810 822550356 821643114 820158124 820168316 821991324
601.7H21991324J524508n17904j639665n42938J299798J476348m80891k123653j109660
$$ 821991324 823515832 822997928 821358263 820815325 822115123 823591471 823110580 820986927 819877267
620H19877267J259386J942516j6451l890932p638812m173159N838036Q172453J392841
$$ 819877267 821136653 823079169 823062718 819171786 811532974 807359815 813197851 821370304 822763145
638.4H22763145m040301p343590j2823701j4572024l62099J8291653J9328892J0018885
$$ 822763145 818722844 811379254 798555553 783983529 783621430 801913083 821241975 831260860
654.7H31260860M267037J288831p74324j053452l96788k21551N68271P48098n24879
$$ 831260860 835527897 836816728 836042404 834988952 834592164 834370613 834938884 835686982 835162103
673.1H35162103o02722N57899O01233j054526k735913l079533k831698m131853q437395
$$ 835162103 834559381 835117280 835718513 834663987 831928074 828848541 826016843 821884990 813447595
691.4H13447595j4208734j6255856j4509857j1102616L042340K3091495K6737451J5684784
$$ 813447595 799238861 782983005 768473148 757370532 760412872 783504367 810241818 825926602
707.7H25926602O617069J960397k570510q756280j3582945q688211M680514R946883
$$ 825926602 832543671 834504068 831933558 823177278 809594333 800906122 805586636 815533519
724.1H15533519K058267o086051l178299O251157R322881N308748R14573k57015L086090
$$ 815533519 817591786 811505735 808327436 814578593 823901474 829210222 830124795 829867780 832953870
742.4H32953870O231785M128218o84023m432201o966115r481132j1822938j3572097
$$ 832953870 839185655 843313873 842629850 838197649 831231534 821750402 809927464 796355367
758.7G96355367k1814764m3601036n5111825k4436236J5335977K2388161K7726769
$$ 796355367 774540603 730939567 675827742 651391506 666727483 689115644 716842413
773G16842413M5073569M3186486K4698078J0146022K467811j297831k730966l308117
$$ 716842413 761915982 805102468 829800546 839946568 842414379 841116548 838385582 835077465
789.3H35077465m137993n302608o166935n548001k466797J316428K666414K163529
$$ 835077465 830939472 825636864 819469929 813921928 811455131 812771559 815437973 817601502
805.6H17601502K210915L031552L341496K436697Q92938j68264q6129P43151J148939
$$ 817601502 819812417 822843969 826185465 828622162 829515100 829346836 829260707 830003858 831152797
824H31152797K03550k120674n491495p892251n457163R26018L486573j302778r933353
$$ 831152797 831356347 829235673 823744178 815851927 810394764 811320782 814807355 813504577 803571224
842.4H03571224k2323251l8544893m3558895j7093420K8670013N4051935M6093464
$$ 803571224 781247973 742703080 699144185 682050765 710720778 764772713 810866177
856.6H10866177K6352525J2217104N486369L130377K076387L91364j655280k092362
$$ 810866177 837218702 849435806 854922175 858052552 860128939 860520303 858865023 856772661
873H56772661k53379J878261K376497J288057l74675j895070l004253k997220j335561
$$ 856772661 856519282 858397543 860774040 862062097 861687422 859792352 856788099 853790879 852455318
891.3H52455318J023412K902925L894210L781557K594411Q92162l84450n46872N1558
$$ 852455318 853478730 856381655 860275865 864057422 866651833 867543995 867159545 866612673 866664231
909.7H66664231M11928k3425q54135j227438q65996l85165o48618j655340k527893
$$ 866664231 867076159 867052734 866198599 864971161 864105165 863720000 863071382 861416042 858888149
928H58888149k850830l487587m924119n520701l453791J81377K484798K019703p08460
$$ 858888149 856037319 852549732 847625613 842104912 838651121 838832498 841317296 843336999 842628539
946.4H42628539m259408p307887q898377q277059n966783l215432P20620N667627P121563
$$ 842628539 838369131 831061244 822162867 813885808 807919025 804703593 805424213 811091840 818213403
964.7H18213403K602220k810419k880931L57628J620114R82106j79529j993478l533780
$$ 818213403 820815623 818005204 815124273 815481901 817102015 818084121 817904592 815911114 812377334
983.1H12377334l859938l546237l119588k311647j739502l103793o560922j0314881
$$ 812377334 808517396 804971159 801851571 799539924 797800422 794696629 788135707 777820826
999.4G77820826j2942732j4087081j4265120j5743375j6964256j1387468l391266k084791
$$ 777820826 764878094 750791013 736525893 720782518 703818262 692430794 689039528 686954737
1015.7F86954737k793134L32714M759669P403076P487952O935895Q941948J2546480
$$ 686954737 684161603 684494317 689253986 696657062 704145014 711080909 720022857 732569337
1032G32569337J2296438N943835k318561p110238p195711n057633k529383N86450L302097
$$ 732569337 744865775 750809610 748491049 741380811 734185100 729127467 726598084 727184534 730486631
1050.4G30486631L248573N28753k368212l823221l956020l244161j377583K110124
$$ 730486631 733735204 734263957 731895745 728072524 724116504 720872343 719494760 721604884
1066.7G21604884N980432Q361160R185076R233177Q556604O691158L743589Q11517
$$ 721604884 727585316 735946476 745131552 754364729 762921333 769612491 773356080 774167597
1083G74167597p74383j022637j496613l338158o403506j0127604j4443398j9858956
$$ 774167597 773393214 772370577 770873964 767535806 761132300 751004696 736561298 716702342
1099.4G16702342k6582777l1710327k7712941j0573924P286430R785354N309403J1913180
$$ 716702342 690119565 658409238 630696297 620122373 627408803 637194157 642503560 654416740
1115.7F54416740K6463926L4818947L2974064K6125432J8934011J2738168Q145988
$$ 654416740 680880666 715699613 748673677 774799109 793733120 806471288 814617276
1129.9H14617276N546510M248143L089368J386642l99053j281321j194477j173258
$$ 814617276 820163786 824411929 827501297 828887939 828488886 827207565 826013088 824839830
1146.3H24839830k187430m072488o093681q187055j1116743j4921666j7821013j8928886
$$ 824839830 822652400 818579912 812486231 804299176 793182433 778260767 760439754 741510868
1162.6G41510868k1373510k9743374m0585279k9607117J7493248O0868740O1493337
$$ 741510868 720137358 690393984 649808705 620201588 637694836 698563576 760056913
1176.9G60056913L7078380J5564442J696110p768750j4644861j8051863j4446199k553046
$$ 760056913 797135293 812699735 814395845 806627095 791982234 773930371 759484172 756931126
1193.2G56931126J1374831J8733144J8010557J3677001Q724153L886938J50621j767993
$$ 756931126 768305957 787039101 805049658 818726659 827450812 831337750 831488371 829720378
1209.5H29720378k517045l233552m329323n468965o002784n498647m381538l890216
$$ 829720378 827203333 823969781 819640458 814171493 808168709 802670062 798288524 794398308
1225.8G94398308m215062m497647n027235o607353q775473j0859132j2884557j5001536
$$ 794398308 790183246 785685599 780658364 774051011 765275538 754416406 741531849 726530313
1242.1G26530313j7596840k1510601k6930988l1821668l3877254l4088135l2866120
$$ 726530313 708933473 687422872 660491884 628670216 594792962 560704827 527838707
1256.4E27838707k4034023j026631K9708207M8943818M4639885K4154782L550768q071363
$$ 527838707 503804684 502778053 532486260 581430078 626069963 650224745 653775513 645704150
1272.7F45704150j1976182j3247490j4051914j2792409o605983M005194J4001012J9377172
$$ 645704150 633727968 620480478 606428564 593636155 587030172 591035366 605036378 624413550
1289F24413550K0312965J9380152J8950582J8781662J6422927J2932777J1707366Q828282
$$ 624413550 644726515 664106667 683057249 701838911 718261838 731194615 742901981 751730263
1305.4G51730263j330614j4553964k4592757k9803455k6684642j2057126Q892119K3894370
$$ 751730263 750399649 735845685 711252928 681449473 654764831 642707705 651599824 675494194
1321.7F75494194K7011037K2430718J5810668J0559559P560611O187439N856335O430030
$$ 675494194 702505231 724935949 740746617 751306176 758866787 765054226 770910561 777340591
1338G77340591P441759P933617P877588P393956O016255M015445K145410J006603O42717
$$ 777340591 784782350 792715967 800593555 807987511 814003766 818019211 820164621 821171224 821813941
1356.4H21813941P05063Q76725J130164J210391R55522O91891N28455M52697N37694
$$ 821813941 822519004 823395729 824525893 825736284 826691806 827383697 827912152 828364849 828902543
1374.7H28902543R29832J319051J104235J52469j109481l579676p726610j0248363
$$ 828902543 829832375 831151426 832255661 832408130 831298649 827718973 819992363 809744000
1391H09744000p752716Q94427R076894J0273575O738246K920687N5432k683222n182743
$$ 809744000 801991284 802885711 811962605 822236180 828974426 831895113 831950545 829267323 824084580
1409.4H24084580q503258j1281014q378863j215339M087508M841447O25253q535028
$$ 824084580 815581322 804300308 795921445 794706106 798793614 803635061 804260314 795725286
1425.7G95725286k0272434l1237840l3825219k7588725j3054788J6315937L2695114
$$ 795725286 775452852 744215012 710389793 682801068 669746280 686062217 718757331
1440G18757331K7719856J6730189Q763492P131338Q194626P762849N358219J031280
$$ 718757331 746477187 763207376 771970868 779102206 787296832 795059681 800417900 801449180
1456.3H01449180q984506j8101097j7829299m967808P859409J843750n228102k283931
$$ 801449180 792464674 774363577 756534278 751566470 759425879 761269629 756041527 753757596
1472.6G53757596L982663Q180320Q875430J0230601J5442967J7032683J3448298R385586
$$ 753757596 757740259 765920579 774796009 785026610 800469577 817502260 830950558 840336144
1488.9H40336144O166995L239214J013875j175523l515959n135893p172347j7734587
$$ 840336144 846503139 849742353 850756228 849580705 846064746 840928853 833756506 816021919
1505.2H16021919m4111848l9995253m607498K5803148L7813902L1144858J8274069
$$ 816021919 771910071 731914818 727307320 753110468 790924370 822069228 840343297
1519.5H40343297J1136174P269501M191637K524138J162350N81086O14703N69343J48416
$$ 840343297 851479471 858748972 862940609 865464747 866627097 867208183 867822886 868392229 868540645
1537.9H68540645m95315q69155k85268K59936K21789k26021n76317m80831k08080k72095
$$ 868540645 868045330 867176175 866890907 867150843 867372632 867146611 866570294 866089463 865881383 865609288
1558.3H65609288r43720j186609j374841j491547j774609k391636k560914l573477
$$ 865609288 864665568 863478959 862104118 860612571 858837962 856446326 853885412 850311935
1574.6H50311935o485701p614255o126880m022360k862454m255712o464481p905304
$$ 850311935 843826234 836211979 830085099 826062739 823200285 818944573 812480092 804574788
1590.9H04574788q818269r881556j1871577j5893995k2720456l1430781l8471163l7943422
$$ 804574788 795756519 785874963 774003386 758109391 735388935 703958154 665486991 627543569
1607.2F27543569k0104647J4288366M0826499M9358070M2625845K2221148R770512
$$ 627543569 607438922 621727288 662553787 711911857 754537702 776758850 786529362
1621.5G86529362O137192L867448K693415K473115K179385K195537K846479K575636
$$ 786529362 792666554 796534002 799227417 801700532 803879917 806075454 808921933 811497569
1637.8H11497569J860380J717687J742601K227009K708196K094925K218425L161311
$$ 811497569 813357949 815075636 816818237 819045246 821753442 823848367 826066792 829228103
1654.1H29228103K130926J610339J897394K117157J669109Q11756K26080k84135j128137
$$ 829228103 831359029 832969368 834866762 836983919 838653028 839464784 839690864 839406729 838278592
1672.5H38278592k858520m097521k227783Q99553K792179K191246o73473k698302l347516
$$ 838278592 835420072 831322551 829094768 829994321 832786500 834977746 834304273 831605971 828258455
1690.9H28258455k988219l692329n367816p235706r981394r537041j0449052j3631403
$$ 828258455 825270236 821577907 816210091 808974385 798992991 789455950 779006898 765375495
1707.2G65375495j5794098j9142509k5163948l6588431n2634299m9757898l4579336
$$ 765375495 749581397 730438888 705274940 668686509 616052210 566294312 531714976
1721.5E31714976k8053582j2328803K0982325N3638339O6264987O6547751N0418675
$$ 531714976 503661394 491332591 512314916 565953255 632218242 698765993 749184668
1735.7G49184668K6878774J9483030J5892088J0830045Q055210O595612N679727M356324
$$ 749184668 776063442 795546472 811438560 822268605 830323815 836919427 842599154 846955478
1752H46955478K887905K251923K095222J764298J599729J459479J555264K057493K282441
$$ 846955478 849843383 852095306 854190528 855954826 857554555 859014034 860569298 862626791 864909232
1770.4H64909232J947641R95576K35856J96159N85914P59899N04673J19984j908L77536
$$ 864909232 866856873 867852449 868088305 868284464 868870378 869630277 870134950 870254934 870253026 870630562
1790.8H70630562J158238J418650J079857R34661J163602J379847J133859N86808J64926
$$ 870630562 871788800 873207450 874287307 875221968 876385570 877765417 878899276 879486084 879651010
1809.2H79651010K92718P64132R37521O20902J23918p0989J28686M45307M34637J74641
$$ 879651010 879943728 880707860 881645381 882266283 882390201 882319212 882447898 882893205 883327842 883502483
1829.6H83502483M6611J63734L26872L17991O8664k04026j77622J32322K39015K6464
$$ 883502483 883549094 883712828 884039700 884357691 884426355 884222329 884044707 884177029 884416044 884442508
1850H84442508k27034k81095r5964J00553R3460q8870j97113q8692J07170J48773m8459
$$ 884442508 884215474 883934379 883838415 883938968 884032428 883943558 883746445 883657753 883764923 883913696 883865237
1872.4H83865237k39849k57611j24037m6432j61648l27051l38793k12252j42574k77996
$$ 883865237 883625388 883367777 883243740 883197308 883035660 882708609 882369816 882157564 882014990 881736994
1892.8H81736994n17845o67870p05839p02858p27236q09431r67085j073778q78274
$$ 881736994 881219149 880551279 879845440 879142582 878415346 877605915 876638830 875565052 874686778
1911.1H74686778m18663n8055r5129o00636j552701k672315k805591r50873J890183
$$ 874686778 874268115 874210060 874114931 873514295 871961594 869289279 866483688 865532815 867422998
1929.5H67422998L510773L170490K014995J009703K90274j65045k87890j20163J39355
$$ 867422998 870933771 874104261 876119256 877128959 877419233 877254188 876966298 876846135 876985490
1947.9H76985490L71337M80473M03524J83522l5584j15156q1181o8963j02937m2617
$$ 876985490 877356827 877837300 878240824 878424346 878388762 878273606 878192425 878123462 878020525 877977908
1968.3H77977908J41918L16501L33548J58608p4327k18332k36154k33292l17574m48346
$$ 877977908 878119826 878436327 878769875 878928483 878854156 878635824 878399670 878166378 877848804 877400458
1988.7H77400458m86016l43502j36256r6500k17080k97368k27749j03355j03116k97844
$$ 877400458 876914442 876570940 876434684 876338184 876121104 875823736 875595987 875492632 875389516 875091672
2009H75091672n57840o67036n72383m32432m58002o39736p46251m97877M6492K96831
$$ 875091672 874533832 873866796 873294413 872861981 872403979 871764243 871017992 870520115 870566607 870863438
2029.4H70863438M2915k48611k62201n0723J82867K87115K70248K65956L54349M14133
$$ 870863438 870906353 870657742 870395541 870344818 870527685 870814800 871085048 871351004 871705353 872119486
2049.8H72119486K84970j6689k82824l45826k61009k24233l34203m52518l94524j80304
$$ 872119486 872404456 872387767 872104943 871759117 871498108 871273875 870939672 870487154 870092630 869912326
2070.2H69912326P75L2902J5140R0837K79009M89295N76496M88579L59834L50534M44890
$$ 869912326 869913101 869946003 869961143 870051980 870330989 870820284 871396780 871885359 872245193 872595727 873040617
2092.7H73040617M86671L63410J80721J65105L08693M15384L60132J72853L517j9551
$$ 873040617 873527288 873890698 874071419 874236524 874545217 874960601 875320733 875493586 875497103 875477552
2113.1H75477552O9619J16706N7578k4200j9967P9870J74641J80662Q2612m1246n3346
$$ 875477552 875547171 875663877 875721455 875697255 875677288 875757158 875931799 876112461 876195073 876153827 876100481
2135.5H76100481L9279J02639N0068p7486j37210p1525L3080Q0347O9917O5922J27554
$$ 876100481 876139760 876242399 876292467 876214981 876077771 876006246 876039326 876119673 876189590 876255512 876383066
2157.9H76383066K29657K65479J83940M5538l6597J6152J24336J28925K2709r4712
$$ 876383066 876612723 876878202 877062142 877107680 877071083 877087235 877211571 877340496 877363205 877268493
2178.3H77268493r3639L9220J39594J06275o377q7679o2823M5717Q5950O437p7844
$$ 877268493 877174854 877214074 877353668 877459943 877453566 877365887 877303064 877348781 877434731 877441168 877363324
2200.8H77363324q5950j5616M0710m1962k04921k57730j41502J1385R477j67966l20971
$$ 877363324 877277374 877261758 877302468 877260506 877055585 876797855 876656353 876667738 876677215 876509249 876188278
2223.2H76188278k68042p4386L1650m6432j93000k22683p8976Q3565O4791j33753k66850
$$ 876188278 875920236 875845850 875877500 875831068 875638068 875415385 875336409 875419974 875484765 875351012 875084162
2245.6H75084162j70052M17K9981r8407k43008k52128j25468l8028j70826m26352n03302
$$ 875084162 874914110 874914527 874944508 874846101 874603093 874350965 874225497 874187469 874016643 873590291 873086989
2268.1H73086989l17514j06633r5665k16544k27332m7743J34945J07646j10746k95281
$$ 873086989 872769475 872662842 872567177 872350633 872123301 872075558 872210503 872318149 872207403 871912122
2288.5H71912122k70963p8082N0604p6890l99291o89447p78914o87778n39302m45247
$$ 871912122 871641159 871563077 871613681 871536791 871137500 870448053 869669139 868981361 868442059 867996812
2308.9H67996812m07398k98023j68204k97606o87600r39190p91192m81367l43859l39389
$$ 867996812 867589414 867291391 867123187 866825581 866137981 865198791 864407599 863926232 863582373 863242984
2329.3H63242984k95401k21550j64926l7968J09672R7811K21372Q79168J000107j55568
$$ 863242984 862947583 862726033 862561107 862523139 862632811 862730622 862951994 863831162 864831269 864675701
2349.7H64675701j632095k380788k097487j289845m96566K7120M09424P67768J096010
$$ 864675701 863043606 860662818 858565331 857275486 856778920 856806040 857215464 857983232 859079242
2368H59079242J350879J421154J243055J018345R66251J009703R17971O50525L28660
$$ 859079242 860430121 861851275 863094330 864112675 865078926 866088629 867006600 867657125 867985785
2386.4H67985785P2300l4987m2022q8691j89007k39670j98424r1314K0444R6619J57476
$$ 867985785 868058085 868023098 867981076 867892385 867703378 867463708 867265284 867173970 867194414 867291033 867448509
2408.8H67448509J96933K04504K17378J95444R7632O557m0412m8042k1755j9968p4446
$$ 867448509 867645442 867849946 868067324 868262768 868360400 868366957 868326545 868278503 868256748 868236780 868162334
2431.2H68162334j36793j46150j15454q2672o3777q3804j39058j87218k02417j78516
$$ 868162334 868025541 867879391 867763937 867681265 867617488 867533684 867394626 867207408 867004991 866826475
2451.6H66826475j59383j89364k52187l11256l31700l38494l96312m62651m18305k72870
$$ 866826475 866667092 866477728 866225541 865914285 865582585 865244091 864847779 864385128 863966823 863693953
2472H63693953j53304j09255j06096r2507o318J33157K21193K18034J79350K03073
$$ 863693953 863540649 863431394 863325298 863232791 863226473 863359630 863580823 863798857 863978207 864181280
2492.4H64181280K86281K94566J66893r358j10507q3923j7106p0155k56836m03345
$$ 864181280 864467561 864762127 864929020 864919662 864809155 864725232 864708126 864637971 864381135 863977790
2512.8H63977790l92914k73228j61469j54495k30610k69115k22922j83224k68996m65989
$$ 863977790 863584876 863311648 863150179 862995684 862765074 862495959 862273037 862089813 861820817 861354828
2533.2H61354828n98133n40435l76761k89202l64303m75467m24623k40445j39296k17080
$$ 861354828 860756695 860216260 859839499 859550297 859185994 858710527 858285904 858045459 857906163 857689083
2553.6H57689083l42966l15725j03116J35898K43843K12371J81079K27451K45810J11401
$$ 857689083 857346117 857030392 856927276 857063174 857307017 857519388 857700467 857927918 858173728 858285129
2574H58285129j60932m29631n13673l51667r6738j6630j95742l73125l31640j86861
$$ 858285129 858124197 857694566 857180893 856829226 856732488 856715858 856520116 856146991 855815351 855628490
2594.4H55628490j27852j40368q4937P6771K17795J59919j33752m78268o36518n70238
$$ 855628490 855500638 855360270 855275333 855352104 855569899 855729818 855596066 855117798 854481280 853911042
2614.8H53911042m63068m43995m65095l91126j63138O3837J40190P9453J4424Q4818
$$ 853911042 853447974 853003979 852538884 852147758 851984620 852048457 852188647 852268100 852282524 852367342
2635.2H52367342K12430K07007M3929j12712j27674q9704j62185l26991m40836m32193
$$ 852367342 852579772 852786779 852830708 852717996 852590322 852500618 852338433 852011442 851570606 851138413
2655.6H51138413l46661k55644k33233k86043k62320j13010j3471o8426k22444l85642
$$ 851138413 850791752 850536108 850302875 850016832 849754512 849641502 849628031 849559605 849337161 848951519
2676H48951519m68255m73201m80592m78089m19080k90811j35124o4373r3818j46508
$$ 848951519 848483264 848010063 847529471 847051382 846632302 846341491 846206367 846141994 846048176 845901668
2696.4H45901668j88887k18332k62558l55423m60148n09798n05090m85063m89115n33462
$$ 845901668 845712781 845494449 845231891 844876468 844416320 843906522 843401432 842916369 842427254 841893792
2716.8H41893792n42462n00738m63963m31120m78447n94914n85615m57108l93153m56571
$$ 841893792 841351330 840850592 840386629 839955509 839477062 838882148 838296533 837839425 837446272 836989701
2737.2H36989701n70774n95272m96030l62038l28780m51207n74529n56171m66049m86433
$$ 836989701 836418927 835823655 835327625 834965587 834636807 834185600 833611071 833054900 832588851 832102418
2757.6H32102418o58631q30591r18031r22441q17776o17981l80933k27154k84075m56035
$$ 832102418 831443787 830613196 829695165 828772724 827954948 827336967 826956034 826728880 826444805 825988770
2778H25988770o12021p77006r26197r88245j052558j275957j568019j705170j679420
$$ 825988770 825376749 824599743 823673546 822685301 821632743 820356786 818788767 817083597 815404177
2796.3H15404177j726032j943528k130032k169907k054393j824022j779496k062202
$$ 815404177 813678145 811734617 809604585 807434678 805380285 803556263 801776767 799714565
2812.6G99714565k441942k771199l048003l328562l733217m328728n087197n956113
$$ 799714565 797272623 794501424 791453421 788124859 784391642 780062914 774975717 769019604
2828.9G69019604p034719q577466j0795057j3903678j8345475k4258733l0805707l4983396
$$ 769019604 761984885 753407419 742612362 728708684 710363209 686104476 655298769 620315373
2845.3F20315373k9841542j0723293J2780964K3879886K0398617J3847053J1220276
$$ 620315373 590473831 579750538 592531502 616411388 636810005 650657058 661877334
2859.5F61877334J2128174J4170945J3756037R392440L480375j581788m984796n879700
$$ 661877334 674005508 688176453 701932490 711324930 714805305 713223517 708238721 702359021
2875.9G02359021l660739K28167L065646L566205K312124K81691j936614l940642n317986
$$ 702359021 698698282 698926449 701992095 705558300 707870424 708152115 706215501 702274859 696956873
2894.2F96956873n924404o076634o383836p363141r178459j2019992j6214132k1748841
$$ 696956873 691032469 684955835 678571999 671208858 662030399 650010407 633796275 612047434
2910.5F12047434k7665734k9993237k2486805n719662R781241J6571164J7243028J5783072
$$ 612047434 584381700 554388463 531901658 526181996 535963237 552534401 569777429 585560501
2926.8E85560501J2451708P213890J559079k395153j827955N024314J5190124K2408724
$$ 585560501 598012209 605226099 606785178 604390025 602562070 607586384 622776508 645185232
2943.2F45185232K3478091K0204127J5532970J0839999O420314K803743J055956J867652
$$ 645185232 668663323 688867450 704400420 715240419 721660733 724464476 725520432 727388084
2959.5G27388084M730999Q221329J1015057J2276232J1727155J0017037Q058787O274938
$$ 727388084 732119083 740340412 751355469 763631701 775358856 785375893 793434680 799709618
2975.8G99709618M910588L869892K815246J908302J439453J282095J254201J100600
$$ 799709618 804620206 808490098 811305344 813213646 814653099 815935194 817189395 818289995
2992.1H18289995P01368M18484K25365j31547m60506q08179j304805j685679j771689
$$ 818289995 818991363 819409847 819635212 819503665 819043159 818234980 816930175 815244496 813472807
3010.5H13472807j580298j003682P152J105965J772224J771153J260995N77510K5928
$$ 813472807 811892509 810888827 810895979 812001944 813774168 815545321 816806316 817383826 817409754
3028.8H17409754l07203m89950n97179m67419J75178Q75056R39369L91721l25262p59244
$$ 817409754 817102551 816612601 816015422 815548003 815723181 816598237 817537606 817929327 817604065 816844821
3049.2H16844821o99580j03891O94931R13501M03821k99096p64251o89864l93271n94974
$$ 816844821 816145241 816041350 816736281 817649782 818053603 817754507 816990256 816300392 815907121 815312147
3069.6H15312147j224339j655757j235664K25901J689256J981556J243413L09407k74896
$$ 815312147 814087808 812432051 811196387 811422288 813111544 815093100 816336513 816645920 816371024
3088H16371024n78642r23693j157165j078188r39548r68278r85086o41048p7963R3580
$$ 816371024 815792382 814868689 813711524 812633336 811693788 810725510 809740424 809099376 809021413 809114993
3108.4H09114993k79367n53489m71652n07176p49170j010955j168132j056730q00610
$$ 809114993 808835626 808282137 807810485 807303309 806554139 805543184 804375052 803318322 802517712
3126.7H02517712p01487q76844j074850j023174q36134q31902j108885j318752j305700
$$ 802517712 801816225 800939381 799864531 798841357 798005223 797173321 796064436 794745684 793439984
3145.1G93439984j269936j146853r98080j218736j631975j686931j427710j200855
$$ 793439984 792170048 791023195 790025115 788806379 787174404 785487473 784059763 782858908
3161.4G82858908j156866j244724j315296j330852j325906j330435j350939j387716
$$ 782858908 781702042 780457318 779142022 777811170 776485264 775154829 773803890 772416174
3177.7G72416174j422822j414955j378357j373708j420260j479387j495242j461268
$$ 772416174 770993352 769578397 768200040 766826332 765406072 763926685 762431443 760970175
3194G60970175j445830j455485j459241j459480j423835j350642j304209j299262j281738
$$ 760970175 759524345 758068860 756609619 755150139 753726304 752375662 751071453 749772191 748490453
3212.4G48490453j235485j251936j361490j464009j529038j567066j535415j450658
$$ 748490453 747254968 746003032 744641542 743177533 741648495 740081429 738546014 737095356
3228.7G37095356j347721j323521j516521j674711j543344j377940j288771j156986
$$ 737095356 735747635 734424114 732907593 731232882 729689538 728311598 727022827 725865841
3245G25865841j153171j334489j386404j223743j112103j162529j167715j096963j111508
$$ 725865841 724712670 723378181 721991777 720768034 719655931 718493402 717325687 716228724 715117216
3263.4G15117216j102805q90970o38306p54059j104176j261592j270532j200021j067578
$$ 715117216 714014411 713123441 712485135 711731076 710626900 709365308 708094776 706894755 705827177
3281.7G05827177j027346j100183j106321r24290q08656r87887j303077j543403j482665
$$ 705827177 704799831 703699648 702593327 701669037 700860381 699872494 698569417 697026014 695543349
3300.1F95543349j078427p34091q84056j430452j824796j793265j565040j437306j446366
$$ 695543349 694464922 693730831 692846775 691416323 689591527 687798262 686233222 684795916 683349550
3318.4F83349550j493395j450121j352906j484931j753390j811921j697838j494110
$$ 683349550 681856155 680406034 679053128 677568197 675814807 674002886 672305048 670810938
3334.8F70810938j296997j455426j814902j959443j967609j823604j581312j744091
$$ 670810938 669513941 668058515 666243613 664284170 662316561 660492957 658911645 657167554
3351.1F57167554k215743k308488j985192j765550j886606k012133j790762j570046
$$ 657167554 654951811 652643323 650658131 648892581 647005975 644993842 643203080 641633034
3367.4F41633034j803398k262712k335668j971662j657903j516461j447022j402140
$$ 641633034 639829636 637566924 635231256 633259594 631601691 630085230 628638208 627236068
3383.7F27236068j299381j016736o45042o54459j052618j162111p48933m31776p30097
$$ 627236068 625936687 624919951 624274909 623620450 622567832 621405721 620656788 620225012 619494915
3402.1F19494915j154244j026988o93738o75977q54551j066268j220644j068353n68211
$$ 619494915 618340671 617313683 616619945 615943968 615089417 614023149 612802505 611734152 611165941
3420.4F11165941P2121O76752J057505J114071R59217Q50916R11951R70244Q95262
$$ 611165941 611238062 611914814 612972319 614086390 615045607 615896523 616808474 617778718 618673980
3438.8F18673980R08911J104653J272560J393497J449525J436353J473903J524568
$$ 618673980 619582891 620687544 621960104 623353601 624803126 626239479 627713382 629237950
3455.1F29237950J514733J488208J469911J540899J770317J931191J719832J378715
$$ 629237950 630752683 632240891 633710802 635251701 637022018 638953209 640673041 642051756
3471.4F42051756J430929J753271K013206K051234J857102J770914J908421J941979
$$ 642051756 643482685 645235956 647249162 649300396 651157498 652928412 654836833 656778812
3487.7F56778812J876831J947284K093911K205849K143502K057135K145589K046883
$$ 656778812 658655643 660602927 662696838 664902687 667046189 669103324 671248913 673295796
3504F73295796J774907J881421K262950K465009K315700K054632K047062K247333K451182
$$ 673295796 675070703 676952124 679215074 681680083 683995783 686050415 688097477 690344810 692795992
3522.4F92795992K342760K038599K061963K231478K284348K416551K430320K206326
$$ 692795992 695138752 697177351 699239314 701470792 703755140 706171691 708602011 710808337
3538.7G10808337K255916K526164K533675K189993J920462K027393K215445K210259
$$ 710808337 713064253 715590417 718124092 720314085 722234547 724261940 726477385 728687644
3555G28687644K190530K320230K343417K084434K110302K763867K898932K354801K214551
$$ 728687644 730878174 733198404 735541821 737626255 739736557 742500424 745399356 747754157 749968708
3573.4G49968708K466797K657652K760887K780140K648353K602995K791524K749502
$$ 749968708 752435505 755093157 757854044 760634184 763282537 765885532 768677056 771426558
3589.7G71426558K451897K473653K669811K682328K582967K463937K301693K245963
$$ 771426558 773878455 776352108 779021919 781704247 784287214 786751151 789052844 791298807
3606G91298807K515137K671242K560854K454280K144337K214790K625525K184808J404106
$$ 791298807 793813944 796485186 799046040 801500320 803644657 805859447 808484972 810669780 812073886
3624.4H12073886J172305J990258K607763J873553J471877J437724J334309J240134
$$ 812073886 813246191 815236449 817844212 819717765 821189642 822627366 823961675 825201809
3640.7H25201809J040340O90520O64949J460314J761138P83980M42505J003981J050055
$$ 825201809 826242149 826932669 827597618 829057932 830819070 831603050 832045555 833049536 834099591
3659H34099591N35369K47001J02640q0884J15216M41134J22666J26362L76523J85310
$$ 834099591 834634960 834881961 834984601 834903717 835018933 835460067 835582733 835709095 836085618 836270928
3679.4H36270928J63019K19286K47955O06000R65178O91116M24862L19600Q0764j0550
$$ 836270928 836433947 836653233 836901188 837507188 838472366 839163482 839588344 839907944 839988708 839978158
3699.8H39978158K67327L51191M6432j44541q464M25875M68433Q0824j64390j67906
$$ 839978158 840245485 840596676 840643108 840498567 840490103 840915978 841384411 841465235 841300845 841132939
3720.2H41132939n7280L8385J28508J0073j93715p0572L74496P40349M03405m46320
$$ 841132939 841075659 841114044 841242552 841252625 841058910 840988338 841362834 842103183 842506588 842060268
3740.6H42060268p91550j22905J48833k55525J34289O10888K22922j12951L0339J48237
$$ 842060268 841268718 841145813 841294646 841039121 841173410 841784298 842007220 841894269 841924608 842072845
3761H42072845n8055j32978p1288O0380J92106P331j77324n3107J71363L8803j96875
$$ 842072845 842014790 841881812 841810524 841870904 842063010 842070341 841893017 841839910 842011273 842050076 841853201
3783.5H41853201j32739m4763j4544l5286j00255j430o9916l01004k8551N1678j07408
$$ 841853201 841720462 841675699 841661155 841625869 841525614 841524184 841454268 841153264 841124713 841176391 841068983
3805.9H41068983J58608J13547k52962l41654q2672j44064k41280J55270J35184p808
$$ 841068983 841227591 841341138 841088176 840746522 840663850 840519786 840278506 840433776 840568960 840561152
3826.3H40561152n7161k26558j92105l8922M8458J37031R6500L0101M5240j53780n30184
$$ 840561152 840503991 840277433 840085328 840046406 840094864 840231895 840328395 840358496 840403736 840249956 839719772
3848.7H39719772p24017k01524O00517K07126l12805m35233l27051j23202j98126j74046
$$ 839719772 838995755 838794231 839394748 839601874 839289069 838853836 838526785 838403583 838205457 838031411
3869.1H38031411J52052J91211M1366k29597k13444J47104J08302k6167k46704m60386
$$ 838031411 838183463 838374674 838416040 838186443 837972999 838120103 838228405 838202238 837955534 837495148
3889.5H37495148j39355N3107k64287m45485k94924m4405J51276J43827q8692j64092
$$ 837495148 837355793 837408900 837144613 836699128 836404204 836359799 836511075 836654902 836566210 836402118
3909.9H36402118p2121j11342q9288J27852J63913J6153L3915J24931K3842o854K10404
$$ 836402118 836329997 836218655 836129367 836257219 836421132 836437285 836471200 836596131 836619973 836613119 836823523
3932.3H36823523K40624J7643j19627j22904m0591l1948j01030m6611N305p0810j17064
$$ 836823523 837064147 837081790 836962163 836839259 836798668 836766720 836665690 836619079 836624384 836553574 836436510
3954.8H36436510o1273l4035q7976j44303j43766o7533L1174P0095J9669n6624o4671
$$ 836436510 836375237 836341202 836253226 836108923 835965157 835897624 835928798 835998893 836018562 835961938 835897267
3977.2H35897267j7107N3168N1975r2208j41860j9013L8385K1756J7047m18
$$ 835897267 835880160 835933328 835985303 835893095 835751235 835732222 835770607 835792363 835809410 835808992
3997.6H35808992
$$ 835808992
##END=$$ End of the data block
