##TITLE=$$ Begin of the data block
##JCAMP-DX=5.00 $$ ACD/SpecManager v 10.08
##SPECTROMETER/DATA SYSTEM=16PC
##DATE=Thu Sep 12 15:20:48 2013
##DATA TYPE=INFRARED SPECTRUM
##DATA CLASS=XYDATA
##ORIGIN=
##OWNER=
##NPOINTS=3601
##FIRSTX=400.00000000
##LASTX=4000.00000000
##MAXX=4000.00000000
##MINX=400.00000000
##MAXY=38.28635025
##MINY=14.59731102
##XFACTOR=1.0000000000
##YFACTOR=0.000000100000000
##FIRSTY=17.06461334
##DELTAX=1.00000000
##XUNITS=1/CM
##YUNITS=TRANSMITTANCE
##XYDATA=(X++(Y..Y))
400A70646133M1181927L1584625K0269108J0665055M663009K249241K186794L089199
408B86535091M131184N062523N768738N910167M998665K821446k00215l090458m841632
417C07095509n022126m023552k768478k093315k241364k796688l053779k523594j219445
426B81353168M26484J891098K857856L290310L291245K921429K148323R57775m90551
435B98647137j824074k598782k538871j708756m96483N87673J169548J169377P79629
444B93186398L01265m2286j95064k29149k30923k14576j30673M6768K34127K43130
454B92969017j03855q18501j667041k249012k210236j464748k78263Q57639J495056
463B86530056J479301J020375N42812M11224P09630J206760J520424J364612P23629
$$ y = [170646133, 211828060, 243412685, 263681793, 274346848, 279009857, 281259098, 283445892, 286535091, 290666275, 295728798, 301497536, 307407703, 312406368, 315227814, 315027599, 311937141, 307095509, 302073383, 298049831, 295281353, 293188038, 290946674, 288149986, 285096207, 282572613, 281353168, 281779652, 283670750, 286528606, 289818916, 293110161, 296031590, 298179913, 299137688, 298647137, 296823063, 294224281, 291685410, 289976654, 289480171, 290067844, 291237392, 292406769, 293186398, 293487663, 293445377, 293250313, 293021164, 292790241, 292575665, 292444992, 292491760, 292725887, 292969017, 292865162, 292046661, 290379620, 288130608, 285920372, 284455624, 284177361, 285035000, 286530056, 288009357, 289029732, 289572544, 289983768, 290693398, 291900158, 293420582, 294785194, 295508823]
472B95508823j41372q36659j034832o15520L03554J431809K418537K963753K904625
481C02902718K263546J244964J69811o42814j003208r23520n93318k65999j19610j74484
491C02858086l07522l51677k10438P8869L65601M70409K83146j74484p46441j200505
501C01065044j320705j004028l19138N01957J151619J381588J124268N30719j04751
510C03006573m99401n30510k91310j8882N8689j36547m90227p70283p67822m15344
520B99144936J82628Q10890J249791J364574J140652O68049J01032l85475o37436n65968
530C03073673j89037L54347Q40225J051407Q85163M18415j19362m62322m53473j35078
540C05263958K74658N07031L98616j8730n44510r35535j048107r10568o87466n66406
$$ y = [295508823, 295367451, 294530792, 293495960, 292880440, 293183994, 294615803, 297034340, 299998093, 302902718, 305166264, 306411228, 306581039, 305938225, 304935017, 304011497, 303418179, 303152180, 303032570, 302858086, 302550564, 302198887, 301988449, 302067318, 302432919, 302903328, 303186474, 303011990, 302265549, 301065044, 299744339, 298740311, 298421173, 298923130, 300074749, 301456337, 302580605, 303111324, 303006573, 302507172, 301976662, 301685352, 301666470, 301725159, 301588612, 301098385, 300328102, 299560280, 299144936, 299327564, 300138454, 301388245, 302752819, 303893471, 304561520, 304662552, 304277077, 303639641, 303073673, 302884636, 303238983, 304079208, 305130615, 306015778, 306434193, 306314831, 305852509, 305399036, 305263958, 305538616, 306045647, 306444263, 306425533, 305881023, 304945488, 303897381, 302986813, 302299347, 301732941]
550C01732941o43807q82873j155396j332226j355209j249485j083088r12990p61319
559B92356548o29253n27096m84657n30358o56356q02727q81157q25958o38924l96480
569B85983582k12536j81561l35560o34021r88541j300812j495552j540298j450177
578B77844524j279544j098652r59244q62026p47032n22652j22452M40865J064605J601944
588B75360336J940747K062759K040653J973744J904049J778640J488362R61628K48489
597B89759407m66766r39541r85756n72205J72749J032143J805343K382565K752437
606B94940376K956372L029441K974225K774276K430363J983852J509896J085930P60917
615C14445648N43328M12845L41663L06740K90852K77367K52647K16808J92833K19155
$$ y = [301732941, 301089134, 300206261, 299050865, 297718639, 296363430, 295113945, 294030857, 293117867, 292356548, 291727295, 291200199, 290715542, 290185184, 289528828, 288726101, 287844944, 287018986, 286380062, 285983582, 285771046, 285589485, 285253925, 284619904, 283631363, 282330551, 280834999, 279294701, 277844524, 276564980, 275466328, 274507084, 273645058, 272898026, 272375374, 272252922, 272693787, 273758392, 275360336, 277301083, 279363842, 281404495, 283378239, 285282288, 287060928, 288549290, 289510918, 289759407, 289292641, 288353100, 287367344, 286795139, 286967888, 288000031, 289805374, 292187939, 294940376, 297896748, 300926189, 303900414, 306674690, 309105053, 311088905, 312598801, 313684731, 314445648, 314988976, 315401821, 315743484, 316050224, 316341076, 316618443, 316871090, 317087898, 317280731, 317499886]
625C17499886L23600M91982O59351P37839O70757M78630K58789J30959J56250K85759
635C21693802L79295K91710k6588m83933q90922j075001r86366p29943m97074m43630
645C17231350n96180q43086j011391r70707o95667k59667K19403O28261Q75817Q93039
655C15471172O50025K02160k70081m91562k21233N71880J603279K344055K275467J201363
665C23336525n74608k341080l320121l073712j737003N9204J534290K162037J902886
674C17948418J145095M21372R0980J77556M32987N50918L76892j3504l94096n49660
684C20186958m05712n8327L01266N01328M75273K76527L1929j32179j47858k7313J55296
695C21157188L03650L43247K50091N6649j66359l40004m09928l65829k44370j13563
$$ y = [317499886, 317823486, 318315468, 318974819, 319712658, 320383415, 320862045, 321120834, 321251793, 321408043, 321693802, 322073097, 322364807, 322338219, 321854286, 320963364, 319888363, 318901997, 318172054, 317674980, 317231350, 316635170, 315792084, 314780693, 313809986, 313114319, 312854652, 313074055, 313702316, 314578133, 315471172, 316121197, 316323357, 316053276, 315561714, 315340481, 315912361, 317515640, 319859695, 322135162, 323336525, 322761917, 320420837, 317100716, 314027004, 312290001, 312349205, 313883495, 316045532, 317948418, 319093513, 319514885, 319605865, 319783421, 320216408, 320767326, 321144218, 321130714, 320736618, 320186958, 319781246, 319722919, 320024185, 320525513, 321000786, 321277313, 321309242, 321177063, 321029205, 321001892, 321157188, 321460838, 321804085, 322054176, 322110825, 321944466, 321604462, 321194534, 320828705, 320584335, 320470772]
705C20470772m2076o6872j68304k68631k60239n8517L45001Q58726J319199J564178
715C23693237J516686J230507Q67729O16188N92079P82852J062699J267204J282272
724C32911453J096535P94525N02129L21006K85416L58658M60968N12009M69474L49808
734C38061981K24037J85357K98271N52025Q46786J029930R74732O58836J96419k06642
744C42821732l57285j80511K31742O66314Q99658Q15048M57916L395l42178m45137
754C44570694k99187r994K73018M32624M28772K98500J21537k2469q4801n8746K5520
765C45675468J14098J46256P4272j16082l90625o68220q45032q36754o22406k64244
775C42266731J10054L60298L98179K28385n2681l04069m06494l14980p2670K16675
$$ y = [320470772, 320428696, 320361824, 320193520, 319924889, 319664650, 319606133, 319951134, 320809860, 322129059, 323693237, 325209923, 326440430, 327308159, 327924347, 328516426, 329299278, 330361977, 331629181, 332911453, 334007988, 334802513, 335304642, 335625648, 335911064, 336269722, 336730690, 337242699, 337712173, 338061981, 338286018, 338471375, 338769646, 339321671, 340168457, 341198387, 342173119, 342831955, 343028374, 342821732, 342464447, 342283936, 342515678, 343181992, 344081650, 344896698, 345354614, 345358009, 345015831, 344570694, 344271507, 344261513, 344534531, 344967155, 345395927, 345694427, 345815964, 345793495, 345708694, 345649948, 345675468, 345789566, 345935822, 346010094, 345894012, 345503387, 344835167, 343990135, 343153381, 342530975, 342266731, 342376785, 342737083, 343135262, 343363647, 343310966, 343006897, 342600403, 342285423, 342212753, 342429428]
785C42429428M39377N17960M33807K22092n3139l28293n62096p44514q91266j025848
795C40437508j158677j270637j317101j249771j052398p66144m86145l25508l61367
804C32449760n92804r36698j264420j459465j463051j285171r79767o01959j80550
813C23685875K84233P97005J338005J848717K245101K449837K430725K222596J921653
822C39223747J650086J506347J519318J634331J738205J717872J525345J211929R10149
831C52637329P66754Q60749J151390J489486J688385J619301J278191P85789L22266
840C62599640K8992o4621n1880r1172l11241p33490j253128j689605j880570j765938
850C54786987j421623j019478p40585o84624q24661j028175j131020j020813o88896
$$ y = [342429428, 342868805, 343386765, 343820572, 344042664, 343989525, 343661232, 343099136, 342354622, 341463356, 340437508, 339278831, 338008194, 336691093, 335441322, 334388924, 333622780, 333136635, 332811127, 332449760, 331856956, 330920258, 329655838, 328196373, 326733322, 325448151, 324468384, 323866425, 323685875, 323970108, 324767113, 326105118, 327953835, 330198936, 332648773, 335079498, 337302094, 339223747, 340873833, 342380180, 343899498, 345533829, 347272034, 348989906, 350515251, 351727180, 352637329, 353404083, 354264832, 355416222, 356905708, 358594093, 360213394, 361491585, 362277374, 362599640, 362628632, 362564011, 362512131, 362420959, 362109718, 361376228, 360123100, 358433495, 356552925, 354786987, 353365364, 352345886, 351605301, 350920677, 350096016, 349067841, 347936821, 346916008, 346227112]
859C46227112k25601K31361N65720P31353P62711P48558P85637R36623J205482J535110
869C53504066J827431J976471J907730J609802J148377O48498K52381O4621J12114
878C63051491L35159O19087Q47702R55048R48791Q95386Q75511R36852J064949J188278
888C71718254J215401J080856P83272L91731K0638k16141k53639j00441J65405M31671
898C75237007N97115O11000M85878K84347Q6060m7188r4643p7171m1618l4142p6599
909C76930046j56631k33727k58789j99127n6725J27602K89650L66669L24554J71738
919C77305260m6006k67906m44641n57251o17790o53610o85082p10106p05566o44455
929C71972847n18341l52326k00767j24893j61362l00445m84391o32171o77414o01120
$$ y = [346227112, 346001511, 346232872, 346798592, 347529945, 348292656, 349041214, 349826851, 350763474, 351968956, 353504066, 355331497, 357307968, 359215698, 360825500, 361973877, 362622375, 362874756, 362939377, 363051491, 363386650, 364005737, 364853439, 365808487, 366757278, 367652664, 368528175, 369465027, 370529976, 371718254, 372933655, 374014511, 374797783, 375189514, 375210152, 374994011, 374740372, 374639931, 374805336, 375237007, 375834122, 376445122, 376931000, 377215347, 377301407, 377254219, 377159576, 377082405, 377040787, 377006645, 376930046, 376773415, 376539688, 376280899, 376081772, 376025047, 376152649, 376442299, 376808968, 377133522, 377305260, 377259254, 376991348, 376546707, 375989456, 375371666, 374718056, 374032974, 373322868, 372617302, 371972847, 371454506, 371102180, 370901413, 370776520, 370615158, 370314713, 369830322, 369198151, 368520737, 367919617]
939C67919617m40102k66304j46789j07003j19972j29585r2392j3504M9629K0714j40877
950C66533432m02069o57120p76443o76842l71857K4071L47443M63523L29896J3198
960C64827232l48243o11039o90307n87807l78189j65367l4142j9111r9221k16484l07121
971C61370201l31421k92167k32697k16866k95982m79507p23534r46197j064606j036225
981C55750999q82339o79512n25551m94995o08101q26721j076622j279678j384392j381150
991C46611938j302719j211662j178627j254692j446075j705590j953277k127152k243194
1000C32188950k421532k844353l646354m776669n921326o549167o099949m244519j093616
1009B94591465K760983O418666Q990879R928246R205055P282181M879150K676621J088257
$$ y = [367919617, 367479515, 367213211, 367066422, 366959419, 366839447, 366709862, 366617470, 366603966, 366653595, 366674309, 366533432, 366131363, 365474243, 364697800, 364020958, 363649101, 363673172, 364020615, 364484138, 364814034, 364827232, 364478989, 363867950, 363177643, 362589836, 362211647, 362046280, 362012138, 361993027, 361893806, 361677322, 361370201, 361038780, 360746613, 360513916, 360297050, 360001068, 359521561, 358798027, 357851830, 356787224, 355750999, 354868660, 354189148, 353663597, 353168602, 352560501, 351733780, 350657158, 349377480, 347993088, 346611938, 345309219, 344097557, 342918930, 341664238, 340218163, 338512573, 336559296, 334432144, 332188950, 329767418, 326923065, 323276711, 318500042, 312578716, 306029549, 299929600, 295685081, 294591465, 297352448, 303771114, 312761993, 322690239, 331895294, 339177475, 344056625, 346733246, 347821503]
1018C47821503J88675k03629l61786n01594p11327r63707j178436j284371j254158
1027C41551170j107978q99964p00683n77126n74188o95954q98399j101112j218186
1036C33777580j196022j039848q12454o04821m94690n11627o27136p72209q72002q80699
1046C25966072q00552o77643n78194n55839o26297p61185r02405r91325r96666r28154
1056C18147812q28247p49150p27043p69062q58020r70250j093254j232662j402454
1065C09517670j606293j820545j989594k038326j894493j513710q95901q8730Q20542
1074B98490620J720314K492656L031311L260251L150062K730122K086830J346397O40564
1083C18949127O8932l26958n66540p08542q16669r31301j058750j180497j270122j306400
$$ y = [347821503, 348010178, 347806549, 347444763, 346943169, 346231842, 345268135, 344089699, 342805328, 341551170, 340443192, 339543228, 338842545, 338265419, 337691231, 336995277, 336096878, 334995766, 333777580, 332581558, 331541710, 330729256, 330124435, 329629745, 329118118, 328490982, 327718773, 326846771, 325966072, 325165520, 324487877, 323909683, 323353844, 322727547, 321966362, 321063957, 320072632, 319075966, 318147812, 317319565, 316570415, 315843372, 315074310, 314216290, 313246040, 312152786, 310920124, 309517670, 307911377, 306090832, 304101238, 302062912, 300168419, 298654709, 297758808, 297670078, 298490620, 300210934, 302703590, 305734901, 308995152, 312145214, 314875336, 316962166, 318308563, 318949127, 319018059, 318691101, 318124561, 317416019, 316599350, 315668049, 314609299, 313428802, 312158680, 310852280]
1093C10852280j276665j174507j000252p67384n09109k75536j14860m8542n5103p8373
1103C05551949n7812L4046J72558K92320L24822K38418N8708j44558k93254l39680
1113C05837517k85874j77784p9765m5452r8686k30084m07848n93357p55921q81118
1123C02281628r69715j031075j072483j091862j077041j011334q82835o93341m59060
1132B93992882k08092K8305K22969L60451M40273M76608M93603N15557N55229O08139
1142B97485924O56147O80618O78043O65970O75202P29866Q29830R47266J041164J081486
1152C05471516J067619J028557J005249J026363J092205J174946J233521J232776J157685
1161C15490437J017341Q40149O65379N31749M66366M75559N41249O26297O88629O98280
$$ y = [310852280, 309575615, 308401108, 307400856, 306633472, 306124363, 305848827, 305733967, 305685425, 305630322, 305551949, 305494137, 305528183, 305700741, 305993061, 306317883, 306556301, 306615009, 306470451, 306177197, 305837517, 305551643, 305373859, 305294094, 305248642, 305149956, 304919872, 304512024, 303918667, 303162746, 302281628, 301311913, 300280838, 299208355, 298116493, 297039452, 296028118, 295145283, 294451942, 293992882, 293784790, 293813095, 294036064, 294396515, 294836788, 295313396, 295806999, 296322556, 296877785, 297485924, 298142071, 298822689, 299500732, 300166702, 300841904, 301571770, 302401600, 303348866, 304390030, 305471516, 306539135, 307567692, 308572941, 309599304, 310691509, 311866455, 313099976, 314332752, 315490437, 316507778, 317347927, 318013306, 318545055, 319011421, 319486980, 320028229, 320654526, 321343155, 322041435]
1171C22041435O50177N64156M75769M19578M17138M70619N64880O73943P68470Q24471
1181C27870636Q29773P86591P09877O17752N21965M20761L02925J57776j2741j90316
1191C32014999l48091m64554n34668n71403n96733o28548o71310p14951p38983p18956
1201C26026802o33354m69360k31171N4054L38059N64041O87103O93092O02150M55551
1211C28086967K89803J18370o9580k91100n45654q03604j015663j139069j162910j116028
1221C22351532j051216j015930j026364j060486j071987j017303q79193o75640m51793
1230C14101620k59304j35918r1572j08223j50051j78795j68628j12153j8119R8419
1240C12977276K25544L60489N07183O68430Q39157J004238J143151J237831J279506
$$ y = [322041435, 322691612, 323255768, 323731537, 324151115, 324568253, 325038872, 325603752, 326277695, 327046165, 327870636, 328700409, 329487000, 330196877, 330814629, 331336594, 331757355, 332060280, 332218056, 332205315, 332014999, 331666908, 331202354, 330667686, 330096283, 329499550, 328871002, 328199692, 327484741, 326745758, 326026802, 325393448, 324924088, 324692917, 324746971, 325085030, 325649071, 326336174, 327029266, 327631416, 328086967, 328376770, 328495140, 328425560, 328134460, 327588806, 326785202, 325769539, 324630470, 323467560, 322351532, 321300316, 320284386, 319258022, 318197536, 317125549, 316108246, 315229053, 314553413, 314101620, 313842316, 313706398, 313614826, 313506603, 313356552, 313177757, 313009129, 312896976, 312878857, 312977276, 313202820, 313563309, 314070492, 314738922, 315578079, 316582317, 317725468, 318963299, 320242805]
1249C20242805J269150J213074J118393R88884Q27064O38466M33159K25296K9946j40915
1259C26845322k77672l71971m15001m00238l30353k21710j03684q354M3945N4703M5281
1270C24860268M3182O4240J02043J33247J35155J03073N6724K9183M4365R9754J64147
1281C25835381J93939J57432N3330q7929k19192l00026l14675k78244k27928k06223
1291C24605865k41699l36303m62075n70793o13556n63621m32244k68211j38512r8571
1301C20880280j65673l09906m69265n79052o01558n40657m34800l33805k73151k58484
1311C16913929k65808k55966j94264o7596J10416L02468M60987N44471N31083M26483
1321C18506203K61669Q2359o6395j56421j84212j67923j34182j01013o9676l2119Q793
$$ y = [320242805, 321511955, 322725029, 323843422, 324832306, 325659370, 326297836, 326730995, 326956291, 326986237, 326845322, 326567650, 326195679, 325780678, 325380440, 325050087, 324828377, 324724693, 324716339, 324760284, 324814987, 324860268, 324903450, 324967690, 325069733, 325202980, 325338135, 325441208, 325497932, 325527115, 325571480, 325671234, 325835381, 326029320, 326186752, 326240082, 326152153, 325932961, 325632935, 325318260, 325040016, 324812088, 324605865, 324364166, 324027863, 323565788, 322994995, 322381439, 321817818, 321385574, 321117363, 320978851, 320880280, 320714607, 320404701, 319935436, 319356384, 318754826, 318214169, 317779369, 317445564, 317172413, 316913929, 316648121, 316392155, 316197891, 316130295, 316240711, 316543179, 317004166, 317548637, 318079720, 318506203, 318767872, 318850231, 318783836, 318627415, 318443203, 318275280, 318141098, 318040085, 317970409, 317938290, 317947083]
1332C17947083J9168o3858l02562p08886j209716j655083j879406j788235j417961
1341C08940544r28192n22480l43399m06208o11744q27847r76924j071167j171246j308479
1351C00772858j435547j450787j280098r55963o26221m78553o26622j033802j524830
1360B91360435j876182j925774j637954j096878m50230J52473N98812Q26626Q29964
1369B86781292O64921M43096K98996L33309N64823R25141J306915J634140J899776
1378B94852409K141228K373562K537632K518043K228642J705761J132984P61032P61242
1387C11012535J106281J555863J770954J491241O79245m48646j515122k150116k146091
1396C11356144j534843n55516M59309J225567J610756J654300J503392J306133J129093
$$ y = [317947083, 317966251, 317902393, 317599831, 316890945, 315681229, 314026146, 312146740, 310358505, 308940544, 308012352, 307489872, 307146473, 306740265, 306128521, 305300674, 304323750, 303252583, 302081337, 300772858, 299337311, 297886524, 296606426, 295650463, 295024242, 294545689, 293919067, 292885265, 291360435, 289484253, 287558479, 285920525, 284823647, 284373417, 284525890, 285124702, 285951328, 286781292, 287446213, 287889309, 288188305, 288521614, 289086437, 290011578, 291318493, 292952633, 294852409, 296993637, 299367199, 301904831, 304422874, 306651516, 308357277, 309490261, 310251293, 311012535, 312118816, 313674679, 315445633, 316936874, 317616119, 317167473, 315652351, 313502235, 311356144, 309821301, 309265785, 309725094, 310950661, 312561417, 314215717, 315719109, 317025242, 318154335]
1405C18154335R50050P23610M65966K81372K97203N42793Q65478R64318N46684m78630
1415C23313179j898651l261566m083824m086342l323498k145748j026631l55453k94418
1424C02837048p46098j423149j979637k158871j911220j433087j090088j234474j992931
1433B88867493l147583m204159m635296m167881k938881j417198j43223N42774O17104
1442B69373150K87323j86730o14032q58326p61757j44806J049175K558575L757419
1451B74459991L898545K565422N2376k634201m240532l963356j948891P50046K766666
1460B71706066L209610K155762N42431m62399k00863J087818K455731K860889J809826
1469B85164871l63369k713775m234696m394264l361092j835136o21529k09484n75619
$$ y = [318154335, 319104385, 319827995, 320293961, 320575333, 320872536, 321415329, 322280807, 323245125, 323791809, 323313179, 321414528, 318152962, 314069138, 309982796, 306659298, 304513550, 303486919, 303131466, 302837048, 302090950, 300667801, 298688164, 296529293, 294618073, 293184986, 292094898, 290860424, 288867493, 285719910, 281515751, 276880455, 272712574, 269773693, 268356495, 268213272, 268756046, 269373150, 269660473, 269473743, 268859711, 268001385, 267239628, 267094822, 268143997, 270702572, 274459991, 278358536, 280923958, 280976334, 278342133, 274101601, 270138245, 268189354, 268939400, 271706066, 274915676, 277071438, 277613869, 277151470, 276950607, 278038425, 280494156, 283355045, 285164871, 284801502, 282087727, 277853031, 273458767, 270097675, 268262539, 267641010, 267431526, 266855907]
1478B66855907j282615j781216j729755j161042m24060N1593K8859l77217p42702n64804
1488B58872948M35733K100125L829460M824162M471721K701988J17989k203999l193607
1497B71956520k336407j1406K600079M042091L315487M32396l525791o910915q319035
1506B61243019p271709m395714j025429J516972K538547K161637J048107r5501q98304
1515B54821625j389179j795426k278938k809639l221150l350334l129387k580738j770820
1524B32496014q01049J55907Q46615J028786O43825n9738n90801m90914L36705J475753
1534B35041103K170582J755409Q3256k320823m490414n500221m920674k997780m90436
1543B18330002J709823K965718L112716K455197J580677J084404J298160K118225L009854
$$ y = [266855907, 265573292, 263792076, 262062321, 260901279, 260477219, 260528812, 260557671, 260180454, 259437752, 258872948, 259308681, 261408806, 265238266, 270062428, 274534149, 277236137, 277354126, 275150127, 271956520, 269620113, 269608707, 272208786, 276250877, 279566364, 279998760, 276472969, 269562054, 261243019, 253971310, 249575596, 248550167, 250067139, 252605686, 254767323, 255815430, 255719929, 254821625, 253432446, 251637020, 249358082, 246548443, 243327293, 239976959, 236847572, 234266834, 232496014, 231694965, 231850872, 232697487, 233726273, 234370098, 234310360, 233719559, 233228645, 233565350, 235041103, 237211685, 238967094, 239050350, 236729527, 232239113, 226738892, 221818218, 218820438, 218330002, 220039825, 223005543, 226118259, 228573456, 230154133, 231238537, 232536697, 234654922, 237664776]
1552B37664776L226471K184028j73034l220234n847054o943950n950623l172378L23906
1561B18091908L191127M415112L749103J762333m92859k004528k251262j378975n0087
1570B25031872R31854J030083K18544j043587k082386k376575j825409p76139J92967
1579B19301224O02627L16009m33540j226025j714687j795006j598702j351852j218128
1588B10881920j228314j315860j398659j430912j403561j319179j185761j034641r27639
1597A99637394r27639j042824j200275j288491j248798j136303j083145j172180j323261
1606A89214478j302681q84991o3572Q57582J392422J166744J84288j127510k144108
1615A87292652k403774j868591r20716j08471J78109j01662o78024j172982j310157
$$ y = [237664776, 240891247, 243075275, 242902241, 239682007, 233834953, 226891003, 220940380, 217768002, 218091908, 221283035, 225698147, 229447250, 231209583, 230716724, 228712196, 226460934, 225081959, 225031872, 225963726, 226993809, 227212353, 226168766, 224086380, 221709805, 219884396, 219108257, 219301224, 219903851, 220219860, 219786320, 218560295, 216845608, 215050602, 213451900, 212100048, 210881920, 209653606, 208337746, 206939087, 205508175, 204104614, 202785435, 201599674, 200565033, 199637394, 198709755, 197666931, 196466656, 195178165, 193929367, 192793064, 191709919, 190537739, 189214478, 187911797, 187026806, 186963234, 187820816, 189213238, 190379982, 190564270, 189436760, 187292652, 184888878, 183020287, 182099571, 181991100, 182169209, 182067547, 181389523, 180216541, 178906384]
1624A78906384j006260l35884N54103J489449K258472K604351K286854J218300m04911
1633A87570858k087345l190613l214111k063446j54476J725540K754554K462712R76410
1642A84780083j017742k595082l063335k340737j026878r5081l45364j915779m143372
1651A68236713n889167o164894m705878k145481L24211J614256J326723p3185j590681
1660A50932617k311525j907578p40404M60301J099920J067257P23018N77956R11894
1669A50813456J599474K249288K532292K453937K367792K716103L676491M960537N917186
1678A79286556N894604M645100K524376L57418r59664q98399M63772K523060M481735
1687A98318558N731544O082077N732155N046082M295005L525219K616883J466198J56212
$$ y = [178906384, 177900124, 177564240, 178118343, 179607792, 181866264, 184470615, 186757469, 187975769, 187570858, 185483513, 182292900, 179078789, 177015343, 176860867, 178586407, 181340961, 183803673, 184780083, 183762341, 181167259, 178103924, 175763187, 174736309, 174641228, 174295864, 172380085, 168236713, 162347546, 156182652, 151476774, 149331293, 149655504, 151269760, 152596483, 152523298, 150932617, 148621092, 146713514, 145973110, 146433411, 147533331, 148600588, 149323606, 149901562, 150813456, 152412930, 154662218, 157194510, 159648447, 162016239, 164732342, 168408833, 173369370, 179286556, 185181160, 189826260, 192350636, 192708054, 191748390, 190849991, 191313763, 193836823, 198318558, 204050102, 210132179, 215864334, 220910416, 225205421, 228730640, 231347523, 232813721, 232969933]
1696B32969933j008625j632348j446590m84657Q97464K177544K919026K985858K602578
1705B39980183K223148K274227K907105L887996M689179M742527L732300J786365n32684
1714B65690346k437344l240375k650586r07154J315709L199882M146957M042111L282318
1723B72441864K537556K357349K831726L511658L661766K721405P09763j689167l443833
1732B85640087l735733k433739j87912J929074L022995K859192J934604J111222J055202
1741B91194992J835175K917881L536911L182220J904926K71054r72977j301517o45333
1750C01923332O38905K000389K969036L325977L114910K538147J826592J159000O52752
1759C20149040L96500M72946R31892J721573K625695L274421L266678K372513P08313
$$ y = [232969933, 231961308, 230328960, 228882370, 228397713, 229295177, 231472721, 234391747, 237377605, 239980183, 242203331, 244477558, 247384663, 251272659, 255961838, 260704365, 264436665, 266223030, 265690346, 263253002, 260012627, 257362041, 256454887, 257770596, 260970478, 265117435, 269159546, 272441864, 274979420, 277336769, 280168495, 283680153, 287341919, 290063324, 290773087, 289083920, 285640087, 281904354, 279470615, 279282703, 281211777, 284234772, 287093964, 289028568, 290139790, 291194992, 293030167, 295948048, 299484959, 302667179, 304572105, 304843159, 303870182, 302568665, 301923332, 302562237, 304562626, 307531662, 310857639, 313972549, 316510696, 318337288, 319496288, 320149040, 320545540, 321018486, 321950378, 323671951, 326297646, 329572067, 332838745, 335211258, 335919571]
1768C35919571j231918k748299l249054k540703r30672R27315K354241K948684K707749
1777C34156914J931190J011200K59552j44653j16348L63960J207886K149887K758827
1786C43578415K605019J522216k04353j889992k765503k393875r35554R13887K289505
1795C42719765K611847J868171N70565n57824r70192n42793M24919J413575J958160
1804C49496193J851005J197930L29742l71475o46553m61006R727M97856P98684Q71811
1814C53573914Q30955Q31680R44176J102181J166992J046791P73926M70695K34985
1823C60976295N0087j93939n72929j006012j256218j084633m48227M19693J134911
1832C58019028J421814J312751J123162J200790J623612K084922K072106J233864l19100
$$ y = [335919571, 334687653, 331939354, 328690300, 326149597, 325218925, 326146240, 328500481, 331449165, 334156914, 336088104, 337099304, 337358856, 337214203, 337097855, 337461815, 338669701, 340819588, 343578415, 346183434, 347705650, 347501297, 345611305, 342845802, 340451927, 339516373, 340430260, 342719765, 345331612, 347199783, 347770348, 347212524, 346242332, 345699539, 346124458, 347538033, 349496193, 351347198, 352545128, 352874870, 352503395, 351856842, 351395836, 351405563, 351903419, 352702103, 353573914, 354404869, 355236549, 356180725, 357282906, 358449898, 359496689, 360270615, 360741310, 360976295, 361026382, 360832443, 360259514, 359253502, 357997284, 356912651, 356464424, 356884117, 358019028, 359440842, 360753593, 361876755, 363077545, 364701157, 366786079, 368858185, 370092049, 369772949]
1841C69772949k002983l067627l025474j928788l21807J083984J798286J761513J283035
1850C65353088P85294N40657N57785O52428O21757L98140R4528o9198R4223O11992
1860C69640694J297302J804848J782417J056366k37618j664848k665481k819672k064018
1869C66129990p31507O17714J482239J654129J272049O80351K05002m425J3733J39656
1879C71458931K85492M28505N60722O25115N22079J90468l05176p69653r82590q45032
1889C71168861m58717o7635J02768p133k61231m37278l89443j43661J40114K97737
1899C69944382K79808J66168P7591O4468O8512j0223k00119l98445m23889j51673L71018
1910C69787598R20334J215591J088066N84564o1378n67055p55806o31676l40385n7716
$$ y = [369772949, 367769966, 364702339, 361676865, 359748077, 359426270, 360510254, 362308540, 364070053, 365353088, 366138382, 366679039, 367236824, 367889252, 368511009, 368909149, 369003677, 368934479, 369028702, 369640694, 370937996, 372742844, 374525261, 375581627, 375344009, 373679161, 371013680, 368194008, 366129990, 365398483, 366016197, 367498436, 369152565, 370424614, 371104965, 371309967, 371305542, 371319275, 371458931, 371744423, 372172928, 372733650, 373358765, 373880844, 374071312, 373766136, 372996483, 372013893, 371168861, 370710144, 370642509, 370745277, 370738144, 370476913, 370039635, 369650192, 369506531, 369646645, 369944382, 370224190, 370390358, 370467949, 370532417, 370600929, 370590706, 370390587, 369992142, 369568253, 369416580, 369787598, 370707932, 371923523, 373011589, 373596153, 373534775, 372967720, 372211914, 371580238, 371239853, 371182137]
1920C71182137J14860J83640K23083L02391M35295N76363O57120O28166M85611K74315
1930C75062981P0839m0360J564K01492M90342P35778P91665N70144R9220m71305r28650
1941C76583710j095467r14040m72068M4594M44030O11191N44434L30047Q2588j11427
1951C76047592k20451k56844k47383k07672j35498k3880J18904K57530L36952L05443
1961C75974693J45798j07841l73841n54962n81818m46052k05650M3792K15569K72674
1971C74382362K39258J77384J46904J69143K18239K42386J99814Q9569m3526j31111
1981C75690422j19095l280J60331K75116K50511N1728k71988n98755p87735p46079
1991C73901176m81262j00822K36435L98941L45001J38206r4528k33307k25982j06545
$$ y = [371182137, 371296997, 371480637, 371703720, 372006111, 372441406, 373017769, 373674889, 374303055, 374788666, 375062981, 375133820, 375093460, 375095024, 375296516, 375786858, 376522636, 377314301, 377884445, 377983665, 377512360, 376583710, 375488243, 374574203, 374102135, 374146729, 374590759, 375201950, 375746384, 376076431, 376159019, 376047592, 375827141, 375570297, 375322914, 375115242, 374979744, 374955864, 375074768, 375332298, 375669250, 375974693, 376120491, 376012650, 375638809, 375083847, 374502029, 374055977, 373850327, 373894119, 374109688, 374382362, 374621620, 374799004, 374945908, 375115051, 375333290, 375575676, 375775490, 375865059, 375821533, 375690422, 375571327, 375568047, 375728378, 376003494, 376254005, 376305733, 376033745, 375434990, 374647255, 373901176, 373419914, 373319092, 373555527, 373954468, 374299469, 374437675, 374343147, 374109840, 373883858, 373777313]
2001C73777313L4294J06240O8359n3749j86691k51580k05726o3896J08184K23465K13738
2012C73769951O3591j79253m19693n56907n27840l37868n7297K09733L71398L84484
2022C72720299K66304P8850j01738k13013k26288j48735j8196J11198J86692J76162
2032C72831535Q0338o5575k07367k95677l08952k59438j81465j10092o4316m2992l5514
2043C71340485l4333l9329n4093p8201j04561j24321j35154j42670j52359j60332j49765
2054C70165367j01242j0605R9716J85395K02293J31416n798j57623k67258l01018k62413
2065C69678230j84211j07155n8823m2725m4631m6387l8376k3460j0529o371q773r232
2077C69097557J373K4872N3406P3929P5226N4435J9417j6899m2076n0354m3984l1051
$$ y = [373777313, 373811607, 373917847, 373986206, 373932457, 373745766, 373494186, 373288460, 373224564, 373332748, 373556213, 373769951, 373833542, 373654289, 373234596, 372677689, 372149849, 371811981, 371754684, 371964417, 372335815, 372720299, 372986603, 373065453, 372963715, 372750702, 372524414, 372375679, 372357483, 372468681, 372655373, 372831535, 372911873, 372846298, 372638931, 372343254, 372034302, 371774864, 371593399, 371483307, 371418991, 371375999, 371340485, 371306152, 371266823, 371212730, 371134529, 371029968, 370905647, 370770493, 370627823, 370475464, 370315132, 370165367, 370064125, 370053520, 370153236, 370338631, 370540924, 370672340, 370666542, 370508919, 370241661, 369940643, 369678230, 369494019, 369386864, 369328041, 369285316, 369240685, 369194298, 369155922, 369132462, 369121933, 369115562, 369106789, 369097557, 369098930, 369123802, 369177208, 369251137, 369326363, 369380798, 369400215, 369383316, 369341240, 369290886, 369246902, 369215851]
2089C69215851k1515k3918m3068p8468j22490j61858j80130j66473j21079n8746j831
2100C68236275L1318L6889K6893K0714K9182M5014M5051N036q0948j91994k85873l18794
2112C67598763k68670j47476K938J28097J84517J56059N9357o5537j71852k24800k14500
2123C67036896j58272r1095m9706n5770j05515j73416k24152k29950j83143r8839p172
2134C65659866O0845Q4839O3438J1482m6806q9188j04828r8877q8462r3880j25885
2145C65232544j77689k26822k44941k13089j32866k6589P1717J32103J40381J00631
2155C64655380K9869n1956j29852j95961k46849k79961k92511k81906k49100k00386
2165C62756767j46370r9258o9428o1569p3776r7656j22223j37100j35994j19286r2773
$$ y = [369215851, 369194336, 369170418, 369127350, 369048882, 368926392, 368764534, 368584404, 368417931, 368296852, 368238106, 368236275, 368267593, 368304482, 368331375, 368352089, 368381271, 368426285, 368471336, 368476372, 368395424, 368203430, 367917557, 367598763, 367330093, 367182617, 367185555, 367313652, 367498169, 367654228, 367713585, 367648048, 367476196, 367251396, 367036896, 366878624, 366787529, 366737823, 366682053, 366576538, 366403122, 366178970, 365949020, 365765877, 365667038, 365659866, 365720711, 365805550, 365868988, 365880470, 365833664, 365744476, 365639648, 365540771, 365452309, 365358429, 365232544, 365054855, 364828033, 364583092, 364370003, 364237137, 364210548, 364282265, 364414368, 364554749, 364655380, 364685249, 364633293, 364503441, 364307480, 364060631, 363780670, 363488159, 363206253, 362957153, 362756767, 362610397, 362511139, 362441711, 362380142, 362306366, 362208710, 362086487, 361949387, 361813393, 361694107, 361601334]
2176C61601334o5422m6006l9863m8218o7139q9378j05667j07956r2735o3248k9793
2187C60845909o409m615k7848o8893j10436j32370j19133o6642J4038R9296J60027
2198C60582924J72233J27945L9750o3019j45111j81427j67542j20430o8092l4523k8420
2209C60114288m1504n8250o7825p0534p5722r1324j17378j42708j53160j40114j06735
2220C59049034o4773k7886l967N722L166j1482m0894q5869j39694j85928k03247j76697
2232C58117485j07803j5984O8016J16882J19324Q4191L3073j1597l9634n5466p1831
2243C58236656r8228j32408j60790j66855j42631r5558m4861j1597p400k8649o0577
2254C57287102q5907r4414q6403p0648n8136n6000o5536q2283r8610j07422j05438
$$ y = [361601334, 361535912, 361489906, 361450043, 361401825, 361334686, 361245308, 361139641, 361031685, 360938950, 360875702, 360845909, 360839500, 360834885, 360807037, 360738144, 360627708, 360495338, 360376205, 360309563, 360323601, 360422897, 360582924, 360755157, 360883102, 360922852, 360859833, 360714722, 360533295, 360365753, 360245323, 360177231, 360142708, 360114288, 360072784, 360014534, 359946709, 359876175, 359800453, 359709129, 359591751, 359449043, 359295883, 359155769, 359049034, 358984261, 358956375, 358952408, 358958130, 358961296, 358949814, 358908920, 358823051, 358683357, 358497429, 358294182, 358117485, 358009682, 357993698, 358061714, 358178596, 358297920, 358382111, 358415184, 358403587, 358363953, 358308487, 358236656, 358138428, 358006020, 357845230, 357678375, 357535744, 357440186, 357395325, 357383728, 357376328, 357347679, 357287102, 357201195, 357106781, 357020378, 356949730, 356891594, 356835594, 356770058, 356687775, 356589165, 356481743, 356376305]
2265C56376305r5177q5259q7051j07689j45073j86920k15454k16827j88027j37062
2275C54911766p5340q774O5727J56441K63863L73306M56161M81339M33235L22037J82762
2286C57562523O0310q774j1673L8796J11160J71585J97678J86577J56097J36833J59760
2297C58760872K44179L87535N62858P24526Q18786Q00629O50101L83644N6915k46658
2307C63143387m37431m48609k61536Q4839N00489Q68148J073914J034698P24068J87988
2317C66469955m52766j023827j349601j326332r85070m99878j20811m8103l16811p64351
2327C59582405j118317j158065q53539l82957j3085P7400r8457l90472o85311j061439
2337C53898163j770096l013344m645958o033821o234550m467812o33316M449272R270401
$$ y = [356376305, 356281128, 356195869, 356108818, 356001129, 355856056, 355669136, 355453682, 355236855, 355048828, 354911766, 354836426, 354827652, 354893379, 355049820, 355313683, 355686989, 356143150, 356624489, 357057724, 357379761, 357562523, 357622833, 357614059, 357602386, 357641182, 357752342, 357923927, 358121605, 358308182, 358464279, 358601112, 358760872, 359005051, 359392586, 359955444, 360679970, 361498756, 362299385, 362949486, 363333130, 363390045, 363143387, 362705956, 362257347, 361995811, 362080650, 362581139, 363449287, 364523201, 365557899, 366281967, 366469955, 366017189, 364993362, 363643761, 362317429, 361332359, 360832481, 360711670, 360663567, 360346756, 359582405, 358464088, 357306023, 356452484, 356069527, 356056442, 356133842, 356035385, 355644913, 354959602, 353898163, 352128067, 349114723, 344468765, 338434944, 332200394, 327732582, 327099266, 331548538, 340818939]
2346C40818939J2254639J2462463R989777N858269J479416j996995m095726n019302
2354C71751480n317497n473099n659523n761719n580673n037346m244842l425484k767792
2363C28483505k332153k059021j847878j634292j411553j197395r88922p48634m28067
2372C15835590o427M90799J005916J480637J881122K200318K441864K603950K676087
2381C30609856K646484K513237K288322J994019J657066J306992R75380O92978M80690
2390C45165024L41797K58293K01187J45340Q2092K0447k3499m0092l3760j9875j5640
2401C46081314l1204o7825j19210j77040k31857k73705k94227k89154k61269k20985
2411C44114838j81313j51672j34163j24970j18522j13297j09520j07498j02920q8997
$$ y = [340818939, 353073578, 365536041, 375525818, 381384087, 382863503, 380866508, 376770782, 371751480, 366433983, 360960884, 355301361, 349539642, 343958969, 338921623, 334676781, 331251297, 328483505, 326151352, 324092331, 322244453, 320610161, 319198608, 318001213, 317012291, 316263657, 315835590, 315829163, 316319962, 317325878, 318806515, 320687637, 322887955, 325329819, 327933769, 330609856, 333256340, 335769577, 338057899, 340051918, 341708984, 343015976, 343991356, 344684334, 345165024, 345506821, 345765114, 345966301, 346111641, 346193733, 346214180, 346190681, 346150589, 346116829, 346096954, 346081314, 346050110, 345982285, 345863075, 345686035, 345454178, 345180473, 344886246, 344597092, 344335823, 344114838, 343933525, 343781853, 343647690, 343522720, 343404198, 343290901, 343181381, 343073883, 342970963, 342881966]
2421C42881966o1646k4757R193K5597J6327j4191n1460p9804r1285r0981r3193j12457
2433C42313309j53580k07863k55966k75650k52724j87683r8228j3085L8986L9940q201
2444C40939255q3695j54190j91002j82342j38092q4419n0469n4016r4414j54800k11220
2455C39540596k44675k47154k22587j81771j37634j02043q4343r0676j21154j66931
2465C37941628k10686k32430k19841j76506j22757q5563q3237j13564j53656j73607
2475C36369781j55143j03112m3678q430j6594o5155j32637j91727k22816k18850j83830
2486C35027809j26648n8822M310M4327M4708Q78p3052j46866j88751j83258j42593
2497C34202042r8915q5907j17226j77155k30560k42424j98364j10817j1788O2981Q8844
$$ y = [342881966, 342820320, 342795563, 342804756, 342830353, 342846680, 342832489, 342781029, 342701225, 342609940, 342518959, 342425766, 342313309, 342159729, 341951866, 341695900, 341420250, 341167526, 340979843, 340881615, 340868530, 340907516, 340947456, 340939255, 340855560, 340701370, 340510368, 340328026, 340189934, 340105515, 340055046, 340001030, 339906616, 339751816, 339540596, 339295921, 339048767, 338826180, 338644409, 338506775, 338404732, 338320389, 338229713, 338108559, 337941628, 337730942, 337498512, 337278671, 337102165, 336979408, 336893845, 336810608, 336697044, 336543388, 336369781, 336214638, 336111526, 336067848, 336059418, 336042824, 335977669, 335845032, 335653305, 335430489, 335211639, 335027809, 334901161, 334842339, 334846649, 334890976, 334935684, 334936562, 334863510, 334716644, 334527893, 334344635, 334202042, 334103127, 334017220, 333899994, 333722839, 333492279, 333249855, 333051491, 332940674, 332928886, 332991867, 333080711]
2508C33080711N8709j7205j15928k07100k60887k56806j93634r2850P439O9237P3166
2519C32144852K8686l2654p4920p8812n1155j7090l738k2583o5575j12228j44539j57128
2531C31413116j57661j58882j69563j90087k15339k38533k54517k59209k46353k09808
2541C29313164j47515o8359O561N0278M2801j7128j08070j94321k42844k37846j88789
2552C28207932j23559p2822n5046o8245r3422j06926r4070n7030j3657J2284K136m7875
2564C27489700j25770k08626k71797k98119k83699k37160j76620j21269q5945p7401
2574C25603294r3765j27830j69449k08054k34146k39677k19613j74789j13792n3254
2584C23968925j3504j1062n0240j19095j92527k42501k50282k15950j58005j03988
$$ y = [333080711, 333139420, 333122215, 333006287, 332799187, 332538300, 332281494, 332087860, 331995010, 332002449, 332071686, 332144852, 332173538, 332140884, 332065964, 331987152, 331935997, 331918907, 331915169, 331892586, 331827011, 331714783, 331570244, 331413116, 331255455, 331096573, 330927010, 330736923, 330521584, 330283051, 330028534, 329769325, 329522972, 329313164, 329165649, 329097290, 329103851, 329154129, 329196930, 329179802, 329071732, 328877411, 328634567, 328396721, 328207932, 328084373, 328011551, 327956505, 327888260, 327794838, 327687912, 327593842, 327536812, 327523155, 327535439, 327537575, 327489700, 327363930, 327155304, 326883507, 326585388, 326301689, 326064529, 325887909, 325766640, 325680695, 325603294, 325509529, 325381699, 325212250, 325004196, 324770050, 324530373, 324310760, 324135971, 324022179, 323968925, 323955421, 323944359, 323894119, 323775024, 323582497, 323339996, 323089714, 322873764, 322715759, 322611771]
2594C22611771p5570p7972r7389j11160j01471o8283k9831j1483l0784q2970j43165
2605C21781693j77918j64490j03874k1629M5700O9198M0627k5978j04256j70059k09999
2616C20959015k22893k13013j84440j40457q6327l3836j53l8l6850r7771j58386j94569
2628C19590282j95140j67256j31035j07631j06926j22032j35499j29032r4757l9768
2638C18361206J6384N0354M4651n073q6804j75228k39391k54097k10800j23902k7752
2649C17349548L6717L9482k3995j29566k35386l01208l07102k60353j87874j19953
2659C15860310p3128m4842j9760J6537O4296J08147J25828J01929L8929m2553j13450
2670C16022243j51119j49402j20869q8158p1430p8144j00079j19724j19533r2011m3030
$$ y = [322611771, 322536201, 322458229, 322360840, 322249680, 322148209, 322079926, 322050095, 322038612, 322007828, 321924858, 321781693, 321603775, 321439285, 321335411, 321313782, 321359482, 321428680, 321469307, 321443329, 321339073, 321169014, 320959015, 320736122, 320523109, 320338669, 320198212, 320111885, 320078049, 320077896, 320077858, 320041008, 319943237, 319784851, 319590282, 319395142, 319227886, 319096851, 318989220, 318882294, 318760262, 318624763, 318495731, 318400974, 318361206, 318377590, 318427944, 318472595, 318467522, 318380718, 318205490, 317966099, 317712002, 317501202, 317377300, 317349548, 317386265, 317425747, 317401752, 317272186, 317036800, 316735592, 316428490, 316168137, 315980263, 315860310, 315787182, 315742340, 315722580, 315739117, 315803413, 315911560, 316037388, 316139317, 316178246, 316135693, 316022243, 315871124, 315721722, 315600853, 315512695, 315441265, 315363121, 315263042, 315143318, 315023785, 314931774, 314888744]
2681C14888744J0777N0411O2428M4727O752l6373p0038q7929r2678r3803j01261j18599
2693C14463158j40553j55659j52912j29127r1839n6610l8567m5147p1315j03226j25599
2704C13352604j29356j15510r2620p1431n9356n8480o6909q1082r6912j09997j14822
2715C12356129j06335q3828n3425k8572k4605n0792j03512j65825k13699k27833k03419
2726C11094284j53980j05381q3904j02273j52835k09732k40517k22893j56460o5002
2736C09601307J3447M4670J4973o1913j51482k16293k34127k07348j59340j18961j03398
2747C08421535j09729j18504j07708o7711q697M2934N9586K5921n1289j46580k26974
2758C07712784k66991k58941k14558j57414j11637r1572r7446j18904j40839j51176
$$ y = [314888744, 314899521, 314949932, 315012360, 315057087, 315063839, 315027466, 314957428, 314869499, 314776821, 314683018, 314581757, 314463158, 314322605, 314166946, 314014034, 313884907, 313793068, 313736458, 313697891, 313652744, 313581429, 313478203, 313352604, 313223248, 313107738, 313015118, 312943687, 312884331, 312825851, 312758942, 312677860, 312580948, 312470951, 312356129, 312249794, 312165966, 312112541, 312083969, 312059364, 312008572, 311905060, 311739235, 311525536, 311297703, 311094284, 310940304, 310834923, 310751019, 310648746, 310495911, 310286179, 310045662, 309822769, 309666309, 309601307, 309614754, 309659424, 309674397, 309612484, 309461002, 309244709, 309010582, 308803234, 308643894, 308524933, 308421535, 308311806, 308193302, 308085594, 308017883, 308009186, 308052120, 308111706, 308137627, 308086338, 307939758, 307712784, 307445793, 307186852, 306972294, 306814880, 306703243, 306611671, 306514225, 306395321, 306254482, 306103306]
2768C06103306j44634j23024r3098o4182m5128m2172n5599p8564r8476j01528q0452
2779C05176449l9578N570L4752L3607Q39n0830j01834j35708j46217j37596j20411
2790C04519043j04485r5157r3422r6436j00479j00002r0180o8836m0130j5469j0204
2801C03704243l4886q7356j50738j99814k12688j82247j18752m4460J8081N5027O3782
2812C02810192N0125K1572j5468n5714r2907j19037j26935j14498q6460n4092l0079
2823C02186699k3270l5705o1646r0866j11885j16062j01395p4100m7417l5934m7093
2834C01441326p5264j01547j01738o1283J3847R5024J42231J23272L1796j07880k49443
2845C01150341l46069l70369l25070k39010j51748r6169q6746j17073j67408k13547
$$ y = [306103306, 305958672, 305835648, 305742550, 305678368, 305633240, 305591068, 305535469, 305456905, 305358429, 305256901, 305176449, 305136871, 305142441, 305177193, 305210800, 305211639, 305160809, 305058975, 304923267, 304777050, 304639454, 304519043, 304414558, 304319401, 304225979, 304129543, 304029064, 303929062, 303838882, 303770046, 303729916, 303714447, 303704243, 303669357, 303582001, 303431263, 303231449, 303018761, 302836514, 302717762, 302673302, 302691383, 302746410, 302810192, 302860317, 302881889, 302866421, 302810707, 302717800, 302598763, 302471828, 302357330, 302270870, 302216778, 302186699, 302163429, 302127724, 302066078, 301975212, 301863327, 301747265, 301645870, 301571770, 301524353, 301488419, 301441326, 301366062, 301264515, 301162777, 301101494, 301115341, 301210365, 301352596, 301475868, 301507664, 301399784, 301150341, 300804272, 300433903, 300108833, 299869823, 299718075, 299621906, 299535160, 299418087, 299250679, 299037132]
2855B99037132k36301k25563j81484j14212m0265J9150M4995K6321l4523j21384k08893
2866B97964973k72655k98214k85816k48280k02980j62754j32465j09616r0732p6866
2876B96084595p4444r0809j28040j78566k26937k55985k55756k28882j90334j61667
2886B94293175j62049k00042k69242l49369m12559m32759l95717l05329j83601o4316
2896B91518192J8597M3735Q679o9485j61724k38514k79178k77749k41851j86749j29299
2907B90004654q1577m9019l0976k4204k6092l6335n6458q8501j31130j80988k32220
2918B89067154k79160l16543l39165l40729l14655k58465j79558r6950l7289k3155
2928B86881485o0940j34315k09790k51674k39468j76735q8005m558N0773P1030O3534
$$ y = [299037132, 298800831, 298575268, 298393784, 298279572, 298239307, 298258457, 298303452, 298329773, 298295250, 298173866, 297964973, 297692318, 297394104, 297108288, 296860008, 296657028, 296494274, 296361809, 296252193, 296161461, 296084595, 296010151, 295919342, 295791302, 295612736, 295385799, 295129814, 294874058, 294645176, 294454842, 294293175, 294131126, 293931084, 293661842, 293312473, 292899914, 292467155, 292071438, 291766109, 291582508, 291518192, 291536789, 291580524, 291589203, 291519718, 291357994, 291119480, 290840302, 290562553, 290320702, 290133953, 290004654, 289923077, 289874058, 289843082, 289818878, 289792786, 289756451, 289699993, 289611492, 289480362, 289299374, 289067154, 288787994, 288471451, 288132286, 287791557, 287476902, 287218437, 287038879, 286941929, 286904640, 286881485, 286820545, 286686230, 286476440, 286224766, 285985298, 285808563, 285720558, 285716000, 285766773, 285837803, 285901337]
2939B85901337M1179J4572r384k6226l0613j8730P401L4790M3335J4496n7202j57833
2951B85757122k59285l32107l60280l50246l26805l19920l49006m11339m82464n25932
2961B82039738n10865m26654k90718j43586l3397M253l7498j33992k39696l08895l16239
2972B79602451k65693j85376j09729o1188l9902k7332L81N5981J33133K09675K59628
2983B79572029K67182K34260J77803J20049P7476N4608M5642M1809L7728L3340L0251
2994B80692177K7332J9608K193k3193m5300m8046k1381K8476P9155J01548P6637P362
3006B80896568q1730j58596k01492k09293j99375j93253k01340k17647k26078k14901
3016B78992863j86901j59760j55926j88141k51255l23886l79601l99094l79257l32565
$$ y = [285901337, 285942516, 285957088, 285947704, 285921478, 285890865, 285872135, 285879536, 285914326, 285957661, 285972157, 285914955, 285757122, 285497837, 285165730, 284805450, 284455204, 284128399, 283808479, 283459473, 283048134, 282565670, 282039738, 281528873, 281102219, 280811501, 280667915, 280634518, 280638771, 280601273, 280467281, 280227585, 279918690, 279602451, 279336758, 279151382, 279041653, 278980465, 278940563, 278913231, 278913612, 278969593, 279102726, 279312401, 279572029, 279839211, 280073471, 280251274, 280371323, 280448799, 280503407, 280549049, 280590858, 280628586, 280661926, 280692177, 280719509, 280739117, 280741310, 280718117, 280672817, 280624771, 280603390, 280631866, 280711021, 280812569, 280889206, 280896568, 280814838, 280656242, 280454750, 280245457, 280046082, 279852829, 279651489, 279433842, 279207764, 278992863, 278805962, 278646202, 278490276, 278302135, 278050880, 277726994, 277347393, 276948299, 276569042, 276236477]
3026B76236477k80514k43130k31094k42290k64416k81334k81410k61460k28176j93310
3036B73729343j67636j57738j64337j86406k22377k71035l27835l81641m14028m06189
3046B71030121l47233k44160j22966k1439K4528k460r3727k15473l22953l79352l71666
3057B68933220l16849k52495k17476k31990k87247l50323l82747l61538k90642j98307
3067B66043606j21231q6384j01490j57070k35672l21751m04396m75941n27954n52444
3077B63059273n46360n14164m65985m10575l49713k78930j97068j14879n7850n4379
3087B60069370j17664k32048l55187m37831m50154l97777l18814k60639k52972k92339
3097B56953945l46775l77254l61367l05061k36492j87054j73378j89171k12402k20547
$$ y = [276236477, 275955963, 275712833, 275481739, 275239449, 274975033, 274693699, 274412289, 274150829, 273922653, 273729343, 273561707, 273403969, 273239632, 273053226, 272830849, 272559814, 272231979, 271850338, 271436310, 271030121, 270682888, 270438728, 270315762, 270294323, 270318851, 270316391, 270222664, 270007191, 269684238, 269304886, 268933220, 268616371, 268363876, 268146400, 267914410, 267627163, 267276840, 266894093, 266532555, 266241913, 266043606, 265922375, 265835991, 265734501, 265577431, 265341759, 265020008, 264615612, 264139671, 263611717, 263059273, 262512913, 261998749, 261532764, 261122189, 260772476, 260493546, 260296478, 260181599, 260123749, 260069370, 259951706, 259719658, 259364471, 258926640, 258476486, 258078709, 257759895, 257499256, 257246284, 256953945, 256607170, 256229916, 255868549, 255563488, 255326996, 255139942, 254966564, 254777393, 254564991, 254344444]
3107B54344444k04544j72767j45169j38340j56936j89572k17647k27242k18315k05784
3117B52468128k10399k44961l05081l68366m06418l99246l47805k74029k11010j86882
3127B49513931k11239k73628l48873m10633m41456m37450m05846l60184l14598k81086
3137B46028938k66342k71416k89878l09678l18145l07999k83146k58179k52304k79560
3147B43192291l40633m20857m97226n48134n63240n46608n12810m76780m46262m17938
3157B38421803l82081l31459k69909k14881j90506k15130k89097l91102m86793n44339
3167B35106506n52196n22614m84028m63256m68712m87805m97112m80328m40826m00581
3177B30309048l87020m16375m84161n69382o45885o94523p08141o88706o43368n82580
$$ y = [254344444, 254139900, 253967133, 253821964, 253683624, 253526688, 253337116, 253119469, 252892227, 252673912, 252468128, 252257729, 252012768, 251707687, 251339321, 250932903, 250533657, 250185852, 249911823, 249700813, 249513931, 249302692, 249029064, 248680191, 248269558, 247828102, 247390652, 246984806, 246624622, 246310024, 246028938, 245762596, 245491180, 245201302, 244891624, 244573479, 244265480, 243982334, 243724155, 243471851, 243192291, 242851658, 242430801, 241933575, 241385441, 240822201, 240275593, 239762783, 239286003, 238839741, 238421803, 238039722, 237708263, 237438354, 237223473, 237032967, 236817837, 236528740, 236137638, 235650845, 235106506, 234554310, 234031696, 233547668, 233084412, 232615700, 232127895, 231630783, 231150455, 230709629, 230309048, 229922028, 229505653, 229021492, 228452110, 227806225, 227111702, 226403561, 225714855, 225071487, 224488907]
3187B24488907n21736m81205m81625n32226o22635p21722p90482p99827p44591o44607
3197B18148251n33047m39568l78360l47767l36876l34931l34491l30029l15685k84519
3207B14512978k33937j69487j05304n8670m1295n2967q2912j15318j38855j50853j56650
3218B13206730j64051j77269j93272k04429k03801j90982j74466j68857j87035k32467
3228B11310101k95754l58410m01878m16966m08229l89557l76454l78322l96691m29668
3238B07458172m74587n29518n87425o33430o47336o15825n44586m63314m13742m28525
3248B02119884n11341o33087p46975q13884q21648p87258p40528p03526o79474o56337
3258A95025826o20537n69001n09281m51069l97491l44944k92149k49538k39334k81944
$$ y = [224488907, 223967171, 223485966, 223004341, 222472115, 221849480, 221127758, 220337276, 219537449, 218792858, 218148251, 217615204, 217175636, 216797276, 216449509, 216112633, 215777702, 215443211, 215113182, 214797497, 214512978, 214279041, 214109554, 214004250, 213945580, 213904285, 213851318, 213768406, 213653088, 213514233, 213363380, 213206730, 213042679, 212865410, 212672138, 212467709, 212263908, 212072926, 211898460, 211729603, 211542568, 211310101, 211014347, 210655937, 210254059, 209837093, 209428864, 209039307, 208662853, 208284531, 207887840, 207458172, 206983585, 206454067, 205866642, 205233212, 204585876, 203970051, 203425465, 202962151, 202548409, 202119884, 201608543, 200975456, 200228481, 199414597, 198592949, 197805691, 197065163, 196361637, 195682163, 195025826, 194405289, 193836288, 193327007, 192875938, 192478447, 192133503, 191841354, 191591816, 191352482, 191070538]
3268A91070538l78800n04017o11763o60095o33068n49965m54216l89118l75157m03385
3278A86110954m44450m69761m66595m43706m22497m22535m50706m98467n46741n76115
3288A81369381n75199n44453m96445m49600m21047m19254m39053m64306m73976m54006
3298A76632042m05312l45192k99587k90375l21846l78246m29668m46873m16813l48835
3308A72949295k70138k11792j92356k09408k41108k59170k44236j96591j36451r4033
3318A70894012r3669j41793k22721l05004l54977l50647k89707j89953q1825L052M2953
3329A68909721L2750j5583p8030j28079j46904j30062q7909l9273p05K2125L7384O2256
3341A68437691J10550J83944K66972L34625L63808L46813K96650K42653K17094K41776
$$ y = [191070538, 190691738, 190187721, 189575958, 188915863, 188282795, 187732830, 187278614, 186889496, 186514339, 186110954, 185666504, 185196743, 184730148, 184286442, 183863945, 183441410, 182990704, 182492237, 181945496, 181369381, 180794182, 180249729, 179753284, 179303684, 178882637, 178463383, 178024330, 177560024, 177086048, 176632042, 176226730, 175881538, 175581951, 175291576, 174969730, 174591484, 174161816, 173714943, 173298130, 172949295, 172679157, 172467365, 172275009, 172065601, 171824493, 171565323, 171321087, 171124496, 170988045, 170894012, 170800343, 170658550, 170435829, 170130825, 169775848, 169425201, 169135494, 168945541, 168863716, 168866768, 168909721, 168942471, 168926888, 168848858, 168720779, 168573875, 168443813, 168355904, 168316631, 168315926, 168338051, 168375435, 168437691, 168548241, 168732185, 168999157, 169333782, 169697590, 170044403, 170341053, 170583706, 170800800, 171042576]
3351A71042576L16868M21905N23968N91793O08635N78766N24845M78039M63829M91752
3361A76042976N52216O22063O76593P00074O91051O61259O26888O02741N96733O10390
3371A82382984O39801O76022P04689P06901O65055N71632M37603K93045J77689J24473
3381A87379894J42861K13833K98290L54576L57094L05156K17953J22757M1370j6880
3391A89416904n3615p6313r2793j10645j36909j77765k34967l01265l59993l91007
3401A87481632l81546l36036k76947k34128k28500k57797k97280l14350k90966k39029
3411A84625053j98631k16465l18394m89139o75869q11730q48693p80697o43902m96655
3421A79144878l90224l47214l59649m00162m40483m63200m62265m38118l92570l28885
$$ y = [171042576, 171359444, 171781349, 172305317, 172897110, 173505745, 174084511, 174609356, 175087395, 175551224, 176042976, 176595192, 177217255, 177893848, 178593922, 179284973, 179946232, 180573120, 181175861, 181772594, 182382984, 183022785, 183698807, 184403496, 185110397, 185775452, 186347084, 186784687, 187077732, 187255421, 187379894, 187522755, 187736588, 188034878, 188389454, 188746548, 189051704, 189269657, 189392414, 189433784, 189416904, 189363289, 189286976, 189194183, 189083538, 188946629, 188768864, 188533897, 188232632, 187872639, 187481632, 187100086, 186764050, 186487103, 186252975, 186024475, 185766678, 185469398, 185155048, 184864082, 184625053, 184426422, 184209957, 183891563, 183402424, 182726555, 181914825, 181066132, 180285435, 179641533, 179144878, 178754654, 178407440, 178047791, 177647629, 177207146, 176743946, 176281681, 175843563, 175450993, 175122108]
3431A75122108k55031j83792j27087q8081n7659k0752K9354Q1177J06163P6751j1005
3442A74672146j25466k09140k06910r7866R1687L01513M69380N62095N86281N73883
3452A76617603N55973N43690N28088M98085M57096M26884M32872M83589N62211O34975
3462A81741066O74267O75087O56872O46953O61373O97365P41539P84321Q26836Q73603
3472A88979282R17912R36375R01985Q07323O81668N81512N59654O29730P55616Q73718
3482A96624775R36050R42135R35421R66606J051159J155033J220589J216431J168327
3491B06216526J146793J214009J369629J536026J602668J500588J258125R93977Q50487
3500B17688828R06791J130257J398125J574039J588440J472397J327839J258487J310959
$$ y = [175122108, 174867077, 174683285, 174556198, 174468117, 174410458, 174389706, 174419060, 174500237, 174606400, 174683151, 174672146, 174546680, 174337540, 174130630, 174032764, 174124451, 174425964, 174895344, 175457439, 176043720, 176617603, 177173576, 177717266, 178245354, 178743439, 179200535, 179627419, 180060291, 180543880, 181106091, 181741066, 182415333, 183090420, 183747292, 184394245, 185055618, 185752983, 186494522, 187278843, 188105679, 188979282, 189897194, 190833569, 191735554, 192542877, 193224545, 193806057, 194365711, 194995441, 195751057, 196624775, 197560825, 198502960, 199438381, 200404987, 201456146, 202611179, 203831768, 205048199, 206216526, 207363319, 208577328, 209946957, 211482983, 213085651, 214586239, 215844364, 216838341, 217688828, 218595619, 219725876, 221124001, 222698040, 224286480, 225758877, 227086716, 228345203, 229656162]
3509B29656162J459427J637898J786384J879635J920166J913262J846294J694012J442356
3518B45235596J110477P51400M30546K00100Q4515Q7890K06490M32625P41271J073094
3528B50354004J336288J439572J345405J110421Q76312Q04195R78508J336861J675129
3537B61256695J740532J370811O02760l17401j042309j296959j023083m06933K30198
3546B61114311O14834O69174N30186M34799N52158Q78907J269092J566105J728897
3555B69358463J844445K009544K173500K085342J419774K7866j858730l636990m588146
3564B68835068m252262k692299m81377J583309K865448L149376K648125J802101J030178
3573B74487667N85079N50995R06716J552486K276726K734527K535725J452465l67451
$$ y = [229656162, 231115589, 232753487, 234539871, 236419506, 238339672, 240252934, 242099228, 243793240, 245235596, 246346073, 247097473, 247528019, 247728119, 247812634, 247900524, 248107014, 248539639, 249280910, 250354004, 251690292, 253129864, 254475269, 255585690, 256462002, 257266197, 258244705, 259581566, 261256695, 262997227, 264368038, 264970798, 264653397, 263611088, 262314129, 261291046, 260884113, 261114311, 261729145, 262398319, 262928505, 263363304, 263915462, 264794369, 266063461, 267629566, 269358463, 271202908, 273212452, 275385952, 277471294, 278891068, 278918934, 277060204, 273423214, 268835068, 264582806, 261890507, 261409130, 262992439, 265857887, 269007263, 271655388, 273457489, 274487667, 275072746, 275623741, 276530457, 278082943, 280359669, 283094196, 285629921, 287082386, 286714935]
3582B86714935k355041l729878l888149k742462p97176J107711K231427K288360J521282
3591B80351009M80881l15876o25248m92554r3994M34361J047001J707363K279262K515927
3601B87288132K182731J230355j10722j398506k175274k175312j431580k41947R56440
3610B84124317J730137J767635R75209m44432j967144k853927k428513m55265K581787
3619B83029804N516224O937981N873852K359504k450618o751843q923836q283996n349751
3628B71957321j487083J822414L660946L948078L243122K299347J687374J668015K265014
3637B91064548L350640M622707N533085N350037L469276j39236m654579q582440j0401783
3646B89612255r355926n906449j536484K008191L594341L179111J648121J85299l84102
$$ y = [286714935, 284359894, 280630016, 276741867, 273999405, 273202229, 274309940, 276541367, 278829727, 280351009, 280831890, 280516014, 279890766, 279398212, 279304218, 279738579, 280785580, 282492943, 284772205, 287288132, 289470863, 290701218, 290590496, 289191990, 287016716, 284841404, 283409824, 283167877, 284124317, 285854454, 287622089, 288597298, 288152866, 286185722, 283331795, 280903282, 280448017, 283029804, 288546028, 295484009, 301357861, 303717365, 301266747, 294514904, 285591068, 277307072, 271957321, 270470238, 272292652, 275953598, 279901676, 283144798, 285444145, 287131519, 288799534, 291064548, 294415188, 299037895, 304570980, 309921017, 313390293, 313251057, 308596478, 300014038, 289612255, 280256329, 274349880, 272813396, 274821587, 278415928, 281595039, 283243160, 283428459, 283044357]
3655B83044357J06106J306324K715950L957901M811154N095901M619122L292026J318493
3664C10267334p63302k306633k942448k843036k630119k946663l973828n242576n887223
3673B80731506n178165k973785J97963L448200N975819P351875P501126O499290M425087
3682C07978916J417408k132072n474167p663784p958298o217785l032856N22347L369579
3691B80809288M855576M903545L866196K250175N17254r49459j795063j707974n71708
3700B92177830J335220L279972M292870L613834J140595k400093n701294p446404o912994
3709B83379536m293385n75962K931042N165348N686970M715366K880058Q71716q11692
3718B99948997j929454k415219k260818j471119j15185J580887L185673M123821L854084
$$ y = [283044357, 283150463, 284456787, 287172737, 291130638, 295941792, 301037693, 305656815, 308948841, 310267334, 309504032, 307197399, 304254951, 301411915, 298781796, 295835133, 291861305, 286618729, 280731506, 275553341, 272579556, 272777519, 276225719, 282201538, 289553413, 297054539, 303553829, 307978916, 309396324, 307264252, 301790085, 294126301, 286168003, 279950218, 276917362, 277439709, 280809288, 285664864, 290568409, 294434605, 296684780, 297202034, 296252575, 294457512, 292749538, 292177830, 293513050, 296793022, 301085892, 304699726, 305840321, 303440228, 297738934, 290292530, 283379536, 279086151, 278510189, 281441231, 286606579, 292293549, 297008915, 299888973, 300760689, 299948997, 298019543, 295604324, 293343506, 291872387, 291757202, 293338089, 296523762, 300647583, 304501667]
3727C04501667K112293q79402m345226p117100q027878o423206k567864K300549O389790
3736B85943623Q122272O896515L416748o47087l530235m304123l320599j892967j406269
3745B89277878k410946m275837n616684n215740k831536O19450L607903M894847M213372
3754B82262707K327461M88853l20282J16158J263485K265415K461624J685391K38380
3763B92789192j346912k558689l049031k670936j483345K35309K001210L232879L463917
3772B90613594K572403Q84247r43356k221298k555466k013168j039162j75190K43283
3781B85365887K38838J14117K15435O93988J418152K077122K395878K304802J949920
3790B96774139J543847J175651P31144m196j129646k466736l595448m089718l797340
$$ y = [304501667, 306613960, 305734558, 301389332, 294272232, 286244354, 279821148, 277253284, 279553833, 285943623, 294065895, 300962410, 304379158, 303732071, 300201836, 295897713, 292577114, 290684147, 289277878, 286866932, 282591095, 276974411, 271758671, 268927135, 269546585, 273154488, 278049335, 282262707, 284590168, 285079021, 284758739, 284874897, 286138382, 288403797, 290865421, 292550812, 292789192, 291442280, 288883591, 285834560, 283163624, 281680279, 281915588, 283916798, 287149677, 290613594, 293185997, 294070244, 293126888, 290905590, 288350124, 286336956, 285297794, 285122604, 285365887, 285604725, 285718842, 285934277, 286628265, 288046417, 290123539, 292519417, 294824219, 296774139, 298317986, 299493637, 300224781, 300220585, 299090939, 296624203, 293028755, 288939037, 285141697]
3799B85141697k954617k030086j389656j025067n57632M57401K132054M045524N413342
3808B89232960N535621M228211J945305m91352k364540l413029l839417m009056m090118
3817B82734585l910275l129673j578159N05695K527962L853397M165669L628025K745571
3826B91542797K028046J680546J511478J099758J00632j502228l344135m846840n503197
3835B82766857n117607l870239k174645m15668J265983K992936M936885O993580Q578682
3844B95956764Q744259O639099K099552l983192r808235j3338204j3205661r383736
3852B63720646l250065L007336P342891Q682099P238197M216576J127701r13506j574249
3861B89597626j259270p37457o74782j302586k347393l216915l327350k408753o48651
$$ y = [285141697, 282187080, 280156994, 278767338, 277742271, 277184639, 277642040, 279774094, 283819618, 289232960, 294768581, 298996792, 300942097, 300450745, 298086205, 294673176, 290833759, 286824703, 282734585, 278824310, 275694637, 274116478, 274622173, 277150135, 281003532, 285169201, 288797226, 291542797, 293570843, 295251389, 296762867, 297862625, 297963257, 296461029, 293116894, 288270054, 282766857, 277649250, 273779011, 271604366, 271188698, 272454681, 275447617, 280384502, 287378082, 295956764, 304701023, 311340122, 313439674, 309456482, 299648247, 286310043, 273104382, 263720646, 260470581, 263477917, 270820808, 279502907, 286741104, 290957680, 292085381, 291171875, 289597626, 288338356, 287600899, 286926117, 285623531, 283276138, 280059223, 276731873, 274323120, 273674469]
3870B73674469J388798L021240L748150L443088K348996R08413m55990j481419k072391
3879B84523354k226220j969566j368885n84278J20392M71019L52040o7978l73573j20793
3889B78755512Q75397K365665L728848M258060L512745J543579j124363l724670n556602
3898B84634171o217137n672245m184074k169018o1874J777420L111248L836746L967647
3907B79022884L593502K831383J797657O16112n54276j509018k041091k031517j532040
3916B80193596p72820o4849L55224M44012L50838K91233L78265N29842N23987J69296
3926B82398624n23090j292400j748410j590023p89756L72543J445694K028637J952686
3935B82254505J329346M61464l18775p90406r04693p61757n33123l75252l65620m77352
$$ y = [273674469, 275063267, 278084507, 281832657, 285275745, 287624741, 288533154, 288077164, 286595745, 284523354, 282297134, 280327568, 278958683, 278374405, 278494797, 278965816, 279317856, 279249878, 278876305, 278755512, 279630909, 281996574, 285725422, 289983482, 293496227, 295039806, 293915443, 290190773, 284634171, 278417034, 272744789, 268560715, 266391697, 266329823, 268107243, 271218491, 275055237, 279022884, 282616386, 285447769, 287245426, 287861538, 287307262, 285798244, 283757153, 281725636, 280193596, 279420776, 279355927, 279711151, 280155163, 280506001, 280797234, 281175499, 281705341, 282229328, 282398624, 281875534, 280583134, 278834724, 277244701, 276454945, 276827488, 278273182, 280301819, 282254505, 283583851, 284045315, 283726540, 282936134, 282031441, 281269684, 280736561, 280361309, 279995689, 279518337]
3945B79518337n99975n99385l93943r232M23546P30800P88613N86796K26936j43070
3955B80529423m07276n23167n07641l94592k09828J7338K29187L42427K92911R1839
3965B79460621j61915l38440l66058k82612j99890k05860k87018l42999k82650j19552
3975B76873627K7332L8433q7891k17227j94684k803J90029J58424j67198n96485q11386
3986B75210171o55823l33443k94113q34179j725979k256336j791401n43594O3953k108593
3996B64730663q667774j9378166l1689892m1581421
4000A63413410
$$ y = [279518337, 278918362, 278318977, 277925034, 277915802, 278339348, 279070148, 279858761, 280445557, 280672493, 280529423, 280122147, 279598980, 279091339, 278696747, 278486919, 278504257, 278733444, 279075871, 279368782, 279460621, 279298706, 278960266, 278594208, 278311596, 278111706, 277905846, 277618828, 277275829, 276993179, 276873627, 276900959, 276939392, 276851501, 276634274, 276439590, 276436787, 276626816, 276785240, 276618042, 276021557, 275210171, 274554348, 274220905, 273926792, 273092613, 271366634, 269110298, 267318897, 266775303, 266839256, 264730663, 256062889, 236684723, 204994831, 163413410]
##END=$$ End of the data block
