##TITLE=$$ Begin of the data block
##JCAMP-DX=5.00 $$ ACD/SpecManager v 10.08
##SPECTROMETER/DATA SYSTEM=16PC
##DATE=Thu Sep 12 14:29:11 2013
##DATA TYPE=INFRARED SPECTRUM
##DATA CLASS=XYDATA
##ORIGIN=
##OWNER=
##NPOINTS=3601
##FIRSTX=400.00000000
##LASTX=4000.00000000
##MAXX=4000.00000000
##MINX=400.00000000
##MAXY=41.22480774
##MINY=14.86062431
##XFACTOR=1.0000000000
##YFACTOR=0.000000100000000
##FIRSTY=21.29619598
##DELTAX=1.00000000
##XUNITS=1/CM
##YUNITS=TRANSMITTANCE
##XYDATA=(X++(Y..Y))
400B12961960M8326454L5367985K1020336J0025444M787064M612159O662674P907448
408C51671524O844635M024048J230774K7313O64482K018891K479858J101646j759758
417C68303413m699821o171379n419083k872772J81999K373619K960243K103806O29807
426C57389832n09072p30171m3602J049995J874581J932335J142044j20926j195564
435C60789452j449242o08864J055031K808418L793640L477288J959877m3183j570892
444C70211525j939926j124115K40974J237641J205978J23253j402588k511635k608528
453C63432579j702347l77693N74455O29425j73416j275749j944237j698150n76325
462C56888542R01680K039643K350807J807594Q27484J8807j64185L37524J169701J768532
$$ y = [212961960, 261288414, 296656399, 317676735, 327702179, 332489243, 337101402, 343764076, 351671524, 358516159, 362540207, 363770981, 363798294, 364462776, 366481667, 368961525, 370063171, 368303413, 363603592, 357432213, 352013130, 349140358, 349322357, 351695976, 354656219, 356760025, 357389832, 356880760, 356150589, 356106987, 357156982, 359031563, 360963898, 362105942, 361985016, 360789452, 359340210, 358731346, 359786377, 362594795, 366388435, 369865723, 371825600, 371782417, 370211525, 368271599, 367147484, 367388458, 368626099, 369832077, 369955330, 368552742, 366041107, 363432579, 361730232, 361352539, 361926994, 362556419, 362383003, 361107254, 359163017, 357464867, 356888542, 357790222, 359829865, 362180672, 363988266, 364815750, 364834557, 364670372, 365007896, 366177597, 367946129]
472C67946129J663742P17811q16345k433815l620147m065896l748626k863159j667977
481C51111717l46184J035614K465172L874779N070305N760231N680809M752350L176727
490C82581520J407623j0910o69746m76379K99148J149826J573563J317940N00602m55398
500C87217789j047287r58824k25983P85942J586838J829681J494217Q78296M04739
509C91965408L52593O74286J008835Q93631N5732j381988k909012l859978l754082
518C83045425k562866p54242R20906J796646J621972O79359l75748q70704m77524O16760
528C83639984J822205K479286K227173J200027n7029r02520r62677l34549M85497R04350
538C90501747N86357l46412j384697j929169j641922o47316N32761J272049J194076
$$ y = [367946129, 369609871, 370327682, 369511337, 367077522, 363457375, 359391479, 355642853, 352779694, 351111717, 350765533, 351801147, 354266319, 358141098, 363211403, 368971634, 374652443, 379404793, 382581520, 383989143, 383978233, 383308487, 382832108, 383131256, 384281082, 385854645, 387172585, 387673187, 387217789, 386170502, 385211678, 384985695, 385771637, 387358475, 389188156, 390682373, 391560669, 391965408, 392318001, 392992287, 394001122, 394894753, 394950485, 393568497, 390659485, 386799507, 383045425, 380482559, 379728317, 380649223, 382445869, 384067841, 384747200, 384371452, 383500748, 383023224, 383639984, 385462189, 387941475, 390168648, 391368675, 391311646, 390409126, 389446449, 389111900, 389597397, 390501747, 391088104, 390741692, 389356995, 387427826, 385785904, 385138588, 385671349, 386943398, 388137474]
547C88137474L88184o36673j235390r91936L6164J329956K179145K065621R56650o57807
557C91571388k010765k463341j852760n91621N46455Q44879M4518j499939k998924
566C81589890l653870l096581j597709P7286J087875R80759o2180j333427k000733
575C71991310j576347j91498J476440K576790K551880J434670j77880j454467j774483
584C74856415j047249K63786J411095J773148J178703k3384j176262j686020j344338
593C74205894m32090M45976P00569Q2893j179656k505990l270988l131409k191467
602C62723732r22394J12610N71251N09224L21617M85764J250724K451783L562202L964653
612C75031166L300743J709442j86844j558837j781998p69310R52072K483063L003502
$$ y = [388137474, 388525658, 387888985, 386653595, 385661659, 385697823, 387027779, 389206924, 391272545, 392229195, 391571388, 389560623, 387097282, 385244522, 384652901, 385199356, 386044235, 386088753, 384588814, 381589890, 377936020, 374839439, 373241730, 373319016, 374406891, 375387650, 375325470, 373992043, 371991310, 370414963, 370223465, 371699905, 374276695, 376828575, 378263245, 378085365, 376630898, 374856415, 373809166, 374072952, 375484047, 377257195, 378435898, 378412514, 377236252, 375550232, 374205894, 373773804, 374219780, 374920349, 375003242, 373823586, 371317596, 368046608, 364915199, 362723732, 361801338, 361913948, 362485199, 362994423, 363316040, 363801804, 365052528, 367504311, 371066513, 375031166, 378331909, 380041351, 379854507, 378295670, 376513672, 375744362, 376696434, 379179497, 382182999]
621C82182999K205886M77829j276702k105103j523056K00577K157631L270530K874680
630C88465271J095161j197471k841873l005219j630783N35355K352600K899437J954879
639C88627357Q4839j696663k494278k006187o54678O79588J157532M39186j143990
648C82992706k774582l586120l118935j563949L23257J599159J616020L77808j416206
657C74449158k686158k512512o46782K277604M977455O118736M999580J957245j738777
666C87195549m488411n158043l649864r28497J517944K486038J684265j67617j808892
675C76682472k193146j085243Q37479K419815K725868J583824l29132j895408k203598
684C76542931j057854R29642K695541L315086K492752O94352j129036k061577j700936
$$ y = [382182999, 384388885, 384866714, 383590012, 381484909, 379961853, 380162430, 382320061, 385590591, 388465271, 389560432, 388362961, 385521088, 382515869, 380885086, 381420441, 383773041, 386672478, 388627357, 388712196, 387015533, 384521255, 382515068, 381860390, 382539978, 383697510, 384136696, 382992706, 380218124, 376632004, 373513069, 371949120, 372272377, 373871536, 375487556, 375865364, 374449158, 371763000, 369250488, 368603706, 370881310, 375858765, 381977501, 386977081, 388934326, 387195549, 382707138, 377549095, 373899231, 372970734, 374488678, 376974716, 378658981, 378491364, 376682472, 374489326, 373404083, 374241562, 376661377, 379387245, 380971069, 380641937, 378746529, 376542931, 375485077, 376414719, 379110260, 382425346, 384918098, 385612450, 384483414, 382421837, 380720901]
693C80720901l49960J169472J967773J565895J51635j517945k515526k239227p45239
702C78207779J260414K773895L011437J822700k22435k124328k972718k418251q46634
711C78491859Q37899J702575J283684j72882j856041k831612k545509j114960P40319
720C74535332K088279K279587J288796k80190j521759j716957p20901R52415K395477
729C79300079K785378J823082r7046k082024l197403k951164j545372K34070J434212
738C75703812J433525K56042j461029k826881l182411k446022j139985q3694O5575
747C66318932q25615k298546l560066l918610l158226j650505j48583O18058L27301
756C51704140p81327k055168k793960k630844j723748o59637j28250n45883j827355
$$ y = [380720901, 380370941, 381540413, 383508186, 385074081, 385225716, 383707771, 381192245, 378953018, 378207779, 379468193, 382242088, 385253525, 387076225, 386853790, 384729462, 381756744, 379338493, 378491859, 379329758, 381032333, 382316017, 382143135, 380287094, 377455482, 374909973, 373795013, 374535332, 376623611, 378903198, 380191994, 379911804, 378390045, 376673088, 375952187, 376904602, 379300079, 382085457, 383908539, 383811493, 381729469, 378532066, 375580902, 374035530, 374269600, 375703812, 377137337, 377393379, 375932350, 373105469, 369923058, 367477036, 366337051, 366253357, 366318932, 365493317, 363194771, 359634705, 355716095, 352557869, 350907364, 350758781, 351376839, 351704140, 350922813, 348867645, 346073685, 343442841, 341719093, 341059456, 340931206, 340385323, 338557968]
765C38557968l425789m614753m860116m091377k733764j491814r98383j507015k774334
774C12060623m185104n048809m918804l783055k042084k95829R46083J488380J500244
783B95721645J378346J499729K002602K709465L235416L220558K557640J483193M77829
792C14286423J8291L19233J202946K180328K702351K453003J524124L74298m09164
801C24651833m20494L47671J499786K445336K713737K204285J241074M00695K05078
810C35289001Q39806K049751L266945L904610L664894K694893J508293P13234O88095
819C54619522J381149K339745K957115K804184J866531N57023n04570q29621l27759
828C64863319O38619J449127J563950Q24356m49791j620255k065849j514816j97029
$$ y = [338557968, 335132179, 330517426, 325657310, 321565933, 318832169, 317340355, 316341972, 314834957, 312060623, 307875519, 302826710, 297907906, 294124851, 292082767, 291786938, 292733021, 294221401, 295721645, 297099991, 298599720, 300602322, 303311787, 306547203, 309767761, 312325401, 313808594, 314286423, 314304714, 314623947, 315826893, 318007221, 320709572, 323162575, 324686699, 325060997, 324651833, 324231339, 324579010, 326078796, 328524132, 331237869, 333442154, 334683228, 335083923, 335289001, 336128807, 338178558, 341445503, 345350113, 349015007, 351709900, 353218193, 353931427, 354619522, 356000671, 358340416, 361297531, 364101715, 365968246, 366525269, 366020699, 365191078, 364863319, 365501938, 366951065, 368515015, 369339371, 368889580, 367269325, 365203476, 363688660, 363491631]
837C63491631J267395K184333K143174J227455l1166r30062r61036p0191J318627K529869
847C72170029K990074K523537J434478L32909k00768O5079Q86078J674385J824913
856C83700714J059494l97224j910706k754593k488594j194153N59006K001991K557793
865C81133728K127724J119880K07901m6730M97589J494637K314644K408333J626472
874C92884178L16544q57353j274148o96029N95856J946792K677727K445068J421471
883C99460106J98059n39703l84102N73425J788788K558746K399979J315651j97449
892D07173500j402969j710739r88350L64799J623459K114525J570244K69584j109428
901D07904625j846848j562538m16717R76410J877212J817284Q48045m88701j456909
$$ y = [363491631, 364759026, 366943359, 369086533, 370313988, 370282822, 369352760, 368391724, 368321533, 369640160, 372170029, 375160103, 377683640, 379118118, 379451027, 379250259, 379315338, 380201416, 381875801, 383700714, 384760208, 384362984, 382452278, 379697685, 377209091, 376014938, 376573944, 378575935, 381133728, 383261452, 384381332, 384589233, 384542503, 385040092, 386534729, 388849373, 391257706, 392884178, 393200722, 392343369, 391069221, 390373192, 390969048, 392915840, 395593567, 398038635, 399460106, 399658165, 399118462, 398734360, 399307785, 401096573, 403655319, 406055298, 407370949, 407173500, 405770531, 404059792, 403071442, 403436241, 405059700, 407174225, 408744469, 409014053, 407904625, 406057777, 404495239, 404078522, 405054932, 406932144, 408749428, 409597473, 409108772, 407651863]
910D07651863j526222o60706O62728J715660J917495J155968j50337j278915j600800
919D07886734r29184L72009J578560J997109J342849r9105j618119k451172k184524
928D05895157r70001N57632J617279J691437P89261n69916j643867j864739j138649
937D04363594J14136J189880J483040Q09288m96597j761360k332611j927643p86934
946D00654793M51050J088867P43751m39262j851883k733574k569466j365509L45955
955C94324722J776619K290383J732177N04990o49872j051788m48303Q48465K129974
964D01457367K674713K142906P66716p66372j677666j513443l90892J059952K030182
973D05783463J963195Q53005p49245k027702k336197j544190j05438J185150J620179
$$ y = [407651863, 406125641, 405464935, 406127663, 407843323, 409760818, 410916786, 410766449, 409487534, 407886734, 406957550, 407329559, 408908119, 410905228, 412248077, 412148972, 410530853, 408079681, 405895157, 404925156, 405482788, 407100067, 408791504, 409580765, 409010849, 407366982, 405502243, 404363594, 404477730, 405667610, 407150650, 407959938, 407463341, 405701981, 403369370, 401441727, 400654793, 401105843, 402194710, 402938461, 402499199, 400647316, 397913742, 395344276, 393978767, 394324722, 396101341, 398391724, 400123901, 400628891, 399979019, 398927231, 398478928, 399327393, 401457367, 404132080, 406274986, 407041702, 406275330, 404597664, 403084221, 402693329, 403753281, 405783463, 407746658, 408599663, 407850418, 405822716, 403486519, 401942329, 401836891, 403022041, 404642220]
982D04642220R59625m40216j823387k446099j982498p02858O72875J363639R46618
991D01189919m20304k088508l266144l433304k603188j301880k92358j95808j207581
1000C86380844l034477n059013o623421p285118o933441n743981m028168k076683p2517
1009C45524025J898498L766289N392342O537094O914330O317482M759063K552338K67486
1018C83928947j441650k091370j584930k83737J131058J959762J815949Q17756m67910
1027C83783875j317826j235924k25792J196633K269096K387810J435356j48544j595154
1036C86549530k211685j745911n12657P83653J432610J098175r918j260681j953316
1045C82169800j701241o40640O45294J443787J297798K50778j179085k278289k520371
$$ y = [404642220, 405601845, 405161629, 403338242, 400892143, 398909645, 398206787, 398879662, 400243301, 401189919, 400769615, 398681107, 395414963, 391981659, 389378471, 388076591, 387784233, 387588425, 386380844, 383346367, 378287354, 371663933, 364378815, 357445374, 351701393, 347673225, 345596542, 345524025, 347422523, 351188812, 356581154, 363118248, 370032578, 376350060, 381109123, 383661461, 383928947, 382487297, 380395927, 378810997, 378527260, 379658318, 381618080, 383434029, 384251785, 383783875, 382466049, 381230125, 381004333, 382200966, 384470062, 386857872, 388293228, 388144684, 386549530, 384337845, 382591934, 382079277, 382862930, 384295540, 385393715, 385383797, 384123116, 382169800, 380468559, 379827919, 380473213, 381917000, 383214798, 383465576, 382286491, 380008202, 377487831]
1054C77487831j843033o76193K93655M90227k51503j610412k966309l741455l710671
1063C63472137l112831k508850k467727l253060m678345o202087p208099p318535o578636
1072C20143967n422993m453831m150200m657325n751038o977406p882232q208618p971630
1081B64668694p389660o726570o135769n586357m903851l893852k481518p92141Q69713
1090B27628689K138538K751103K681427K182979J707478J728420K537689M106388O078129
1099B53540840P906952R085732R361496Q834915P892780P004414O485519O350307O333066
1108C22796021O066246N318183M155312K934341K118836K023010K620926L538055M235611
1117C55806541M294587L642044K594070J685295J374245J787224K641182L393821L538285
$$ y = [377487831, 375644798, 374968605, 375262260, 375752487, 375500984, 373890572, 370924263, 367182808, 363472137, 360359306, 357850456, 355382729, 352129669, 347451324, 341249237, 334041138, 326722603, 320143967, 314720974, 310267143, 306116943, 301459618, 295708580, 288731174, 280848942, 272640324, 264668694, 257279034, 250552464, 244416695, 238830338, 233926487, 230032635, 227551117, 226758976, 227628689, 229767227, 232518330, 235199757, 237382736, 239090214, 240818634, 243356323, 247462711, 253540840, 261447792, 270533524, 279895020, 288729935, 296622715, 303627129, 310112648, 316462955, 322796021, 328862267, 334180450, 338335762, 341270103, 343388939, 345411949, 348032875, 351570930, 355806541, 360101128, 363743172, 366337242, 368022537, 369396782, 371184006, 373825188, 377219009, 380757294]
1126C80757294K883987J666718M24842k89649k11602M93012J316681J685409J271324
1135C89998016J72234j138992k065010k200470j542397m84085M01840O72302K47269
1144C84060707n55801j203766j244316n57518N71899J601143K013855J590805N25208
1153C86802216o79627j473389j542053r65538j68304L06701P9346q76808k227783l453369
1163C75801392m103775m005013l309746k380714j578865j075020p87125m70504R7274
1172C58187904R44634J849632K438088K386894J626243M22135p13082j253357r19303
1181C64969788J67121J521340K519417K697220J977653P02019n47981j251526j212578
1190C71542473o49147o2790L9940n78118j763229l062668l975220m220161l878098
$$ y = [380757294, 383641281, 385307999, 385732841, 385443192, 385231590, 385724602, 387041283, 388726692, 389998016, 390170250, 389031258, 386966248, 384765778, 383223381, 382739296, 383141136, 383813438, 384060707, 383504906, 382301140, 381056824, 380499306, 381071205, 382672348, 384686203, 386277008, 386802216, 386122589, 384649200, 383107147, 382141609, 381973305, 382280006, 382359352, 381482544, 379254761, 375801392, 371697617, 367692604, 364382858, 362002144, 360423279, 359348259, 358561134, 358090630, 358187904, 359132538, 360982170, 363420258, 365807152, 367433395, 367855530, 367142448, 365889091, 364969788, 365136909, 366658249, 369177666, 371874886, 373852539, 374554558, 374006577, 372755051, 371542473, 370893326, 370830536, 370870476, 370292358, 368529129, 365466461, 361491241, 357271080, 353392982]
1199C53392982l331832l049126l330422m161453n242271o167526o652565o678372o489467
1208C08289948o452351o862850p801132r102650j0439911j1460686j1908283j1676025
1216B32586060j0791550r364929p537365n456124l270073j129474Q25538K486554L798542
1225B02147179M768047N454006N949860O363792O799202P330570P973004Q655300R218769
1234B64659729R462147R227104Q492279P420292O317692N510120N187893N305538N597687
1243C27180481N716553N419807M708328L828736L134842K878456L050766L365936L404732
1252C62688637K841873J633453N8976j409493k339859k549515k180214j600532j193237
1261C55950089j147728j373559j576995j457711r07058r7847N92651P80563K88353
$$ y = [353392982, 350061150, 347012024, 343681602, 339520149, 334277878, 328110352, 321457787, 314779415, 308289948, 301837597, 294974747, 287173615, 278070965, 267631054, 256170368, 244262085, 232586060, 221794510, 212429581, 204892216, 199436092, 196166019, 195036545, 195862083, 198348637, 202147179, 206915226, 212369232, 218319092, 224682884, 231482086, 238812656, 246785660, 255440960, 264659729, 274121876, 283348980, 291841259, 299261551, 305579243, 311089363, 316277256, 321582794, 327180481, 332897034, 338316841, 343025169, 346853905, 349988747, 352867203, 355917969, 359283905, 362688637, 365530510, 367163963, 367222939, 365813446, 363473587, 360924072, 358743858, 357143326, 355950089, 354802361, 353428802, 351851807, 350394096, 349487038, 349389191, 349981842, 350762405, 351050758]
1270C51050758p46956j934852k826614l146554k929916k500725k296333k636414l553810
1279C28478584m773063n841847o346378o097527n202446l991031k843876k012425j518020
1288B89851971j171685o99005J02310J248475K556228L730812M507065M773102M613037
1297C09512310M251671L930168L778820L753357L666458L300820K543106J468200L28102
1306C36533012n55877r43413p97081l09258J80703L44085J7929p17048j578980k222290
1316C29951782k406387k102852j487503q22716k94075J01586N51033J298141K466011
1325C27255020L933754N347939O273651O413193N768013M652671L543091K838135K663536
1334C68689003K826614K945137K680130J940155R42994J00746k08130J45836R60655
$$ y = [351050758, 350303802, 348368950, 345542336, 342395782, 339465866, 336965141, 334668808, 332032394, 328478584, 323705521, 317863674, 311517296, 305419769, 300217323, 296226292, 293382416, 291369991, 289851971, 288680286, 287981281, 288083591, 289332066, 291888294, 295619106, 300126171, 304899273, 309512310, 313763981, 317694149, 321472969, 325226326, 328892784, 332193604, 334736710, 336204910, 336533012, 335977135, 335033722, 334236641, 333927383, 334108086, 334452171, 334470100, 333753052, 332174072, 329951782, 327545395, 325442543, 323955040, 323132324, 322838249, 322939835, 323490868, 324789009, 327255020, 331188774, 336536713, 342810364, 349223557, 354991570, 359644241, 363187332, 366025467, 368689003, 371515617, 374460754, 377140884, 379081039, 380024033, 380124779, 379916649, 380062485, 381023140]
1343C81023140J794357K187004J891594R96361j21002r84764j252136q73909j07155
1352C84553490O18515R05685N61333l44620j551247k757415l762741m522782n094528
1361C68605690n518379n717850n491028m613342k999802q34083J423111L172073L907127
1370C51933517L434906J971512O4011j628418k594338k654037j991272j031456k36626
1379C47267799Q9569r7122n99556j092949j276207r96933l08456N56679J280708J588860
1389C46412392J361084O84166j83487r23691j299858j259423r41467n83458l76320
1398C42889938l52935l80593k65960Q9645N86815R51042Q85277K65198p42875j728096
1408C42197456k234840k016678j197624k42539K60201j00212j330414k999954m422341
$$ y = [381023140, 382817497, 385004501, 386896095, 387892456, 387771454, 386786690, 385534554, 384660645, 384553490, 385172005, 386077690, 386639023, 386294403, 384743156, 381985741, 378223000, 373700218, 368605690, 363087311, 357369461, 351878433, 347265091, 344265289, 343431206, 344854317, 348026390, 351933517, 355368423, 357339935, 357403946, 355775528, 353181190, 350527153, 348535881, 347504425, 347267799, 347357368, 347260246, 346660690, 345567741, 344291534, 343294601, 342986145, 343542824, 344823532, 346412392, 347773476, 348457642, 348274155, 347350464, 346050606, 344791183, 343849716, 343266258, 342889938, 342537003, 342156410, 341890450, 341980095, 342566910, 343517952, 344403229, 344668427, 343925552, 342197456, 339962616, 337945938, 336748314, 336505775, 336765976, 336665764, 335335350, 332335396, 327913055]
1417C27913055m968376m356365k784882q42056P63474J525440J363220O41155l0174
1426C19224491j15433N60170J707573K716484K976417K212219O52581j067963k223701
1435C26642838k362137j517907j64566J054993J655121J507912Q22906m1351p86171
1444C26811638j272698j480140j406403j032677l98826K78702N81207M7645j532516
1453C20595932l872643o188755p509479p158680n135746k147770P47719K689609L428421
1462B95448608L364602L201274L448944M097577M657135M520168L392887J516380m57267
1471C23190308j835518k258702j851577j084824m66557k69927m47369p50466r37919
1480C13287449r28364q11253p37152p71408q08448n92003J69449J641559L725281O004600
$$ y = [327913055, 322944679, 318588314, 315803432, 314961376, 315724850, 317250290, 318613510, 319254665, 319224491, 319109058, 319669228, 321376801, 324093285, 327069702, 329281921, 329934502, 328866539, 326642838, 324280701, 322762794, 322598228, 323653221, 325308342, 326816254, 327639160, 327597809, 326811638, 325538940, 324058800, 322652397, 321619720, 321220894, 321499596, 322080803, 322128448, 320595932, 316723289, 310534534, 303025055, 295866375, 290730629, 288582859, 289330578, 292020187, 295448608, 298813210, 302014484, 305463428, 309561005, 314218140, 318738308, 322131195, 323647575, 323190308, 321354790, 319096088, 317244511, 316159687, 315693130, 315423203, 314975834, 314225368, 313287449, 312359085, 311547832, 310810680, 310039272, 309230824, 308638821, 308808270, 310449829, 314175110, 320179710]
1490C20179710P831803Q555984P828331N850144L401642J573562J267014K699356N191269
1499C64378815P408905P985191O220512K483407j921883n363541o644630n516319k691956
1508C66338501N96237L215981M583091M741822M116783L157883K106857R91020k22321
1517C89625854j465530k527580l145104l143882k531510j492920l09143P37572J435814
1526C77183571J687927J537705J177101R03473J004562J593170K479744L180237L103523
1535C93851013J853981n03959l380242n855636p062531o566086m551964j733856R67179
1544C67017899K809906L506088L271141K653465K235680K340698K865334L305282K976990
1553C92982483J358490j582451n229187q442039r966507q983651n552368p05147L901711
$$ y = [320179710, 328011513, 336567497, 344395828, 350245972, 353647614, 355221176, 356488190, 359187546, 364378815, 371787720, 379772911, 385993423, 388476830, 386554947, 381191406, 374546776, 369030457, 366338501, 366934738, 370150719, 374733810, 379475632, 383592415, 386750298, 388857155, 389848175, 389625854, 388160324, 385632744, 382487640, 379343758, 376812248, 375319328, 375010185, 375747757, 377183571, 378871498, 380409203, 381586304, 382489777, 383494339, 385087509, 387567253, 390747490, 393851013, 395704994, 395201035, 391820793, 385965157, 378902626, 372336540, 367784576, 366050720, 367017899, 369827805, 373333893, 376605034, 379258499, 381494179, 383834877, 386700211, 390005493, 392982483, 394340973, 392758522, 387529335, 379087296, 369120789, 360137138, 354584770, 353879623, 357781334]
1562C57781334O659889O701889M272042N88569k745285m479523m240760k592011o37894
1571C61308250N87731O17981k99759j438217k031250j672516m76532J034622K221260
1580C59851570K624550K141609J027069k47307j195526j503639j138077l42979M71840
1589C61689110R11827P74650J38932o81725j304283j473312j183167o59447k17437
1598C57995148q8845l19404p86782j303100j721153j972008k035408j894074j535835
1607C46338539j010780m88472k38419n09643j365929k590523l744850m373398m242134
1616C27774391l467598k455597j687736j483631j874123k636871l444176m015045m193039
1625C02516575l944149l332672k523556j805954j572800k200794l846626o264248q786125
$$ y = [357781334, 364441223, 371143112, 375415154, 376003723, 373258438, 368778915, 364538155, 361946144, 361308250, 361895981, 362513962, 362214203, 360775986, 358744736, 357072220, 356595688, 357630310, 359851570, 362476120, 364617729, 365644798, 365397491, 364201965, 362698326, 361560249, 361217270, 361689110, 362600937, 363375587, 363514519, 362832794, 361528511, 360055199, 358872032, 358212585, 357995148, 357906303, 357586899, 356800117, 355497017, 353775864, 351803856, 349768448, 347874374, 346338539, 345327759, 344839287, 344600868, 344091225, 342725296, 340134773, 336389923, 332016525, 327774391, 324306793, 321851196, 320163460, 318679829, 316805706, 314168835, 310724659, 306709614, 302516575, 298572426, 295239754, 292716198, 290910244, 289337444, 287136650, 283290024, 277025776, 268239651]
1634B68239651j0536804j0818120r476223p040805m528084k978516k953167m248752
1642B15659180n989971p060681o660118m698105j823387R32732K713623L295879L200035
1651A99569187L380490M655418P191524J0339756J2933293J3895263J2819500J0192357
1659B74976788P125206M754161L656388L619804L874626L623657K521801Q23765q58173
1668C04118023j986160k410775k370433k215615k091179j831970j154442N055J270866
1677B91333370J928292J313591p45202l727550o613636q371449q460292p065602m951343
1686B54640179l047104k021752k072982k995549m423008o053066p725029r341736j0743770
1695B06216183j1658440j1776447j0910835r129563o770677m325848k249060p89070
$$ y = [268239651, 257702847, 246884727, 237408504, 230367699, 225839615, 222861099, 219907932, 215659180, 209669209, 202608528, 195948410, 191250305, 189426918, 190359650, 193073273, 196369152, 199569187, 202949677, 207605095, 214796619, 225136375, 238069668, 251964931, 264784431, 274976788, 282101994, 286856155, 290512543, 294132347, 298006973, 301630630, 304152431, 304976196, 304118023, 302131863, 299721088, 297350655, 295135040, 293043861, 291211891, 290057449, 290062504, 291333370, 293261662, 294575253, 293830051, 290102501, 283488865, 275117416, 266657124, 259591522, 254640179, 251593075, 249571323, 247498341, 244502792, 240079784, 234026718, 226301689, 216959953, 206216183, 194557743, 182781296, 171870461, 162740898, 155970221, 151644373, 149395313, 148606243]
1703A48606243Q1244O16092J162606J997833L201694M605494N838222O458912O137829
1712A78706169M816723K774563N55134j232434k153244k112980j353931k80151P98778
1721A80518627J851864L120003M908218P292633R931851J2123565J3113652J2503929
1729B45364342J0521946P977314N895309N011387N405846O488609P352142P294865
1737C01311760O215630M648971L424206L151378L840867M884681N410424M800262L067551
1746C40755730Q73146q24509j284752l67851J415062L196030M204368M124260L175087
1755C55266571J913300Q97522M27742M80880Q39234J285591J725998K169800K611999
1764C67618637K927742K877541K234840R60465o97861k252274l162956l071136j964341
$$ y = [148606243, 148687487, 149303579, 150466185, 152464018, 155665712, 160271206, 166109428, 172568340, 178706169, 183522892, 186297455, 186852589, 185620155, 183466911, 181353931, 180000000, 179719849, 180518627, 182370491, 185490494, 190398712, 197691345, 207623196, 219746761, 232860413, 245364342, 255886288, 263863602, 269758911, 274770298, 280176144, 286664753, 294016895, 301311760, 307527390, 312176361, 315600567, 318751945, 322592812, 327477493, 332887917, 337688179, 340755730, 341628876, 340804367, 339519615, 339151764, 340566826, 343762856, 347967224, 352091484, 355266571, 357179871, 358077393, 358505135, 358986015, 359825249, 361110840, 362836838, 365006638, 367618637, 370546379, 373423920, 375658760, 376619225, 375921364, 373669090, 370506134, 367434998, 365470657]
1773C65470657j93405J656685K982102L371047K742806J373291j90659j314010j504593
1782C74393921o22406J017189K722549L687821L354568J707650o56472k760124l689346
1791C79155350l042984j150208J074829K580490K702942J491089l40195j800575k148094
1800C78522644j261253L31840J767693K321586J777192M99916q04100j491585j315079
1809C80348854n08156L99018R10263Q37211L70064p8468j41106K84386R92508J602745
1819C85017319J781997J413308O32591k72598j017380j437950j521645j360741j078720
1828C82156181p78007n15785k99302q5449K10114O73294J319351K023048K510949K457351
1838C89671745J660157K05230j493339k836991l316841k775688j503143r2278Q69904
$$ y = [365470657, 365277252, 366933937, 369916039, 373287086, 376029892, 377403183, 377212524, 375898514, 374393921, 373771515, 374788704, 377511253, 381199074, 384553642, 386261292, 385604820, 382844696, 379155350, 376112366, 374962158, 376036987, 378617477, 381320419, 382811508, 382471313, 380670738, 378522644, 377261391, 377593231, 379360924, 381682510, 383459702, 383959618, 383155518, 381663933, 380348854, 379840698, 380239716, 381149979, 381987190, 382357254, 382278786, 382137680, 382422066, 383414574, 385017319, 386799316, 388212624, 388845215, 388572617, 387555237, 386117287, 384595642, 383234901, 382156181, 381378174, 380862389, 380563087, 380477638, 380687752, 381361046, 382680397, 384703445, 387214394, 389671745, 391331902, 391537132, 390043793, 387206802, 383889961, 381114273, 379611130, 379518852, 380388756]
1847C80388756J103020P51838K55127M8523K89497P71142J078338Q82378J86233o38771
1857C85116081j057892p02781L72238J665230K464485K225036Q80204j088944k869262
1866C87004395l708840l282585j838379n3940J313629J792450J389618N22347k50435
1875C82888260n34020k76603K64892P17659Q20427N48363Q4610l21350n04837m61807
1885C83225594l17231k28843k90413m88777p22504q59718q01468n27115j09596L03115
1895C79183044N43595N01976J96075k14042m91028m48494p5379M27475P41654O19392
1905C80984268N5008o72684j135482j000176k43454Q04062J617127J758384J118965
1914C83286018k0446j141129j759415j665992j004334j61209M54826O17867L69148
$$ y = [380388756, 381491776, 382243614, 382498741, 382547264, 382836761, 383607903, 384686241, 385568619, 385754852, 385116081, 384058189, 383355408, 383727646, 385392876, 387857361, 390082397, 390962601, 389873657, 387004395, 383295555, 380012970, 378174591, 378120651, 379434280, 381226730, 382616348, 383138695, 382888260, 382354240, 382077637, 382342529, 383060188, 383880615, 384428978, 384513588, 384192238, 383687401, 383225594, 382908363, 382679520, 382389107, 381900330, 381177826, 380318108, 379516640, 378989525, 378879929, 379183044, 379726639, 380228615, 380424690, 380210648, 379719620, 379271126, 379195747, 379623222, 380364876, 380984268, 381039276, 380366592, 379231110, 378230934, 377987480, 378791542, 380408669, 382167053, 383286018, 383265572, 382124443, 380365028, 378699036, 377694702, 377533493, 377988319, 378606186, 378975334]
1923C78975334m5471l31574l07388J3771M47388P47566P42226M26483l0899l72658
1933C80264778l90854m8523M81377Q90160Q90960L81394m78897j327973j774177j595459
1943C77292786q57468J15013Q99315J181908R04350K72789l64647p00493o15692k17285
1953C77910576K40097M99916M36935J12153k73819m96674m32587j25923K35787M23698
1963C78530159K95830j17264o17600r37805q81729m35486K14196P66906R60465P05070
1973C78482742J30577m77829q26149p56187l21350K49901O75544P63588N01061M8294
1983C78470192l56178n24216m14467j44615Q1291R3041j47133n17769q01201q02193
1993C74936752m60281J06621O51703R20448P78618K83584l42483q20084r48372o98204
$$ y = [378975334, 378929863, 378598289, 378290901, 378304672, 378752060, 379499626, 380241852, 380668335, 380637436, 380264778, 379873924, 379825401, 380306778, 381196938, 382087898, 382469292, 381990395, 380662422, 378888245, 377292786, 376435318, 376550331, 377449646, 378631554, 379535904, 379808693, 379444046, 378743553, 378127861, 377910576, 378150673, 378650589, 379087524, 379199677, 378925858, 378429184, 377996597, 377870674, 378106461, 378530159, 378825989, 378708725, 378091125, 377153320, 376271591, 375836105, 376050301, 376817207, 377777672, 378482742, 378613319, 378135490, 377309341, 376553154, 376231804, 376481705, 377157249, 377920837, 378421898, 378470192, 378114014, 377589798, 377175331, 377030716, 377112007, 377205048, 377057915, 376540146, 375738945, 374936752, 374476471, 374583092, 375234795, 376155243, 376933861, 377217445, 376874962, 376054878, 375106506, 374408302]
2003C74408302k18086K48489M87709M18702J25312j98898l58200k59705L8758L60298
2013C75052681N05104L59459l8223n09720q23937q15506m73861M4632M90722O46515
2023C74437866M38690k3460n00107p44400o28815k10418K97851O38161O39687L05023
2033C74650078j92642o02379p22733n04951p3357L41148N21355L74680k2469m65660
2043C73303070p29561o83784l59116O9466L73878L91732J11961l17459o63796p30629
2053C70765762m61235K6093M93965P05185N44166P9537m67301q31871q41026m99573
2063C69513702J2818M37279N69839L66440l8262m07829n32837l44353N0393M27742
2073C70054932N70526L86925l8147m86413p20481o09055j97983L11890O65932O85386
$$ y = [374408302, 374190216, 374438705, 374926414, 375345116, 375470428, 375271530, 374913330, 374653625, 374692383, 375052681, 375557785, 375917244, 375879021, 375369301, 374545364, 373729858, 373255997, 373300629, 373791351, 374437866, 374876556, 374853096, 374352989, 373608589, 372979774, 372769356, 373067207, 373705368, 374345055, 374650078, 374457436, 373855057, 373132324, 372627373, 372554016, 372895164, 373416519, 373791199, 373768730, 373303070, 372573509, 371889725, 371530609, 371600075, 371973953, 372365685, 372477646, 372160187, 371496391, 370765762, 370304527, 370330620, 370824585, 371529770, 372073936, 372153473, 371686172, 370854301, 370013275, 369513702, 369526520, 369963799, 370533638, 370900078, 370861816, 370453987, 369921150, 369576797, 369627190, 370054932, 370625458, 371012383, 370974236, 370487823, 369767342, 369158287, 368960304, 369272194, 369938126, 370623512]
2083C70623512L59688j48354n84411p32079n23796p5493L73307N83343M41017J8578
2093C70335312m62380p47108o81992k96363K12783N84832O34193L47214j12419m93889
2103C69320183n94521l67965N3482M31709N52330L40042j01318n43595p54928o20919
2113C67714500k05040K84653O03523N95360K73400j89705n51644o27021l82653M6616
2123C67561989M30031N63011L73688l9864m62494o74629n67131j96762K44980N32341
2133C67765160N22003K25677j97487n25894n89447l58658M1161L94134N06630L08114
2143C68091393j09101n35621p51877o41251k52952K22435N51376N77965L04412j12342
2153C67344437m46663n24559l16162N3253L72925M62913K69775j07078m70810o33698
$$ y = [370623512, 370983200, 370834846, 370250435, 369518356, 368994560, 368919067, 369292374, 369875717, 370316734, 370335312, 369872932, 369125824, 368443832, 368147469, 368360252, 368945084, 369579277, 369926491, 369814072, 369320183, 368725662, 368357697, 368411179, 368842888, 369395218, 369735260, 369633942, 369090347, 368335419, 367714500, 367509460, 367794113, 368397636, 368992996, 369266396, 369076691, 368525047, 367898026, 367515373, 367561989, 367992020, 368555031, 368928719, 368888855, 368426361, 367751732, 367184601, 366987839, 367232819, 367765160, 368287163, 368512840, 368315353, 367789459, 367200012, 366841354, 366882515, 367276649, 367783279, 368091393, 367982292, 367446671, 366694794, 366053543, 365800591, 366023026, 366574402, 367152367, 367456779, 367344437, 366897774, 366373215, 366057053, 366110306, 366483231, 366946144, 367215919, 367108841, 366638031, 366004333]
2163C66004333n13648j75095K08282M45786M26597J73951j70632m22401m48456k34985
2173C65293732J05667L92456M67148K76107j00402m86527o97021o29883l17726Q9264
2183C64392815L98788M74625L02925l739k70080l51639k11754O1455L05824L75366
2193C65474586K21673p7973l62282m73442l45154m0931K77366M36058L43552M1351
2203C65494804l16658n45463n27573k75688P5378L41988L88451J97334j25694m11721
2213C64295158n20515m10767j57203R6016K15835J49841m9629k57568l46451k55508
2223C62759209k2812K33383L76244L20434P9079k40936m90532n51567l97797j09367
2233C61955338J66740K89841J99127n5161l35884m89654m26941j68381J63879M09890
$$ y = [366004333, 365490685, 365315590, 365523872, 365969658, 366396255, 366570206, 366399574, 365977173, 365528717, 365293732, 365399399, 365791855, 366259003, 366535110, 366434708, 365948181, 365251160, 364621277, 364303551, 364392815, 364791603, 365266228, 365569153, 365565414, 365295334, 364943695, 364731941, 364793396, 365099220, 365474586, 365696259, 365618286, 365256004, 364782562, 364437408, 364396477, 364673843, 365109901, 365453453, 365494804, 365178146, 364632683, 364105110, 363829422, 363904800, 364246788, 364635239, 364832573, 364706879, 364295158, 363774643, 363363876, 363206673, 363302689, 363518524, 363668365, 363618736, 363361168, 363014717, 362759209, 362736397, 362969780, 363346024, 363666458, 363745537, 363504601, 363014069, 362462502, 362064705, 361955338, 362122078, 362411919, 362611046, 362555885, 362220001, 361730347, 361303406, 361135025, 361298904, 361708794]
2243C61708794M53605K82860o447k60887l51677k41318j792K24914L05100J86004p4196
2254C62224960l36799m57306l63541r6931K08664L97033L72200J47972j60789m00314
2264C61535149m58985l23219p9536J35688K08817J07117j09597l23143m19998l46870
2274C59925423j33515J26419L25165L94325L36228K19879J39923J64032K93579M58679
2284C62250137N55306N03654K97585J6823k10572k74810j46447J04676L43933M45060
2294C63885345L60642J52168l9520o7215J43967N52787J013794J339951J384010J103516
2304C69829445N81055p286m60206o25572m54826j3046N52826J070556J401024J470032
2314C73344002J272506Q54226K91862l19633q73299j261330j403122j280555r58443
$$ y = [361708794, 362162399, 362445259, 362438812, 362177925, 361826248, 361584930, 361583138, 361808052, 362113152, 362299156, 362224960, 361888161, 361430855, 361067314, 360970383, 361179047, 361576080, 361948280, 362096252, 361935463, 361535149, 361076164, 360752945, 360673409, 360809097, 361017914, 361125031, 361015434, 360692291, 360272293, 359925423, 359791908, 359918327, 360243492, 360637817, 360974045, 361193924, 361333847, 361497879, 361791458, 362250137, 362805443, 363309097, 363606682, 363623505, 363412933, 363138123, 362991676, 363096352, 363440285, 363885345, 364245987, 364398155, 364358635, 364291420, 364435387, 364988174, 366001968, 367341919, 368725929, 369829445, 370410500, 370403214, 369943008, 369317436, 368862610, 368849564, 369402390, 370472946, 371873970, 373344002, 374616508, 375470734, 375762596, 375442963, 374569664, 373308334, 371905212, 370624657, 369666214]
2323C69666214n68275k54670j08528j27716k31781l20167l35312k88239k32429k18926
2333C66980171k74925m33426p81403j464424k599678m118385n636406o477318n902862
2342C39291344l479042O05240N465469R783668J2308770J2361221J0086365O334648
2350C92757683K245788j232719l650055n058327n780563o122131o204529n990372n432320
2359C55532455m608879l740272l079987k766609k746048k813873k748451k440377j941108
2368C28646851j407242r90525p44514o03600m33654j15280L91883J033783J691399
2377C27469101K233200K563972K653428K541122K316437K082252J910324J809159J721306
2386C47300301J557083J252517Q18024L49770j1597j52969n3940J96991M43649N42717
$$ y = [369666214, 369097939, 368843269, 368734741, 368607025, 368375244, 368055077, 367719765, 367431526, 367199097, 366980171, 366705246, 366271820, 365490417, 364025993, 361426315, 357307930, 351671524, 345194206, 339291344, 335812302, 336417542, 341883011, 351666679, 363975449, 376336670, 386423035, 392757683, 395003471, 393770752, 390120697, 385062370, 379281807, 373159676, 366955147, 360964775, 355532455, 350923576, 347183304, 344103317, 341336708, 338590660, 335776787, 333028336, 330587959, 328646851, 327239609, 326249084, 325504570, 324900970, 324467316, 324352036, 324743919, 325777702, 327469101, 329702301, 332266273, 334919701, 337460823, 339777260, 341859512, 343769836, 345578995, 347300301, 348857384, 350109901, 350927925, 351277695, 351266098, 351113129, 351059189, 351256180, 351699829, 352242546]
2396C52242546M36363J78376r9488k61574k40631o9656J39084K57225K08092O408k51159
2407C52545586m36364m56085l00865n0087J67236K39792J31645r7274l21732m15993
2417C51005859l21655q0528J85623L37334K89917N9471k44827m74129n15099l45573
2427C49896393m5510K44179L89557L30467J05973j65291l47061l54920j97487K7657
2437C49883957J87073J83258Q087k49901m52728m86984l27149n2185J95236K84310
2447C49172974J66893r6550l68920n09071m44870k09999P6790K74276K91367J31874
2457C48484764j10588l03612l43780k09198K9831K47764L26424K16980l5019l11165
2467C47992401m78096m56123k59819Q507K11524K46583R9716j49117l69491m49524
$$ y = [352242546, 352678909, 352857285, 352757797, 352496223, 352255592, 352185936, 352325020, 352582245, 352790337, 352796745, 352545586, 352109222, 351653137, 351352272, 351302185, 351469421, 351709213, 351840858, 351743584, 351421852, 351005859, 350684204, 350603676, 350789299, 351126633, 351416550, 351476021, 351231194, 350757065, 350241966, 349896393, 349850883, 350095062, 350484619, 350815086, 350921059, 350755768, 350408707, 350053787, 349856300, 349883957, 350071030, 350254288, 350262375, 350012474, 349559746, 349072762, 348745613, 348693428, 348888664, 349172974, 349339867, 349243317, 348874397, 348365326, 347920456, 347710457, 347787247, 348061523, 348352890, 348484764, 348374176, 348070564, 347726784, 347517586, 347547417, 347795181, 348121605, 348338585, 348303566, 347992401, 347514305, 347058182, 346798363, 346806870, 347018394, 347264977, 347364693, 347215576, 346846085, 346396561]
2477C46396561l55645j47743N4894J39885O2408j31721l30582m16908l30849j01013
2487C44839287J68686L51677L61633J94092p2022l15399m30832l80173k07061j2474
2497C44497414R8304O8818q1330k68936l91273l79906k36092k9182J41067J95732J18790
2508C43733406l7041j79176k27318j55678q735J24855J60370O5841j18713l01170l84941
2519C42671700l21961j39160P5149K17438K24076J03569o8474j93405k03171r8458
2529C42267303N3406J55907J37825o027k11449l77045m18090l10746j03683J06430
2539C41293831K25296K05841O9809j06773k34452k54936j67084k3956R8953J42212
2549C41248741R2163j5411j17378j58005j19248k8495N5771P6751J1139j16539k44598
$$ y = [346396561, 346040916, 345893173, 345948067, 346087952, 346150360, 346018639, 345688057, 345271149, 344940300, 344839287, 345007973, 345359650, 345721283, 345915375, 345843353, 345527954, 345097122, 344716949, 344509888, 344497414, 344595718, 344664536, 344583206, 344314270, 343922997, 343543091, 343306999, 343277817, 343418884, 343614616, 343733406, 343696365, 343517189, 343289871, 343134193, 343125458, 343250313, 343410683, 343476524, 343357811, 343056641, 342671700, 342349739, 342210579, 342285728, 342503166, 342727242, 342830811, 342762337, 342568932, 342365761, 342267303, 342320709, 342476616, 342614441, 342608414, 342396965, 342019920, 341601830, 341291084, 341187401, 341293831, 341519127, 341724968, 341794777, 341688004, 341453552, 341198616, 341031532, 341007576, 341106529, 341248741, 341340904, 341325493, 341208115, 341050110, 340930862, 340902367, 340958138, 341034889, 341046028, 340929489, 340684891]
2560C40684891l04871k59285j21040M8561J70288J87416R6512n0087j69563j93749
2570C40089073j06392M5395J75400K04430J03912q5297k74162l71666l34473j89170
2580C39257050j8807Q2893O1341p0458k41508l60794l67012k57607q7929O1417J26610
2591C38185196R1324j0109j15509j70326j55106r1667k6207o11k8228q7662j36681
2602C37454414j38969q6250n608N4817N3406k0676j37024k38571k69432k05307o8703
2613C36392097P9537J69754J56708M3258j20201k58941l09410k49863j10092M3029
2623C35835876J38283J34354L9673r3041j93596k11029j38397j7433Q5449J13144M9667
2634C35742950p1983j86920k33460j86271o9542N5771J25160J04713Q431j10779j89018
$$ y = [340684891, 340380020, 340120735, 339999695, 340048256, 340218544, 340405960, 340502472, 340452385, 340282822, 340089073, 339982681, 340028076, 340203476, 340407906, 340511818, 340426521, 340152359, 339780693, 339446220, 339257050, 339238243, 339321136, 339382477, 339312019, 339070511, 338709717, 338342705, 338085098, 337997169, 338058586, 338185196, 338276520, 338266411, 338150902, 337980576, 337825470, 337733803, 337707596, 337706985, 337678757, 337591095, 337454414, 337315445, 337229195, 337223587, 337278404, 337331810, 337311134, 337174110, 336935539, 336666107, 336460800, 336392097, 336471634, 336641388, 336798096, 336841354, 336721153, 336462212, 336152802, 335902939, 335792847, 335835876, 335974159, 336108513, 336148186, 336055145, 335861549, 335650520, 335512123, 335494690, 335580139, 335693283, 335742950, 335670967, 335484047, 335250587, 335064316, 334994774, 335050545, 335175705, 335280418, 335288849, 335178070, 334989052]
2645C34989052j86920j08605K060Q5106R8419L8758n6992j33629j48926r7122j4000
2656C34467201M4213L2653n4397j76583k66418k65541j58043J6327J79062K51503J94549
2667C34264526L1128j64718l02391l19825k12555l4942J27067J97983J47667M501j61323
2678C33577118k71263k76528j80206l3417Q9493J28975O8741n5847j76773k29531j87263
2689C32453499p6332L7460Q5068L4141r0713k18277k70538k06566m9553J21765K14081
2700C32034035J69372r15k18621l78799m02489k78587o8550J25542K13890J63612J2970
2711C31371460j51215k40898k11754q3999P1373J71432J64795N5466j02806k36855
2721C30806999k93770k66647j94321j37481j43509k19727l28827m09736m08707l10669
$$ y = [334989052, 334802132, 334693527, 334695587, 334780693, 334879112, 334917870, 334860878, 334727249, 334578323, 334481201, 334467201, 334511414, 334544067, 334489670, 334313087, 334046669, 333781128, 333623085, 333639412, 333818474, 334069977, 334264526, 334295654, 334130936, 333828545, 333508720, 333296165, 333261223, 333388290, 333586273, 333733940, 333738441, 333577118, 333305855, 333029327, 332849121, 332815704, 332905197, 333034172, 333102913, 333047066, 332870293, 332640762, 332453499, 332377167, 332414627, 332499695, 332533836, 332443123, 332224846, 331954308, 331747742, 331698189, 331819954, 332034035, 332203407, 332202492, 331983871, 331605072, 331202583, 330923996, 330855446, 330980988, 331194878, 331358490, 331371460, 331220245, 330979347, 330767593, 330683594, 330754967, 330926399, 331091194, 331146660, 331043854, 330806999, 330513229, 330246582, 330052261, 329914780, 329771271, 329551544, 329222717, 328812981, 328404274, 328093605]
2731C28093605j47819J2931J02578Q2740l4256j90239l08113l28483k38419p8010P7667
2742C27044182J55563J19667j1139j71699k83356k91939j94549l9673R8419J56365
2752C26581841J14212K288j16386j81389j66168r0904r499K1553k5329j32332k46773
2763C25751114l08800k84195j82915n3520M2000O0043l433j14097k19498k78130k79617
2774C24128952k46277k16675k21214k64206l22571l59115l44734k74086j69831p0305
2784C21639938j2130j2894o4621j38664j99318k19460j91726j30158o4125k3727k6436
2795C20556679o8550j26572j68571j69487j24913n3405J1978M0340K0104l5840r6874
2806C19784889j31187j24207q6460m8046m1218q2264j59759k39067k78874k52418j62773
$$ y = [328093605, 327945786, 327958717, 328061295, 328144035, 328109779, 327919540, 327611427, 327282944, 327044525, 326966515, 327044182, 327199745, 327319412, 327308273, 327136574, 326853218, 326561279, 326366730, 326327057, 326425476, 326581841, 326696053, 326698341, 326581955, 326400566, 326234398, 326143494, 326133995, 326155548, 326130219, 325997887, 325751114, 325442314, 325158119, 324975204, 324921684, 324963684, 325023727, 325020294, 324906197, 324686699, 324408569, 324128952, 323882675, 323666000, 323444786, 323180580, 322858009, 322498894, 322154160, 321880074, 321710243, 321639938, 321627808, 321614914, 321550293, 321411629, 321212311, 320992851, 320801125, 320670967, 320606842, 320583115, 320556679, 320488129, 320361557, 320192986, 320023499, 319898586, 319845181, 319857159, 319897499, 319917603, 319881763, 319784889, 319653702, 319529495, 319443035, 319394989, 319353771, 319271507, 319111748, 318872681, 318593807, 318341389, 318178616]
2817C18178616m2763N8632J00002O6090k4147j27812j99375k12631j72806j11446o7692
2828C17444668o6166j04256j54800j83468j70040j20583o4506l6488n6305j17187j89896
2839C16180973k39506k46925k18372j82934j75057k15778l00751m02050m82311n11990
2849C13205299m82177m07639l17879k44827k09217k14272k48451k92206l29437l55339
2859C10103855l77903m12197m70142n50328o34269o92635o98013o40812n36842m23203
2869C04667511l43094l25088l69435m47578n16186n39684n07851m40426l76301l51677
2879C00450191l81431m50554n23109n60379n41230m72030l82977l13492k95314l39871
2889B96189804m37221n62973o88496p89280q48293q56629q13064p25289o11458m98561
$$ y = [318178616, 318135853, 318194485, 318294487, 318360577, 318336430, 318208618, 318009243, 317796612, 317623806, 317512360, 317444668, 317378502, 317274246, 317119446, 316935978, 316765938, 316645355, 316580849, 316544361, 316488056, 316370869, 316180973, 315941467, 315694542, 315476170, 315293236, 315118179, 314902401, 314601650, 314199600, 313717289, 313205299, 312723122, 312315483, 311997604, 311752777, 311543560, 311329288, 311080837, 310788631, 310459194, 310103855, 309725952, 309313755, 308843613, 308293285, 307659016, 306966381, 306268368, 305627556, 305090714, 304667511, 304324417, 303999329, 303629894, 303182316, 302666130, 302126446, 301618595, 301178169, 300801868, 300450191, 300068760, 299618206, 299095097, 298534718, 297993488, 297521458, 297138481, 296824989, 296529675, 296189804, 295752583, 295189610, 294501114, 293711834, 292863541, 292006912, 291193848, 290468559, 289857101, 289358540]
2899B89358540m15764l84312m07963m68445n31520n60265n30663m42523l20511k04869
2909B85091705j36890j42746k24972l60393n08557o25248o78405o59714n88684n04532
2919B80661564m50611m53968n13783o00071o68525o81897o27193n21240m00372k99644
2929B75444260k36645k04411j79672j39065p3394R021Q8558J47782J79958J91365J93462
2940B75421219J94836J94568J84460J53122R4795J0967q9130j92051k84576l55587
2950B75332623l98159m09852l92379l50743k90279k15225j28250l2006O6872J56364
2960B73338966K20013K42901K18181J51749O0158l6259j21670j90753k47670l01075
2970B73334541l56903m13189m60014m82559m65794l99036k78397j08547R6340L15113
$$ y = [289358540, 288942776, 288558464, 288150501, 287682056, 287150536, 286590271, 286059608, 285617085, 285296574, 285091705, 284954815, 284812069, 284587097, 284226704, 283718147, 283092899, 282414494, 281754780, 281166096, 280661564, 280210953, 279756985, 279243202, 278643131, 277974606, 277292709, 276665516, 276144276, 275743904, 275444260, 275207615, 275003204, 274823532, 274684467, 274611073, 274620094, 274708652, 274856434, 275036392, 275227757, 275421219, 275616055, 275810623, 275995083, 276148205, 276243000, 276253967, 276164837, 275972786, 275688210, 275332623, 274934464, 274524612, 274132233, 273781490, 273491211, 273275986, 273147736, 273115730, 273182602, 273338966, 273558979, 273801880, 274020061, 274171810, 274231968, 274195709, 274074039, 273883286, 273635616, 273334541, 272977638, 272564449, 272104435, 271621876, 271156082, 270757046, 270478649, 270370102, 270466442, 270781555]
2980B70781555N22289O94676Q16498Q82435Q95881Q65669Q00667P10068O05564N04742
2990B78080044M30012M03041M34285N15632O20728P16285P77016P98321P97729Q02308
3000B84375401Q30917Q79059R18255R09385Q25138O66371M66060K73972J34506O4793
3010B90343857N0125N4989M4727O333m6158q2741p7496k7752M1447Q9226Q0910P133
3022B90484600j10378k29988l11356l34949l09773k65255k33478k32201k57339k87591
3032B87912292k98957k78721k32754j84040j61552j89019k73571m02679n47218o70586
3042B84673195p40433p40795o78673n82924m94136m49715m67720n40085o36158p16648
3052B78625908p52182p36370o87275o37322o16626o37303o89678p46097p76406p61852
$$ y = [270781555, 271303844, 271998520, 272815018, 273697453, 274593334, 275459003, 276259670, 276969738, 277575302, 278080044, 278510056, 278913097, 279347382, 279863014, 280483742, 281200027, 281977043, 282775364, 283573093, 284375401, 285206318, 286085377, 287003632, 287913017, 288738155, 289404526, 289870586, 290144558, 290279064, 290343857, 290393982, 290448971, 290493698, 290500031, 290453873, 290371132, 290293636, 290265884, 290307331, 290396557, 290477467, 290484600, 290374222, 290144234, 289832878, 289497929, 289188156, 288922901, 288689423, 288457222, 288199883, 287912292, 287613335, 287334614, 287101860, 286917820, 286756268, 286567249, 286293678, 285890999, 285343781, 284673195, 283932762, 283191967, 282513294, 281930370, 281436234, 280986519, 280518799, 279978714, 279342556, 278625908, 277873726, 277137356, 276450081, 275812759, 275196133, 274558830, 273869152, 273123055, 272346649, 271584797]
3062B71584797p02152o16207n31598m74319m59175m87156n48115o27441p11537p92102
3072B65634995q64964r29012r83334j025810j054688j068821j068515j055088j028538
3081B56556225r86271r24931q43353p47147o50463n73616n35431n44204n92041o55632
3091B49503136p04842p15828o80866o11363n31253m65165m26731m14085m13227m07505
3101B44132271l87116l53412l17231k91042k83394k93827l13778l30639l31916l09430
3111B40920486k61669j94473j20392n4493r365J2436K1248L8223Q6174J77841L06797
3122B40922813M47503N65910O34365O45008O12431N64899N29480N19238N30433N48897
3132B46520977N63545N72796N85537O10828O48518O85425P01733O83631O33641N71556
$$ y = [271584797, 270882645, 270266438, 269734840, 269260521, 268801346, 268314190, 267766075, 267138634, 266427097, 265634995, 264770031, 263841019, 262857685, 261831875, 260777187, 259708366, 258639851, 257584763, 256556225, 255569954, 254645023, 253801670, 253054523, 252404060, 251830444, 251295013, 250750809, 250158768, 249503136, 248798294, 248082466, 247401600, 246790237, 246258984, 245793819, 245367088, 244953003, 244539776, 244132271, 243745155, 243391743, 243074512, 242783470, 242500076, 242206249, 241892471, 241561832, 241229916, 240920486, 240658817, 240464344, 240343952, 240289459, 240280094, 240292530, 240313778, 240352001, 240438175, 240616016, 240922813, 241370316, 241936226, 242570591, 243215599, 243828030, 244392929, 244922409, 245441647, 245972080, 246520977, 247084522, 247657318, 248242855, 248853683, 249502201, 250187626, 250889359, 251572990, 252206631, 252778187]
3142B52778187N23319N05505N14717N28259N17616M66500L81202K88449K20489J96057
3152B56920300K10170K36435K42520K08282J36261M8447k7428p3471r1000r5901j07556
3163B57607059j34849j71623k01874k11792k00920j84059j83907k16961k82650l61309
3173B55457115m22954m42372m12388l47976k80400k42462k54993l17993m12865n10693
3183B51812019n84392o18115o10923n75486n30929m96826m87385n06649n48344n97839
3193B46255131o36978o51284o36291o00357n62496n43805n59349o09893o82126p54756
3203B40017796q07534q30726q27084q09059p91836p86342p95422q14819q36335q52127
3213B31866512q57162q51174q37726q23441q14876q16021q24566q32214q27332q01048
$$ y = [252778187, 253301506, 253807011, 254321728, 254849987, 255367603, 255834103, 256215305, 256503754, 256724243, 256920300, 257130470, 257366905, 257609425, 257817707, 257953968, 258002415, 257974987, 257901516, 257810516, 257714615, 257607059, 257472210, 257300587, 257098713, 256886921, 256686001, 256501942, 256318035, 256101074, 255818424, 255457115, 255034161, 254591789, 254179401, 253831425, 253551025, 253308563, 253053570, 252735577, 252322712, 251812019, 251227627, 250609512, 249998589, 249423103, 248892174, 248395348, 247907963, 247401314, 246852970, 246255131, 245618153, 244966869, 244330578, 243730221, 243167725, 242623920, 242064571, 241454678, 240772552, 240017796, 239210262, 238379536, 237552452, 236743393, 235951557, 235165215, 234369793, 233554974, 232718639, 231866512, 231009350, 230158176, 229320450, 228497009, 227682133, 226866112, 226041546, 225209332, 224382000, 223580952]
3223B23580952p52545o90689o30340n84469n58071n45674n36976n24196n08003m96350
3233B17753639m97112n10178n23567n18818m80881m07066l08590k03171j03454r670
3243B14191132Q7909J99528L23601M42810N31921N72491N66940N41172N34325N79033
3253B18570862O84528Q32749R87052J112137J190472J229210J252594J286945J345120
3262B28491669J420192J489506J527157J515408J452827J353455J240539J137905J062012
3271B40690670J017761R98574R90371R78127R53140R18007Q85868Q74386Q95061R44805
3281B50146770J002961J038932J025849R53731Q35438P02210N88703N18646M96635
3290B57309875N09129N35889N60531N77259N89161O01464O14414O20499O08253N67722
$$ y = [223580952, 222828407, 222137718, 221507378, 220922909, 220364838, 219819164, 219282188, 218757992, 218249989, 217753639, 217256527, 216746349, 216222782, 215703964, 215223083, 214816017, 214507427, 214304256, 214200802, 214191132, 214279041, 214478569, 214802170, 215244980, 215776901, 216349392, 216916332, 217457504, 217991829, 218570862, 219255390, 220088139, 221075191, 222187328, 223377800, 224607010, 225859604, 227146549, 228491669, 229911861, 231401367, 232928524, 234443932, 235896759, 237250214, 238490753, 239628658, 240690670, 241708431, 242707005, 243697376, 244675503, 245628643, 246546650, 247432518, 248306904, 249201965, 250146770, 251149731, 252188663, 253214512, 254168243, 255003681, 255705891, 256294594, 256813240, 257309875, 257819004, 258354893, 258915424, 259492683, 260081844, 260683308, 261297722, 261918221, 262526474, 263094196]
3300B63094196M95243L95718K79732J60808N1403l8528j02348j37787j46523j33285
3310B63918629j03855o2924j3103M4059J04237J59607J97773K05631J75991J10226
3320B64736271K0847p2613j48963j92967j99585j76048j39027j09424j03703j28174
3330B63486614j75934k30007k72655k94171k97527k95887l01933l18337l34186l31497
3340B60634480k97909k37541j72005j29624j29566j70631k32601k88544l20473l28464
3350B58327122l25966l27549l37486l46966l43838l24497l01075k96021l27930l96957
3360B54998837m81339n45330n57728n06267m03614k80323j70212r7142o7539p2059
3370B51817284r1687j07879j09120r6035q0509q1196j13506j80836k69165l50780l96462
$$ y = [263094196, 263589439, 263985157, 264264889, 264425697, 264477100, 264438572, 264336224, 264198437, 264051914, 263918629, 263814774, 263751850, 263738747, 263782806, 263887043, 264046650, 264244423, 264450054, 264626045, 264736271, 264757118, 264684505, 264535542, 264342575, 264142990, 263966942, 263827915, 263718491, 263614788, 263486614, 263310680, 263080673, 262808018, 262513847, 262216320, 261920433, 261618500, 261300163, 260965977, 260634480, 260336571, 260099030, 259927025, 259797401, 259667835, 259497204, 259264603, 258976059, 258655586, 258327122, 258001156, 257673607, 257336121, 256989155, 256645317, 256320820, 256019745, 255723724, 255395794, 254998837, 254517498, 253972168, 253414440, 252908173, 252504559, 252224236, 252054024, 251956882, 251889343, 251817284, 251725597, 251617718, 251508598, 251412563, 251332054, 251250858, 251137352, 250956516, 250687351, 250336571, 249940109]
3381B49940109l90415l39012k68974k13242j93729k10228k43245k66780k65217k41127
3391B47308140k12536j98650k07367k30580k49672k48794k24266j86081j51806j35594
3401B45262794j41792j64394j92032k13242k19688k05860j69964j14918n2032j583
3411B43787289J2474k6799j18503k38590l46527m01993l81947k92454j65042m2248
3421B41785660M0931P1011N7774K5234o49l910J7701N5007R3194J18274J22605J07956
3433B42490788Q5792P3433Q4648J19419J57776J64051J03150l6965k29778m12922n11208
3444B42088184m70771k87590j2532K69432M75827N60493N26848M16679K84233J70613
3454B44021416R3136M8522K7009K1801L2672O1760J08567J67999K31323K87285L23162
$$ y = [249940109, 249549694, 249210682, 248941708, 248728466, 248534737, 248324509, 248081264, 247814484, 247549267, 247308140, 247095604, 246896954, 246689587, 246459007, 246209335, 245960541, 245736275, 245550194, 245398388, 245262794, 245121002, 244956608, 244764576, 244551334, 244331646, 244125786, 243955822, 243840904, 243788872, 243787289, 243799763, 243772964, 243654461, 243415871, 243069344, 242667351, 242285404, 241992950, 241827908, 241785660, 241826591, 241897602, 241955376, 241980610, 241979961, 241976051, 241993752, 242048759, 242141953, 242260227, 242382832, 242490788, 242576580, 242650013, 242734661, 242854080, 243011856, 243175907, 243279057, 243242092, 243012314, 242599392, 242088184, 241617413, 241329823, 241317291, 241586723, 242062550, 242623043, 243149891, 243566570, 243850803, 244021416, 244114552, 244163074, 244190083, 244211884, 244244556, 244306316, 244414883, 244582882, 244814205, 245101490, 245424652]
3465B45424652L25928K87666K12975J24645N8880M9076J05076K01359K85015L02906
3475B47378178K33173J00498l4771j09939r3575O49J28460K44121L26500L80821M21582
3486B48975697M51793M57840M25358L61652L03231K97279L64628M73499N46017N01537
3496B53158531L11375K8629k31514l52535k84004p2918J61609K96193K72255J25484
3506B53413105l9959j13277l7156J67637M24462O46476P79934Q17604P84417P09266
3516B57552509O05507M68769K91596P8697j45760l42216m66480m81358l67355j32542
3526B57061367J79443M90570P08600P64541O54583M59271L19748L67565O42833J046009
3536B62694530J365452J376419R68991K28100n85690j157131j274548r38129l52135
$$ y = [245424652, 245750580, 246038246, 246251221, 246375866, 246434746, 246483822, 246588898, 246790257, 247075272, 247378178, 247611351, 247711849, 247677078, 247567139, 247473564, 247474213, 247602673, 247846794, 248173294, 248554115, 248975697, 249427490, 249885330, 250310688, 250672340, 250975571, 251272850, 251637478, 252110977, 252656994, 253158531, 253469906, 253498535, 253267021, 252914486, 252630482, 252557564, 252719173, 253015366, 253287621, 253413105, 253373146, 253259869, 253222713, 253390350, 253814812, 254461288, 255241222, 256058826, 256843243, 257552509, 258158016, 258626785, 258918381, 258997078, 258851318, 258509102, 258042622, 257561264, 257193909, 257061367, 257240810, 257731380, 258439980, 259204521, 259859104, 260318375, 260638123, 261005688, 261648521, 262694530, 264059982, 265436401, 266405392, 266633492, 266047802, 264890671, 263616123, 262677994, 262325859]
3545B62325859J94874M89673M98601L57646K63558L45154N99670R29108J236439J498355
3555B68738937J751919K005634K150479J961059J215840j24550j800556l296337m048748
3564B68553677l714638k353611m15230J459007K712555L084908K665767J798497R08870
3573B74699802L50266L14693Q00400J618538K428684K825775K482567J315556m15306
3582B86420975k154637l265800l321762k321320p00950Q75530J835975J951943J391811
3591B80711765N67417j08490m07238l18431M1046N46455J117745J687316K138958K299767
3601B88276310K012367J247978J74256q80280j554260j608143j025581k3976J018830
3610B87637501J684589J652012Q26778n64670j978531k702923k153511k09331K591419
$$ y = [262325859, 262520733, 263010406, 263509007, 263866653, 264130211, 264475365, 265075035, 266004143, 267240582, 268738937, 270490856, 272496490, 274646969, 276608028, 277823868, 277699318, 275898762, 272602425, 268553677, 264839039, 262485428, 262070198, 263529205, 266241760, 269326668, 271992435, 273790932, 274699802, 275050068, 275364761, 276165161, 277783699, 280212383, 283038158, 285520725, 286836281, 286420975, 284266338, 281000538, 277678776, 275357456, 274656506, 275532036, 277368011, 279319954, 280711765, 281279182, 281170692, 280763454, 280445023, 280486069, 281032524, 282150269, 283837585, 285976543, 288276310, 290288677, 291536655, 291710911, 290830631, 289276371, 287668228, 286642647, 286618671, 287637501, 289322090, 290974102, 291800880, 291236210, 289257679, 286554756, 284401245, 284191914, 286783333]
3619B86783333N158176O275826N185909K016792k188549n903797p800312p328720m901924
3628B77296734j612511J327172L108482L564319L071099K253132J686020J723480K445736
3637B94863663L659782M915104N570927M982376K799167p52143m793816q056145r404125
3646B93784790q374920n426006j735859J350822K929745K879410J785278N44377r5959
3655B87641678J81522J250115K714977M118595N070686N300465M688396L313733J480350
3664C15760517l48740j732540k470626k716866k883663l369293m264164n235329n674706
3673B87064590n031070l126698k70614K874851N572548P255058P627106O636944M418277
3682C13020992J287079k219601n358715p334995p578888o011276l128300J72291K945709
$$ y = [286783333, 291941509, 298217335, 303403244, 305420036, 303231487, 297327690, 289527378, 282198658, 277296734, 275684223, 277011395, 280119877, 283684196, 286755295, 289008427, 290694447, 292417927, 294863663, 298523445, 303438549, 309009476, 313991852, 316791019, 316038876, 311245060, 303188915, 293784790, 285409870, 279983864, 278248005, 279598827, 282528572, 285407982, 287193260, 287737637, 287641678, 287823200, 289073315, 291788292, 295906887, 300977573, 306278038, 310966434, 314280167, 315760517, 315411777, 313679237, 311208611, 308491745, 305608082, 302238789, 297974625, 292739296, 287064590, 282033520, 278906822, 278636208, 281511059, 287083607, 294338665, 301965771, 308602715, 313020992, 314308071, 312088470, 306729755, 299394760, 291815872, 285804596, 282676296, 282848587, 285794296]
3691B85794296M548912M809285L964557K464867P88250o42185j466122j414166m17766
3700B98429928J249618K936364L793621L150863R05056k313823n341053o973877o519184
3709B89317513m107285o12507K759018M987125N601807M750118K997303J015473o67191
3718C06041374j763725k187691j956577j128750J86386J767025L228073M050026L722401
3727C11958542J976051r88216m411049p131882q000946o402454k639847K056427N977917
3736B92394543P675361O630173L493385k58636l086796m154892l674564k642956k150402
3745B94225216k683640l847980m660015m212189k280998M97265K980766M174576L776645
3754B87969646K300091P26395p2384K07939J210365K196084K489223J822414M17996
$$ y = [285794296, 290343208, 295152493, 299117050, 301581917, 302370167, 301727982, 300261860, 298847694, 298429928, 299679546, 302615910, 306409531, 309560394, 310465450, 308151627, 302810574, 295836697, 289317513, 285210228, 284597721, 287356739, 292343864, 297945671, 302695789, 305693092, 306708565, 306041374, 304277649, 302089958, 300133381, 299004631, 299191017, 300958042, 304186115, 308236141, 311958542, 313934593, 312946377, 308535328, 301403446, 293402500, 287000046, 284360199, 286416626, 292394543, 300069904, 306700077, 310193462, 309934826, 306848030, 302693138, 299018574, 296375618, 294225216, 291541576, 287693596, 283033581, 278821392, 276540394, 277037659, 280018425, 284193001, 287969646, 290269737, 290996132, 290923748, 291131687, 292342052, 294538136, 297027359, 298849773, 299267769]
3763B99267769j180802k387447k801418k307205j061707N75447K130242L122863L208103
3772B98565845K316628P25822j011638k285919k700253k248363j289349l29075K62070
3781B92005768M27265L93810M74091Q39901J420975J981105K298165K307529K104168
3790C04252777J818714J476193R62162J28364j039962k334252l395138l910598l802491
3799B94155769l262252k600403k012673j434326n98087P29580K496395M279270N447788
3808B97201061N487442M286595K205810j11885k064876l350201m005776m240913m200096
3817B91207161l833294k964439j497193M03309K298832L665161M166641L836823L044968
3826C00327969K259750J760635J479035J071834J82782j281205l032379m525852n245533
$$ y = [299267769, 298086967, 295699520, 292898102, 290590897, 289529190, 290104637, 292234879, 295357742, 298565845, 300882473, 301608295, 300596657, 298310738, 295610485, 293362122, 292072773, 291743698, 292005768, 292433033, 292826843, 293300934, 294140835, 295561810, 297542915, 299841080, 302148609, 304252777, 306071491, 307547684, 308509846, 308638210, 307598248, 305263996, 301868858, 297958260, 294155769, 290893517, 288293114, 286280441, 284846115, 284248028, 284977608, 287474003, 291753273, 297201061, 302688503, 306975098, 309180908, 309069023, 307004147, 303653946, 299648170, 295407257, 291207161, 287373867, 284409428, 282912235, 283315544, 285614376, 289279537, 293446178, 297283001, 300327969, 302587719, 304348354, 305827389, 306899223, 307082005, 305800800, 302768421, 298242569, 292997036]
3835B92997036m972439l866062k313309o53267J024800K858505M963741P125988Q666973
3844C05831966Q637848O298199J638718m363156r957103j3263340j3067208r378204
3852B72377720l466339K654094P054902Q646907P515240M718113J689434m34151j243209
3861B99512711j073704o66008o82869j349754k376748l169975l182583k212791n00317
3870B84297962J401119K885781L546257L296795K338371J021519l02735j369915k020035
3879B95095119k183380j876106j216965m32262J95599M43115K73990j02748l06626
3888B89889736K0619R93957K364311L581658M025230L293076J404590j185913l764152
3897C00623112n629769o338501n815086m313297k271881j47171J705246L074627L876037
$$ y = [292997036, 288024597, 284158535, 281845226, 281191959, 282216759, 285075264, 290039005, 297164993, 305831966, 314469814, 320768013, 322406731, 318043575, 308086472, 294823132, 281755924, 272377720, 268911381, 271565475, 278620377, 287267284, 294782524, 299500637, 301190071, 300755920, 299512711, 298439007, 297772999, 297090130, 295740376, 293363628, 290193653, 287011070, 284798279, 284297962, 285699081, 288584862, 292131119, 295427914, 297766285, 298787804, 298485069, 297115154, 295095119, 292911739, 291035633, 289818668, 289386406, 289582005, 290025120, 290299110, 290196362, 289889736, 289910355, 290904312, 293268623, 296850281, 300875511, 304168587, 305573177, 304387264, 300623112, 294993343, 288654842, 282839756, 278526459, 276254578, 276107407, 277812653, 280887280, 284763317]
3906B84763317M103413L794460L019810J898365O11667o03771j504173j914120j797886
3915B92371082j284561o19602n9013K45227L02468K50473K46143L48797M70943M32568
3925B92704525R1629n31673j219178j642780j533050q37212K27585J259575J857624
3934B90377045J808376J181202K81620n06096r03625q56610n30052j94035o8187k09542
3944B90380096n01709p39135p52678n00355p8030L47119O27956P01161N91144L68176
3954B90443745J02424j57165l72544n03826n12886l90568j77555M2935J87855K21099
3964B88883514J69869R4814L8109o447p4673j82075k89822l23639k37770o8588P6141
3975B88079433R5349j7948j58978j90430o4373J18313J75724m57l29094n79663n64346
$$ y = [284763317, 288866730, 292661190, 295681000, 297579365, 298191032, 297587261, 296083088, 294168968, 292371082, 291086521, 290466919, 290407906, 290653133, 290955601, 291206074, 291452217, 291801014, 292271957, 292704525, 292796154, 292264481, 291045303, 289402523, 287869473, 287032261, 287259846, 288519421, 290377045, 292185421, 293366623, 293648243, 293142147, 292238522, 291381912, 290851860, 290657825, 290589638, 290380096, 289878387, 289139252, 288386574, 287886219, 287808189, 288155308, 288783264, 289484425, 290075569, 290443745, 290546169, 290389004, 290016460, 289512634, 288999748, 288609180, 288431625, 288474560, 288662415, 288883514, 289053383, 289148197, 289186306, 289179859, 289105186, 288923111, 288633289, 288309650, 288071880, 288003292, 288079433, 288174782, 288156834, 287997856, 287807426, 287743053, 287861366, 288037090, 288036633, 287707539, 287127876, 286563530]
3986B86563530l37181k12212n32722j332436k173366k377091j598053l83682k65408
3995B77351379l143692j0184040k0827140l2569333m1791324
4000A68835850
$$ y = [286563530, 286226349, 286014137, 285481415, 284148979, 281975613, 279598522, 278000469, 277616787, 277351379, 274207687, 264023647, 243196507, 210627174, 168835850]
##END=$$ End of the data block
