##TITLE=B8M - Rodrigo 2 $$ Begin of the data block
##JCAMP-DX=5.00 $$ ACD/SpecManager v 10.08
##SPECTROMETER/DATA SYSTEM=Alpha
##DATE=22 Jun 2015 10:50:00
##DATA TYPE=INFRARED SPECTRUM
##DATA CLASS=XYDATA
##ORIGIN=
##OWNER=
##NPOINTS=1765
##FIRSTX=399.76428223
##LASTX=3997.64306641
##MAXX=3997.64306641
##MINX=399.76428223
##MAXY=0.81632704
##MINY=0.26880530
##XFACTOR=1.0000000000
##YFACTOR=1.000000000000000e-9
##FIRSTY=0.80063659
##DELTAX=2.03961372
##XUNITS=1/CM
##YUNITS=ARBITRARY UNITS
##XYDATA=(X++(Y..Y))
399.8 800636590 802248299 805172920 808124423 810611546 812377930 812878072 811049581 806050003 799528658
418.1 799528658 797371745 800197244 801002860 796508253 791706920 792601943 798764884 806095779 811885059
436.5 811885059 815214157 816327035 816254437 815616608 814031541 811363399 808075845 804023623 798618019
454.8 798618019 791369379 783707321 778852522 778499663 782594264 788947523 794217408 795967042 792521536
473.2 792521536 783618152 776199102 780792296 795179367 807098150 812075496 813249171 813003540
489.5 813003540 812197506 811378419 810636938 809569716 807987988 806155145 804383039 802435458 800189674
507.9 800189674 797994435 795822084 793365300 790881097 789199293 788501620 788218915 788012862 788158000
526.2 788158000 788695753 788972616 788644493 788076222 787394166 785973489 783287644 779092073 772209108
544.6 772209108 758987486 733626425 703218579 698271275 725350082 747269392 754701257 771441162
560.9 771441162 794108927 806253612 808888793 808539212 807553709 806385934 805203021 804131210
577.2 804131210 803106129 802046239 801079333 800352931 799668670 798664987 797409296 796174288 794755816
595.6 794755816 792875171 790616572 788035989 784716308 780043960 773591459 764690757 753849328
611.9 753849328 743504643 733941376 724857628 721495688 728183866 741264820 754084170 762974501
628.2 762974501 767405272 767932951 765108705 759353280 750302136 735352099 711691558 681449175
644.5 681449175 652291119 635262549 643074453 675416172 712411106 736610651 747342229 750323057
660.8 750323057 749008000 744638443 734782755 718361437 704180419 694206893 686753392 677501380
677.2 677501380 662284672 634835601 591679096 550010622 537517428 566826880 622370243
691.4 622370243 666022956 664661288 632056534 617669284 638017654 668723285 690446198 696089625
707.7 696089625 686071336 677023590 685159385 706343889 729619205 750840366 768257439 780769944
724.1 780769944 789100528 794427574 797506094 798901439 799044609 798398674 797117710 794553399 788841605
742.4 788841605 776618004 754349232 726281941 709708512 718880117 747234881 772985816 778949499
758.7 778949499 762218654 723029733 667467833 630753100 649051189 702734292 742773116
773 742773116 751647949 745381057 746774852 763396144 784006953 796972513 801858366 803024471
789.3 803024471 802922308 802302480 801297367 800039828 798845649 798067689 797869563 798105836 798505485
807.7 798505485 798789203 798793554 798344314 797375917 796085835 794831693 793533504 791671872 788922727
826 788922727 785254002 781745791 779955268 778770268 775043190 767056167 755264580 745645285 746748745
844.4 746748745 756267905 763635516 764070392 758713841 748887658 735064149 716900706 694148183
860.7 694148183 669200957 648468971 641092360 658433616 703200221 754742920 787594199 798155010
877 798155010 795829535 784741104 761861622 730804384 718167603 743178964 779670954 796831489
893.4 796831489 798458338 799146414 803618491 808912814 811910152 812851310 812853456 811944842 809293926
911.7 809293926 804096222 795338690 780753791 756780922 725237191 700785875 696530044 707881987
928 707881987 726089001 748066783 769032300 783440053 790267944 792393506 793028057 793577671
944.3 793577671 793765545 793103814 791599452 789255440 786253154 783450067 781652212 780342340 778235316
962.7 778235316 774352133 768071711 758896768 746820152 732867897 718827665 706103325 694257557
979 694257557 681356430 669911802 669823527 684471309 704067588 721429765 736889124 747071803
995.3 747071803 745799243 736445248 729108751 727511406 726552367 718483508 703367412 690638423
1011.6 690638423 688771605 698254824 712764800 725175261 731459200 733350515 737522602 746553838
1028 746553838 755533576 759681344 758299828 752157688 741718948 728409111 717170894 714193404
1044.3 714193404 720258415 730025768 738555610 744657397 748823404 751287818 751766503 749805152
1060.6 749805152 744753003 735769629 722736657 710387111 708942175 721975565 740640223 755654216
1076.9 755654216 763967156 766114116 764417827 760702670 755249918 747539401 737173021 726028264
1093.2 726028264 720222473 724513948 734833062 743094265 745433569 741977632 736968756 738885999
1109.6 738885999 748893023 757522762 759603918 758299768 757016003 756708145 756874502 756576002 755350292
1127.9 755350292 753428459 751292109 749115944 746595562 743270338 738960326 733974278 728948653
1144.2 728948653 724278331 719217181 711489260 698546231 681153476 664140642 648118496 628237009
1160.5 628237009 608298421 599257052 605136812 629216850 674737513 728373647 768554330 788438737
1176.9 788438737 795128405 796182752 795044720 793135524 792126477 792815387 793363452 792106688 789665341
1195.2 789665341 787168622 785086155 783340573 781500578 779159069 776274025 773095846 769831657
1211.5 769831657 766553760 763239801 759696066 755523443 750201523 743522763 736265004 729978144
1227.9 729978144 725853205 724440277 725848615 728912354 731587470 733305275 735055149 737269223
1244.2 737269223 739336669 740531862 740482211 739167631 736845136 733940244 730909228 728132904 725808322
1262.5 725808322 723798275 721610904 718673050 714824617 710307062 705299616 699724972 693388700
1278.8 693388700 686039627 677291453 666323662 651890755 633421838 611898065 590489089 577914178
1295.2 577914178 587000191 616413355 646458626 666923046 683981895 699704885 708049774 704230785
1311.5 704230785 689380825 670937240 658704042 656019509 653894186 641338885 621367991 611546040
1327.8 611546040 626464009 658621788 687885463 705958724 716576874 724626482 731829882 736657202
1344.1 736657202 737892985 736184716 732531726 727112532 719532311 708832026 693949580 675002396
1360.4 675002396 657268047 651971638 662338972 677857816 686478198 686470330 682325959 677066326
1376.7 677066326 670960963 663349509 654499650 645497561 636587203 627490878 617897153 605742574
1393.1 605742574 589576066 571072996 551984429 534645915 519581437 504631996 490605891
1407.3 490605891 479191631 470563412 464111745 458504707 452278644 445279986 439512283 435293198
1423.7 435293198 432364821 431012481 430661500 430451661 429505229 427023709 423584282 420171648 416128039
1442 416128039 410790205 403571397 399380237 414821684 456139863 508194625 559966922 602324665
1458.3 602324665 625674009 638926327 649359941 658096194 664599836 669294715 673029244 675699949
1474.7 675699949 676620960 675565839 672385871 666796684 657870471 643316567 626768172 628789127
1491 628789127 656848848 689625323 707391381 709200382 706058502 702303410 696889877 689613521
1507.3 689613521 684417665 680328727 675306857 669065833 662135005 654839396 646262228 637511492
1523.6 637511492 629099369 619708359 610032856 598928928 585091293 571856141 557900846 536025107
1539.9 536025107 510112226 485868543 459857583 430690706 397312284 364064068 336793274
1554.2 336793274 318507940 306515157 299260020 297165006 295837700 292497486 286077559 277229548
1570.5 277229548 270549774 268805295 273540854 283481002 295771420 309913695 324860007 340480149
1586.8 340480149 355163217 364943713 367393434 365535915 366175294 374319375 391240776 414954841
1603.2 414954841 440191418 462360829 480673045 495762736 508035183 518177986 526345968
1617.4 526345968 531670749 536212206 542404652 549523830 556000471 561053216 563927233 564757466
1633.7 564757466 564814746 565501571 565513492 562641561 555000365 538868308 516284168 497463048 484459639
1652.1 484459639 488826573 514559567 547980428 580047429 601470053 609495997 612717271 623372078
1668.4 623372078 645290673 666947305 682667673 693632305 699691296 702272654 702618778 702481091
1684.7 702481091 703176618 703578293 703146458 701983809 699774325 697197020 695201457 693743527 693287969
1703.1 693287969 692723930 691798747 690941572 690075278 689191818 688242435 687641978 688345671 689997733
1721.5 689997733 691880405 694098830 696579099 699115217 701212347 702654421 703815758 704201579
1737.8 704201579 703439951 702248931 700867474 698482871 694806755 690626264 687942505 687351465 686976135
1756.1 686976135 684490442 677622914 664737046 647705138 629317641 615771353 619535148 642320156
1772.4 642320156 662799656 665941715 655751705 637617171 615126848 589248359 561773300
1786.7 561773300 535577834 509270072 486088008 479102939 495114625 532727420 579918146
1801 579918146 618234992 642075121 657121003 668663144 679129601 689005494 698209107 706601918
1817.3 706601918 713766873 719508052 724173665 728045464 730595708 731349230 730714381 729268134 727297604
1835.7 727297604 725482404 724486351 724494696 725839853 728764832 732477605 736450493 740463912 744058669
1854 744058669 746901870 749038517 750753164 752065718 752630413 752259672 751491070 751275063 751584768
1872.4 751584768 751846671 752090931 752562642 753199458 753735900 754013121 753994882 753598690 752919436 752104998
1892.8 752104998 751235068 750660300 750558138 750764668 751136243 751508236 751575828 751165926 750553906 750125945
1913.2 750125945 749972284 750126958 750734687 751558959 752278924 752783358 752910137 752685249 752336025 752009511
1933.6 752009511 751734674 751501679 751239240 750896871 750547290 750124872 749427736 748391271 747078776
1951.9 747078776 745735049 744714022 744094610 743702412 743446350 743377149 743532360 743874788 744248331
1970.3 744248331 744558990 744971812 745605409 746338129 747067511 747886062 748790681 749516845 749823153 749788761
1990.7 749788761 749831557 750276446 750957787 751505196 751755178 751785696 751725733 751630664 751557410 751534283 751503050
2013.1 751503050 751383305 751190245 750991225 750728726 750277400 749793649 749703825 749955833 750101805 749994636
2033.5 749994636 749738812 749402881 748917997 748199463 747305453 746425152 745785415 745534778 745662332 746118724
2053.9 746118724 746866882 747702777 748329937 748664737 748811185 748850107 748829722 748805523 748825729 748842835
2074.3 748842835 748776317 748656094 748578429 748554289 748491526 748375535 748306990 748317182 748318553 748256803 748170614
2096.8 748170614 748116672 748074710 747971833 747796118 747597158 747382104 747103274 746781886 746508598 746331036
2117.1 746331036 746224165 746179402 746225417 746346951 746456385 746478498 746455133 746467233 746508658 746513069 746457696
2139.6 746457696 746359050 746211529 746019840 745831609 745689213 745589674 745477080 745279610 745025456 744810164
2160 744810164 744657278 744531214 744378984 744166613 743950784 743736565 743420541 743034780 742736161 742642522
2180.4 742642522 742785335 743037999 743208408 743220627 743115127 742958069 742803335 742660522 742477298 742238760
2200.8 742238760 742002666 741797686 741612971 741445899 741315722 741264105 741272211 741251171 741154790 741004288
2221.2 741004288 740813494 740587592 740359604 740149260 739956200 739767194 739548743 739306152 739061594 738801181
2241.6 738801181 738519549 738222480 737932086 737676740 737466931 737293363 737133622 736997426 736873925 736723185
2262 736723185 736556411 736419261 736303210 736176193 736059606 735983133 735928297 735858858 735783041 735706627 735573709
2284.4 735573709 735333085 735014737 734665334 734300137 733898818 733417213 732886255 732334256 731703281 730921805
2304.8 730921805 729995370 728983462 727919519 726830482 725656033 724221408 722465038 720640898
2321.1 720640898 719186246 718282342 717728972 717415988 717439830 717614174 717515767 717112303 716662049 716351449
2341.5 716351449 716557562 717806518 719433904 719884217 718602359 716346681 714239597 712744653 711975217
2359.9 711975217 711890996 712413847 713480413 714930475 716579735 718259692 719849288 721357048 722800136
2378.2 722800136 724128425 725211859 725931048 726293623 726391673 726322353 726168573 725983620 725797653 725616217
2398.6 725616217 725420356 725213647 725008190 724784553 724497259 724139273 723770440 723425269 723060727 722663760
2419 722663760 722319841 722079873 721912265 721799552 721720099 721632600 721533060 721424460 721285403 721143961
2439.4 721143961 721032023 720910370 720765054 720628381 720500052 720349550 720171154 719987750 719790816 719577491
2459.8 719577491 719400644 719300270 719252408 719181895 719034791 718825400 718594491 718346953 718074143 717843473
2480.2 717843473 717737615 717706740 717657626 717579126 717477262 717326462 717113912 716900945 716761887 716704011
2500.6 716704011 716686487 716683388 716693461 716682792 716629326 716550648 716449380 716339767 716239274 716117561 715974212
2523 715974212 715851068 715741038 715598702 715384781 715103209 714812517 714608490 714578331 714727402 714955628
2543.4 714955628 715138853 715231836 715246201 715207756 715154946 715109289 715060771 715034306 715056181 715064228 714998066
2565.8 714998066 714907408 714866042 714845955 714798570 714726150 714644134 714556694 714424908 714229822 714030206 713835716
2588.3 713835716 713573873 713244617 712986588 712909937 712916434 712897897 712906480 712949872 712907672 712721407 712456763
2610.7 712456763 712214947 712082088 712036908 712020099 712042928 712077320 712057292 712005436 711986303 711999416 711988688
2633.2 711988688 711915493 711827457 711763382 711663365 711491942 711320877 711233497 711230516 711232603 711186111 711112916
2655.6 711112916 711000919 710817575 710585356 710371971 710212588 710046530 709834397 709613025 709395349 709202647
2676 709202647 709087968 709058642 709103346 709181547 709201634 709137321 709033132 708938360 708886266 708829105 708723247
2698.4 708723247 708617091 708504260 708332181 708128929 707955956 707806528 707627416 707422614 707260132 707167387
2718.8 707167387 707055807 706854701 706632197 706403017 706065953 705581069 704982400 704360306 703828752 703418195
2739.2 703418195 703141034 703066409 703206182 703392506 703432858 703356087 703299522 703261554 703172445 703071654 703031659
2761.6 703031659 703007877 702908635 702756345 702635348 702542305 702417612 702230990 702011108 701818526 701666832
2782 701666832 701512754 701354325 701241314 701135218 700936675 700672328 700430393 700188756 699876130 699498773
2802.4 699498773 699115396 698744595 698366404 697972596 697587490 697248816 696972609 696721256 696416736 696041763
2822.8 696041763 695627689 695129097 694469690 693649173 692667782 691468656 690033078 688398063 686521709
2841.2 686521709 684244335 681468070 678478241 676063716 675020814 675425470 676676810 678212643
2857.5 678212643 679741025 680992007 681751132 682059824 682105660 682018101 681918740 681956708 682141960 682256460
2877.9 682256460 682111979 681722164 681164265 680470526 679615855 678583860 677444160 676286519 675107300
2896.3 675107300 673855901 672536850 671170115 669680834 667900562 665672243 662905097 659650266
2912.6 659650266 656239748 653186023 650774777 648922384 647431731 646167457 645074129 644027233
2928.9 644027233 642829359 641779602 641863465 643870115 647501886 651587903 655009329 657250762 658322036
2947.2 658322036 658537269 658344388 658035040 657716393 657497227 657404006 657394588 657424212 657372534 657076061
2967.6 657076061 656415105 655379951 654043674 652562857 651292741 650600314 650512278 650730252 650868714
2986 650868714 650660157 650018930 648838520 647015393 644874454 643014848 641877830 641721904 642587841
3004.4 642587841 644326568 646645665 649103761 651262879 652892351 653975248 654492974 654351115 653624833
3022.7 653624833 652750015 652370095 652805805 653705478 654478252 654754579 654564202 654398680 654626727 655059576
3043.1 655059576 655295432 655077279 654322565 653013706 651361406 649913549 649037063 648710191 648907542
3061.5 648907542 649485886 650074720 650809228 652507305 655470729 658808768 661405802 662848532 663228869
3079.8 663228869 662875414 662401259 662434161 663102686 663947880 664474547 664566994 664287806 663672507 662942648
3100.2 662942648 662634552 663089514 664001405 664826691 665316045 665468931 665356517 665097475 664783835 664448321
3120.6 664448321 664108515 663753986 663344920 662905693 662490785 662042737 661503613 660917819 660379112 659928560
3141 659928560 659490347 659006178 658496857 657981038 657439351 656917572 656479299 656071007 655615509 655078173
3161.4 655078173 654501021 653981984 653553247 653160751 652755916 652367234 651993871 651591241 651167810 650738120
3181.8 650738120 650316179 649902940 649452686 648981214 648554385 648160219 647722602 647236228 646767318 646325827
3202.2 646325827 645868659 645356476 644808173 644269943 643692613 643040717 642377138 641746342 641158223 640574336
3222.6 640574336 639929891 639231563 638516128 637797415 637068570 636293292 635484099 634670436 633825243 632977843
3243 632977843 632201672 631496131 630790293 630061090 629384756 628773153 628133237 627452493 626794517 626180112
3263.4 626180112 625581622 624993503 624464631 623936236 623306155 622646928 622049510 621504188 620976806 620456100
3283.8 620456100 619979501 619583368 619239867 618874848 618451893 617995679 617530882 617061138 616563499 616037250
3304.2 616037250 615476251 614808083 614033222 613210320 612334728 611401200 610413074 609367251 608321726
3322.5 608321726 607307374 606219411 605002046 603739500 602485776 601226509 599939167 598569512
3338.8 598569512 597077191 595498502 593871534 592285752 590842009 589334548 587517858 585567415
3355.2 585567415 583753705 582044542 580241382 578361988 576626360 575011134 573211551 571103394
3371.5 571103394 568960786 567032337 565257728 563530385 561820328 560156524 558612823 557253122
3387.8 557253122 556081772 554896533 553511262 552113831 551003039 550068080 548861623 547359049
3404.1 547359049 545990348 544891119 543897808 542906821 541871250 540825307 539892495 539117873 538493335
3422.5 538493335 538028538 537707746 537506878 537352622 537265897 537334561 537450790 537538171 537711442 538040698
3442.9 538040698 538512766 539106071 539778709 540483892 541203678 541943729 542712688 543504536 544261456 545043945
3463.2 545043945 546027005 547125220 548004150 548586071 549157262 549920022 550893545 551916659 552786171
3481.6 552786171 553617656 554541349 555455089 556371748 557401121 558505356 559622824 560718417 561786592
3500 561786592 562863171 563922524 564965844 566047728 567250609 568631947 569992781 571167827 572296917
3518.3 572296917 573516905 574808359 576039970 577197552 578450143 579849422 581255317 582560241
3534.6 582560241 583734691 584789395 585778832 586670339 587429583 588193178 589177012 590423644 591911972
3553 591911972 593615413 595362246 597024798 598546326 599758685 600607216 601613045 603289247 605212450
3571.3 605212450 606913984 608474612 610056341 611682296 613315582 614787102 615946531 617150486
3587.7 617150486 618829668 620546281 621975601 623347700 624761641 626138449 627529204 628904283
3604 628904283 630020738 630932271 632005751 633266091 634583890 635792434 636741519 637835026 639241815
3622.3 639241815 640432656 640935361 641035497 641915441 643360853 644561946 645537794 646356225 647022307
3640.7 647022307 647592545 647858739 647554696 647265434 648059905 649344623 650132358 650719345 651562214
3659 651562214 652248979 652612805 652847767 652744472 652211964 651986539 651948035 651549578 651737928 652569294
3679.4 652569294 653240025 653683424 653894305 653671920 653291643 653523326 654215336 654696822 654761195 654522359
3699.8 654522359 654280126 654403627 654625058 654438496 653867662 653610528 654119968 654707849 654826164 654589593
3720.2 654589593 654252887 653974295 653961182 654223382 654235542 653625607 652880609 652912259 653688729 654191971
3740.6 654191971 653625548 652663052 652733445 652893364 652501404 652725220 653485239 653868020 653876901 654012442
3761 654012442 654139161 653986156 653787792 653635800 653687060 654019475 654240072 654146910 653930604 653823674
3781.4 653823674 653723538 653607726 653644800 653732955 653717279 653478444 653024316 652653754 652189136 651692629
3801.8 651692629 651789308 651880980 651825905 652165115 652439654 652079761 651409686 651088238 650712311 650496364
3822.2 650496364 650916398 651254058 651274145 651088893 650798380 650540650 650039732 649432361 649367094 649705052
3842.6 649705052 650117218 650479317 650508046 649781406 648294628 647778094 648676038 649355054 649272680 648820519
3863 648820519 648596227 648518682 648118258 647811651 647942364 648229301 648420811 648151994 647806406 647726655
3883.4 647726655 647549689 647502422 647498250 647305310 647378981 647545218 647226632 646604657 646146476 646004975
3903.8 646004975 646339893 646915197 647237778 647253692 647030175 646593332 646292150 646356285 646466613 646359622
3924.2 646359622 646236598 646167397 645955265 645763338 645831943 645965934 645928442 645682633 645407021 645325065
3944.6 645325065 645265520 645115495 645076454 645133972 645140827 645108640 645066500 644934833 644728899 644540668 644386232
3967 644386232 644267678 644143820 643989801 643847287 643749297 643690288 643653572 643618405 643540740 643405735 643245280
3989.5 643245280 643092215 642967880 642890990 642833233
3997.6 642833233
##END=$$ End of the data block
