##TITLE=B8M - Rodrigo 1 $$ Begin of the data block
##JCAMP-DX=5.00 $$ ACD/SpecManager v 10.08
##SPECTROMETER/DATA SYSTEM=Alpha
##DATE=22 Jun 2015 10:50:00
##DATA TYPE=INFRARED SPECTRUM
##DATA CLASS=XYDATA
##ORIGIN=
##OWNER=
##NPOINTS=1765
##FIRSTX=399.76428223
##LASTX=3997.64306641
##MAXX=3997.64306641
##MINX=399.76428223
##MAXY=0.85910022
##MINY=0.38356501
##XFACTOR=1.0000000000
##YFACTOR=1.000000000000000e-9
##FIRSTY=0.85515481
##DELTAX=2.03961372
##XUNITS=1/CM
##YUNITS=ARBITRARY UNITS
##XYDATA=(X++(Y..Y))
399.8H55154812L945411n287707p313669J581252P357716J314938o071508m423082
416.1H46258163K428592K691507n303085p740438k680421j014411p847846j3294339
432.4H13497722o540298Q176446J4499187P940650K005041M597366O995499J474142
448.7H52645755n086541l281355L212869L554821k901018n384445j51098M158140J52826
467.1H46919954o220102n032063J566708L081858j751661l883541Q37148N487322K422214
485.4H43427837m295349m733026J283467L820896j509309o318629l327846K326548
501.7H30674589J349508m878342o488800r82046K622545j641154p260085n617022J20938
520.1H07900131m6432o680548j0802865p960856o139577j2375176k0874798j9600272
$$ plain form
399.8 855154812 859100223 853812516 846498847 848080099 855437815 856752753 850681245 846258163
416.1 846258163 848686755 851378262 846075177 838334739 835654318 834639907 826792061 813497722
432.4 813497722 806957424 815133870 829633057 837573707 839578748 844176114 851171613 852645755
448.7 852645755 847559214 844277859 847490728 851045549 848144531 842760086 842608988 846767128 846919954
467.1 846919954 840699852 835667789 837234497 840316355 838564694 834681153 835518301 841005623 843427837
485.4 843427837 839132488 834399462 835682929 839503825 837994516 831675887 828348041 830674589
501.7 830674589 832024097 827145755 820656955 819674909 822297454 820656300 813396215 807779193 807900131
520.1 807900131 807853699 801173151 790370286 782409430 776269853 763894677 743019879 723419607
536.4G23419607o990493J841486m951179j5606106j0724127P959426K1193027K0870924
552.7G37012565J7554701J9543290K1164477J4891982N407452K689064N974889N427837
569.1H29666257j290262n273700j424074L348649R62853m898310n146086M34518K754390
587.4H19134235k117276o860554m223228J127303R2924o037474q070767l494978l73184
605.8G89177001m273773r819865r315968l284335L107250L057182l590465n648732
622.1G59408295k037883k104520n363644l640353L846764R078026O797195J950204
638.4G67934084J248300K120256k559483q810937n917966l95656o980538k3268044
654.7G23370016l3406079k4231732j601040J0879516M806161R11653K2997141L9605260
$$ plain form
536.4 723419607 716429114 718270600 713319421 697713315 686989188 694948614 716141641 737012565
552.7 737012565 754567266 774110556 795275033 810167015 815574467 818263531 824238420 829666257
569.1 829666257 828375995 823102295 821678221 825026870 825989723 821091413 815945327 816379845 819134235
587.4 819134235 817016959 810156405 805933177 807060480 807153404 801115930 793045163 789550185 789177001
605.8 789177001 784903228 775083363 765767395 762483060 765590310 768647492 765057027 759408295
622.1 759408295 757370412 755265892 749902248 746261895 750108659 759186685 765983880 767934084
638.4 767934084 769182384 771302640 768743157 759932220 754014254 753618598 746638060 723370016
654.7 723370016 689963937 665732205 664131165 675010681 679816842 680728495 703725636 743330896
671G43330896K8869510R381711n552828j2614131k1517217k9306233k5843561j4253855
687.3F72494292l778875k92360l355444k112090L599584j756966k2528470m3078363
703.7E99191308m3661535k0782947P469773K1456063J8596053N656361j2595653k7425885
720E47903538k4472535k454162K3817480M4293225N4319024M9829602L7073076K7656376
736.3G57965624K1718562J3214290M270673J869142M985929N324184K54631l174483
752.6H06428552j6809M481614L124773k381503m000604J69515L019095l12865m740000
771H05771768l616035Q50320J401246k857924n001366j224816L056347J361192l959418
789.3G95781314n881250l701269m020453j0145425j7434776k1393419k2000253j4699042
$$ plain form
671 743330896 772200406 781582117 776029289 763415158 741897941 712591708 686748147 672494292
687.3 672494292 668715417 668423057 665067613 662955523 666555107 664798141 642269671 599191308
703.7 599191308 555529773 534746826 542216599 563672662 582268715 587925076 575329423 547903538
720 547903538 523431003 520976841 544794321 589087546 643406570 693236172 730309248 757965624
736.3 757965624 779684186 792898476 797169149 799038291 804024220 809348404 809603035 806428552
752.6 806428552 806411743 810893357 814018130 811636627 807636023 807805538 810824633 810511768 805771768
771 805771768 802155733 803006053 804407299 801549375 796548009 795323193 798379540 799740732 795781314
789.3 795781314 789900064 786198795 782178342 772032917 754598141 733204722 711204469 696505427
805.6F96505427N722821K5584340L0078054K3378253J1341214m28379m902303l980696
822G83298731m285693p204593q022010m278064o60777k918839r482086j3208091j1304438
840.3G21934140p963240p129312o999671l657937K714872P882595R081304P709086
856.6G23571837O253302N755663N628169M826903M191756N005241N099952J695275
873G62028098k825320k856612K771497Q924127J0941028R810090R102762Q854389O079614
891.3H12829673P85709k655745j783490J07527j095057m351139n300462l250182k101183
909.7G93185651m193842o701768o095826l475905k700090m562974n941689n018115
926G54495442l935695n195915p196844o398738k776205k042949o966532o292760P416606
$$ plain form
805.6 696505427 702228248 727812588 757890642 781268895 792610109 792181730 787279427 783298731
822 783298731 779013038 771808445 763786435 759508371 758847594 755928755 746446669 733238578 721934140
840.3 721934140 713970900 706841588 699841917 696183980 698898852 706781447 715862751 723571837
856.6 723571837 729825139 735580802 741208971 746035874 750227630 755232871 760332823 762028098
873 762028098 759202778 756346166 759117663 768041790 778982818 788792908 797895670 806750059 812829673
891.3 812829673 813615382 810959637 809176147 809283674 808188617 803837478 798537016 795286834 793185651
909.7 793185651 788991809 782290041 776194215 772718310 770018220 765455246 759513557 754495442
926 754495442 750559747 745363832 738166988 731768250 728992045 726949096 719982564 713689804 721106410
944.3G21106410K0053268K0058214J3533473Q625508P681310Q257150O760896L235459
960.7H09311688J186371K092123L043651J369477j466215k199471p96199r0420k127409
979H10323596n274713o523848m261195j553774l868997j0703266j9648671l1781077
995.3G26708055l8965166k4660170N753159L5229564N0029039L7658513J4228582K618969
1011.6H08600545L56555j255274m430592p713616j1648416j8296838k3112178j4420033
1028G28080153J0180712L1790018K9864312J2155413k08497k671420j253725q96155
1044.3H07040811k558709l790378k805650j311601j929044m181326n687713o211043
1060.6G78565347q553624j3387084j6209543j3425827q702397n836010m833937o189227
$$ plain form
944.3 721106410 741159678 761217892 774751365 783376873 791058183 799315333 806076229 809311688
960.7 809311688 810498059 812590182 815633833 817003310 815537095 813337624 812541425 812451005 810323596
979 810323596 805048883 798525035 794263840 792710066 788841069 778137803 758489132 726708055
995.3 726708055 687742889 663082719 668835878 704065442 754094481 791752994 805981576 808600545
1011.6 808600545 808957100 807701826 803271234 795557618 783909202 765612364 742500186 728080153
1028 728080153 738260865 770050883 799915195 812070608 811862111 809190691 807936966 807040811
1044.3 807040811 804482102 800691724 797886074 796574473 794645429 790464103 784776390 778565347
1060.6 778565347 770011723 756624639 740415096 726989269 718286872 712450862 707616925 701427698
1076.9G01427698l157437J1401415K4132729K0654976R538233K770961K3186k635598
1093.2G64156163n224109n751371l641487n45442M56572j124442k059102j095652r43899
1111.6G44227231k801598m473984m634678m830957o510257q956671r363413m416764
1127.9F98238909L784955P536411M604042M19676k047062m362345p219016r225548
1144.2F91730022r831488j0588050j2897670j5835583j7039776j5729487j3050198
1158.5E96757770r329260n519032m712224p578254j2447238j8752337k5585651l0263394
1174.8D82570380k9325545k0295113n195320R355933J9946515K8473884L4644187L5635769
1191.1E55810690L3348679L1675578K9374122K4174631J8020987J3726831J1031330
$$ plain form
1076.9 701427698 698270261 709671676 733804405 754459381 763997614 766768575 766791761 764156163
1093.2 764156163 758932054 753180683 749539196 748993754 749450326 748325884 746266782 745171130 744227231
1111.6 744227231 741425633 736951649 732316971 727486014 720975757 712019086 702655673 698238909
1127.9 698238909 702023864 709560275 714164317 714583993 712536931 708174586 700955570 691730022
1144.2 691730022 681898534 671310484 658412814 642577231 625537455 609807968 596757770
1158.5 596757770 587428510 581909478 577197254 569619000 557171762 538419425 512833774 482570380
1174.8 482570380 453244835 432949722 427754402 437110335 457056850 485530734 520174921 555810690
1191.1 555810690 589159369 620834947 650209069 674383700 692404687 706131518 717162848
1205.4G17162848Q022904M515290K354205K283037K419710J154363m74930p58946p4804
1223.8G36603677l92377k447426m091084k012313L877700Q477509P594943L593862
1240.1G51204491N27501j572490m387915p764876j0576308j2939393j4889002j2815356
1256.4F86786652k767027J0324240J5325010R474575q4877p129609j0321081j0719895
1272.7F90887988r756387q692681q522690r908676j2675822j5736997j7480433j6301274
1289E91813028j2113273o743670k206802M71175J718819L931343J0129750J9983828
1305.4F06984198K7492344K4894715R923994j1510789k6664078k2681475l841698P474601
1321.7F12071812L060103l382266k569377K542019O598949R710610J6137481K6727140
$$ plain form
1205.4 717162848 725185752 729701042 732055247 734338284 736757994 737912357 737437427 736678481 736603677
1223.8 736603677 736211300 733763874 729672790 727660477 731538177 740015686 747610629 751204491
1240.1 751204491 751731992 750159502 745771587 738006711 727430403 714491010 699602008 686786652
1256.4 686786652 684019625 694343865 709668875 719143450 719058573 711928964 701607883 690887988
1272.7 690887988 681131601 672438920 663916230 654007554 641331732 625594735 608114302 591813028
1289 591813028 579699755 572956085 570749283 571220458 572939277 576870620 587000370 606984198
1305.4 606984198 634476542 659371257 669295251 657784462 631120384 608438909 604597211 612071812
1321.7 612071812 615131915 611749649 609180272 611722291 618321240 628031850 644169331 670896471
1338F70896471L4980714L3349097K4601042J5544295Q226872K624988l5703J833499
1354.3G92021275N226373N009055J094640l034294m893422n319953o376863p943093
1370.6G75783718r097875r291946q784950r618581j1813879j2990534j2286246j1636972
1386.9F90262735j2147606j2548446j1322737n324840M815280J1923611J1075199M136205
1403.3F80869401n253017j6372085k8809249l9867402m0398180k5899589k554774K2139430
1419.6E43854535L4057200L4050464L0058325K4207949K2696734K3640513K2527039
1433.9G35092759K1324933J7108798P711887j778066r640396j3586878j7771245k4326741
1450.2G14135051k1374285k390981K3610771L1405866J4724493M191816N93125j614153
$$ plain form
1338 670896471 705877185 739226282 763827324 779371619 787598491 790223479 790187776 792021275
1354.3 792021275 797247648 802256703 803351343 800317049 795423627 790103674 783726811 775783718
1370.6 775783718 766685843 757393897 748608947 738990366 727176487 714185953 701899707 690262735
1386.9 690262735 678115129 665566683 654243946 648919106 653734386 665657997 676733196 680869401
1403.3 680869401 675616384 659244299 630435050 590567648 550169468 524269879 521715105 543854535
1419.6 543854535 577911735 611962199 642020524 666228473 688925207 712565720 735092759
1433.9 735092759 756417692 773526490 781238377 779460311 769819915 756233037 738461792 714135051
1450.2 714135051 692760766 690369785 713980556 745386422 760110915 764302731 764895856 763281703
1466.5G63281703l175259m628420o067812o310999o314814p254839r259403j2456715
1482.8G07813442j6500533k1527946k2279560o435037J9064486L5006344L5689533
1497.1G30830729K1705091P228434j010060o495714j0107696q008600o805479q208037
1513.4G19128668r748101j0509849j0668337j2089550j2177348j1372209j1866033
1527.7F40697241j1628986j2700378j5009702j3450503j2249827j6700268j8753648
1542E40203929j7448485j8787622k1686376k6236891k8709084k6583552j7186910M292100
1558.3C87857109L1915188L4704298K8319836J5571266l695488j0857373M167974K8256297
1574.6E16239107M8639655M1894436K4626076J6828656J7138422J8882215Q806049
$$ plain form
1466.5 763281703 760106444 755478024 749410212 743099213 736784399 729529560 720270157 707813442
1482.8 707813442 691312909 669784963 647505403 641070366 660134852 695141196 730830729
1497.1 730830729 752535820 759764254 758754194 752258480 742150784 734142184 727336705 719128668
1513.4 719128668 709380567 698870718 688202381 676112831 663935483 652563274 640697241
1527.7 640697241 629068255 616367877 601358175 587907672 575657845 558957577 540203929
1542 540203929 522755444 503967822 482281446 456044555 427335471 400751919 383565009 387857109
1558.3 387857109 419772297 454476595 482796431 498367697 494672209 483814836 487982810 516239107
1574.6 516239107 564878762 606773198 631399274 648227930 665366352 684248567 693054616
1588.9F93054616j3728559l8637876n8251441o1310947m0165126j0062575O604135
1603.2D77502227R032607R533971J2352676J5768945J7713964J6560256R928227Q93891
1619.5E69286764J72794R256541J8702030K0883799J8233120J3273240J0078132R671688
1635.8F69558108P919550N317509M074275L114522K158761J362622M14192p27295r85563
1654.1F92206681n46992j045644j775444k581775l783941n443812q435428j0997951
1670.5F57595694j0629713j1601449j3158738j2526631j2531341j4562606j6813875
1684.7E65771341j1577904n080938j273632J498401K617836K146065M36843l40343
1701.1E54197669Q45671M927575J2476206J7120361J4640153Q764267M375279L033459
$$ plain form
1588.9 693054616 679326057 640688181 582436740 521125793 480960667 470898092 477502227
1603.2 477502227 486534834 496068805 508421481 524190426 541904390 558464646 568392873 569286764
1619.5 569286764 569459558 578716099 597418129 618301928 636535048 649808288 659886420 669558108
1635.8 669558108 677477658 682795167 686869442 689983964 692142725 693505347 693919539 693192244 692206681
1654.1 692206681 691659689 690614045 688838601 686256826 682472885 677029073 668593645 657595694
1670.5 657595694 646965981 635364532 622205794 609679163 597147822 582585216 565771341
1684.7 565771341 554193437 549112499 547838867 549337268 551955104 554101169 554538012 554197669
1701.1 554197669 555043340 559970915 572447121 589567482 604207635 612971902 617347181 620380640
1717.4F20380640L410041L245652K261221l25202m684628r642601j3879299j8919706
1733.7E81846118j8987358j3974726j2641132j0105610m492282J154661N672872Q010387
1750E36482930O750047K670408j303733k785027K02060Q427799J8600702K7082205
1766.3E96127391L2950163L3441007L1957626K6552916J9197106J5221596J2626946
1780.6G68074751R706855P299840N763054M539669L750264L584206L310144K851546
1796.9H08880329K671719K635836K488673K102971J758695J437187J103699P74980
1813.2H23854089M70042K57194J61588J86265M20749R84788J274884J145720R89616
1831.6H29744935P70271N72145O19113P08521Q05616J501441K457380K468944J852214
$$ plain form
1717.4 620380640 623790681 627036333 629297554 628972352 624287724 614645123 600765824 581846118
1733.7 581846118 562858760 548884034 536242902 526137292 521645010 522799671 528472543 536482930
1750 536482930 543232977 545903385 544599652 541814625 542016685 550444484 569045186 596127391
1766.3 596127391 629077554 662518561 694476187 721029103 740226209 755447805 768074751
1780.6 768074751 777781606 785081446 790844500 795384169 799134433 802718639 806028783 808880329
1796.9 808880329 811552048 814187884 816676557 818779528 820538223 821975410 823079109 823854089
1813.2 823854089 824324131 824581325 824742913 824929178 825349927 826334715 827609599 828755319 829744935
1831.6 829744935 830515206 831087351 831706464 832414985 833220601 834722042 837179422 839648366 841500580
1850H41500580J359821J213491J247763J034200O04153L72172L91423L33965J69754
1868.3H48227322K65360M90308N90503M74215J62303p8797K1338K54989J03473l24010
1888.7H50187004l53158L4988K48492J54197r8348j93774j05560k36213q16644j441002
1909.1H47379982j561939j266480r57846q74758r90629j333058j471639o48558Q11040
1927.5H39086115J853705J999497J588166J051009N86986K76506K30909L91781M79460
1945.8H47544134N63085Q43644R84192O72936J86503k3961R3103N2928m71770j159907
1966.2H49284887j297772o24418K56002N08308N5790m73618r24110j549900k127886
1984.6H43107283j982689q00490R27090K120972K048254J243949N54979N0306l71158
$$ plain form
1850 841500580 842860401 844073892 845321655 846355855 846960008 847332180 847723603 848057568 848227322
1868.3 848227322 848492682 848982990 849573493 850047708 850210011 850131214 850152552 850407541 850511014 850187004
1888.7 850187004 849833846 849868834 850117326 850271523 850173175 849979401 849873841 849637628 848820984 847379982
1909.1 847379982 845818043 844551563 843593717 842718959 841728330 840395272 838923633 838275075 839086115
1927.5 839086115 840939820 842939317 844527483 845578492 846165478 846441984 846672893 847064674 847544134
1945.8 847544134 848107219 848950863 849935055 850607991 850794494 850770533 850863636 850916564 850444794 849284887
1966.2 849284887 847987115 847362697 847618699 848127007 848182797 847709179 846785069 845235169 843107283
1984.6 843107283 841124594 840324104 841251194 843372166 845420420 846664369 847219348 847269654 846898496
2002.9H46898496m74512j69278L39270P23660P67648N43595K90513M3690l20852p08401
2023.3H47933829o36578Q4520N17070J50025k78831k95698j26005j18553k77460l37779
2043.7H46614540k35737k04265l95179o30259o53923m54902k59340k09987k13027j33336
2064.1H43224585n603j4484k09868l89754m15743l78668m27544n39005n45085l94463
2084.5H39904368j94609n9247P4208L12805N62727O31392M86970K86818J68681J29223
2104.9H42303336O1810l2306m6968j0849k5510o5983o0796k3187o735k5511p6592j44064
2129.4H41846645j69575j46866j31607j74463k34246k14517j44303j46032k70307m21822
2149.8H39792907m64260l94583l68416m48347n38170n57303n17845n06878n39959n11586
$$ plain form
2002.9 846898496 846423984 846254706 846593976 847317636 848085284 848628879 848919392 848963082 848642230 847933829
2023.3 847933829 847297251 847381771 847898841 848048866 847770035 847474337 847348332 847229779 846952319 846614540
2043.7 846614540 846378803 846174538 845779359 845149100 844495177 844040275 843780935 843570948 843357921 843224585
2064.1 843224585 843218982 843204498 842994630 842604876 842189133 841810465 841382921 840843916 840298831 839904368
2084.5 839904368 839709759 839650512 839724720 840037525 840600252 841231644 841718614 842005432 842174113 842303336
2104.9 842303336 842365146 842332840 842285872 842275023 842249513 842183530 842122734 842099547 842092812 842067301 841990709 841846645
2129.4 841846645 841677070 841530204 841398597 841224134 840989888 840775371 840631068 840485036 840214729 839792907
2149.8 839792907 839328647 838934064 838565648 838117301 837579131 837021828 836503983 835997105 835457146 834945560
2170.2H34945560l90888l51250m78685o02722n44727l23057r8527K8492J05977K21014
2190.6H32511187L33726L26216J88053L8206k0444r060o5267k16246l04818k75135
2211H32506418k24173k48492l42130l75390k81155j94073k43008l43502l50237k71380
2231.4H29632878k64406m07040n35190m76062l65794m09126n15283m84466l13282j80781
2251.8H25681448k19464l10004k61545j16229l8207j02937k11239j91748r3758j31130
2272.2H24005187k94269l61681k95579k87890m33743n96166o11544m77195l81350m50611
2292.5H19815159n55396n37336m49658m63783n89669o60718o02245n54919o71864q85367
2312.9H13844204j007319r98377r61781r63926r88305r75489r37045r16183r40085
$$ plain form
2170.2 834945560 834554672 834203422 833724737 833122015 832577288 832254231 832155704 832184196 832290173 832511187
2190.6 832511187 832844913 833171129 833359182 833397388 833376944 833367884 833302617 833086371 832781553 832506418
2211 832506418 832282245 832033753 831691623 831316233 831035078 830841005 830597997 830254495 829904258 829632878
2231.4 829632878 829368472 828961432 828426242 827950180 827584386 827175260 826659977 826175511 825862229 825681448
2251.8 825681448 825461984 825151980 824890435 824774206 824735999 824633062 824421823 824230075 824136317 824005187
2272.2 824005187 823710918 823349237 823053658 822765768 822332025 821735859 821124315 820647120 820265770 819815159
2292.5 819815159 819259763 818722427 818272769 817808986 817219317 816558599 815956354 815401435 814729571 813844204
2312.9 813844204 812836885 811838508 810876727 809912801 808924496 807949007 807011962 806095779 805155694
2331.3H05155694r37283p85470n92708n39541o01411n58734k11537R1553o8725m17649
2351.7H00534189n03540l17514k21908k42532j95443j1683J64569J65343N6446P7188
2372.1G99505115K30073K47479N7220j43945k14159k06769k81095m62354n67972m87864
2392.5G97675729l69311l93688m99428m86731l28481k57254m22537o28233o26743m70519
2412.9G93192804m28558n75602o88076o45220n81324o33717p63952q15451p80702q44359
2433.3G86435843j069963j286030j327396j246273j248777j413286j583278j678467
2449.6G75582373j803815k006054k148211k021909j607299j150131r03010q81732r39548
2467.9G62120664j024544j162827j242995j070440n97239r179M76718P92205R26793
$$ plain form
2331.3 805155694 804218411 803432941 802840233 802300692 801699281 801140547 800929010 801020563 800951838 800534189
2351.7 800534189 800030649 799713135 799491227 799248695 799053252 799041569 799206138 799371481 799427927 799505115
2372.1 799505115 799735188 799982667 800039887 799895942 799681783 799475014 799193919 798731565 798163593 797675729
2392.5 797675729 797306418 796912730 796413302 795926571 795598090 795340836 794918299 794290066 793663323 793192804
2412.9 793192804 792764246 792188644 791500568 790855348 790274024 789640307 788876355 788060904 787280202 786435843
2433.3 786435843 785365880 784079850 782752454 781506181 780257404 778844118 777260840 775582373
2449.6 775582373 773778558 771772504 769624293 767602384 765995085 764844954 763941944 763060212 762120664
2467.9 762120664 761096120 759933293 758690298 757619858 757022619 757013440 757490158 758282363 759209156
2486.3G59209156Q43167N08011L0517l16858l15011n4061J56224J65939Q6785M76j20699
2508.7G60193646k55883l26931k97368k61009l32653n23210p22289q08000q21352r26793
2529.1G54918158j145601j308501j354933j381218j463294j546681j557052j546920
2545.5G43613958j553356j557052j484752j229584q97646o93500o11604n22554l38017
2563.8G34725893o9738K58684P27296J394868K104700K548694K567172K276004J864075
2582.2G48397648J366616P17461o6102q22127j389861j731813j878619j834333j560926
2600.5G41197944j047254l68297L88145J160622J790643K017319J723111J127004N87106
2618.9G48576343K50459K9087j89543m12464n75900o64890p45356q25465q29339p51257
$$ plain form
2486.3 759209156 760052323 760560334 760590851 760273993 759958982 759904921 760061145 760227084 760313869 760314345 760193646
2508.7 760193646 759937763 759610832 759313464 759052455 758719802 758196592 757474303 756666303 755844951 754918158
2529.1 754918158 753772557 752464056 751109123 749727905 748264611 746717930 745160878 743613958
2545.5 743613958 742060602 740503550 739018798 737789214 736891568 736198068 735586464 735063910 734725893
2563.8 734725893 734656155 734914839 735642135 737037003 739141703 741690397 744257569 746533573 748397648
2582.2 748397648 749764264 750481725 750415623 749593496 748203635 746471822 744593203 742758870 741197944
2600.5 741197944 740150690 739782393 740170538 741331160 743121803 745139122 746862233 747989237 748576343
2618.9 748576343 748826802 748855889 748666346 748253882 747677982 747013092 746267736 745442271 744612932 743861675
2639.3G43861675o51061n83947n82039o07491o34193o99461q01325r15110r96530r95159
2659.7G36395359j014888j145423j266122j261472j164317j053751r24528p18951m70459
2678G27375448k99394k70427k68995j05262L32355J029194J786172K425373K948045
2696.4G34952509L254474L106832K512336J776755J094460M38929j88232o74784r18507
2714.7G45354772r37760q36969p37071o22034l65853m8995J61290K91348L87728M37975
2735.1G43084431L78430J01089l21984o89566q88884j001418j148403j197457j016796
2753.5G37299442p74026p06195q43168r85980r26614p22766o42120q42631j164079
2771.8G29691863j338541j351297j310706j191795r66609p50124p11143r31621j311958
$$ plain form
2639.3 743861675 743210614 742626667 742044628 741437137 740802944 740103483 739302158 738387048 737390518 736395359
2659.7 736395359 735380471 734235048 732968926 731707454 730543137 729489386 728564858 727845907 727375448
2678 727375448 727076054 726805627 726536632 726431370 726763725 727792919 729579091 732004464 734952509
2696.4 734952509 738206983 741313815 743826151 745602906 746697366 747136295 746948063 746273279 745354772
2714.7 745354772 744417012 743580043 742842972 742220938 741855085 741806090 741967380 742258728 742646456 743084431
2735.1 743084431 743462861 743563950 743241966 742552400 741663516 740662098 739513695 738316238 737299442
2753.5 737299442 736525416 735819221 734976053 733990073 733063459 732340693 731698573 730855942 729691863
2771.8 729691863 728353322 727002025 725691319 724499524 723532915 722782791 722071648 721140027 719828069
2790.2G19828069j596689j671672j708746j875043k100110k191782k142846k130866
2806.5G04410315k149761k041638j785636j507759j346409j288712j215041j104176
2822.8F91971183j043499j102447j207769j190126j024664q73863q57592q84235q54671
2841.2F82932317q56578r34899j015305j018346q91149p47025p73549r14574j031220
2859.5F74749672j172781j386404j639008j844406j823008j609803j563012j721502
2875.9F61989748j724004j548410j438856j432180j373053j093149p11262n21899n80430
2894.2F51566505p64489r23753r29951q81970r47893j045942j058161j060605j207173
2912.6F42746568j521647j769722j814842j836300j955271k131462k289355k518653
$$ plain form
2790.2 719828069 718231380 716559708 714850962 712975919 710875809 708684027 706541181 704410315
2806.5 704410315 702260554 700218916 698433280 696925521 695579112 694290400 693075359 691971183
2822.8 691971183 690927684 689825237 688617468 687427342 686402678 685528815 684671223 683786988 682932317
2841.2 682932317 682075739 681140840 680125535 679107189 678216040 677469015 676695466 675780892 674749672
2859.5 674749672 673576891 672190487 670551479 668707073 666884065 665274262 663711250 661989748
2875.9 661989748 660265744 658717334 657278478 655846298 654473245 653380096 652668834 652146935 651566505
2894.2 651566505 650802016 649878263 648948312 648066342 647118449 646072507 645014346 643953741 642746568
2912.6 642746568 641224921 639455199 637640357 635804057 633848786 631717324 629427969 626909316
2928.9F26909316l104985l988266m550338l734291p52270L235936N458773M762888
2945.2F24236763K631843P93755k96891r79006j441121j642049j720428j849413k015352
2963.6F17718101k073825j987040j903951j933634k051473k218843k347707k320349
2979.9F00881279k127707j855732j693546j732707j796484j851619j976430j980841
2996.2E85866213j929522j991570j976788j900911j857102j745224j613796j617789
3012.5E71233511j719475j780093j804649j836181j824498j788676j817465j831591
3028.8E56830883j748264j563072j330316r98616m51863n1022j18017m32610p35462
3047.2E49401641r83536j265049j565636j855552k218008k421021k140999j714528
$$ plain form
2928.9 626909316 623804331 619816065 615265727 611531436 610779166 614015102 619473875 624236763
2945.2 624236763 626868606 627662361 627365470 626386464 624945343 623303294 621582866 619733453 617718101
2963.6 617718101 615644276 613657236 611753285 609819651 607768178 605549335 603201628 600881279
2979.9 600881279 598753572 596897840 595204294 593471587 591675103 589823484 587847054 585866213
2996.2 585866213 583936691 581945121 579968333 578067422 576210320 574465096 572851300 571233511
3012.5 571233511 569514036 567733943 565929294 564093113 562268615 560479939 558662474 556830883
3028.8 556830883 555082619 553519547 552189231 551190615 550738752 550687730 550569713 550137103 549401641
3047.2 549401641 548418105 547153056 545587420 543731868 541513860 539092839 536951840 535237312
3063.5E35237312j910805k911389l566385k163052J288354M325807M840255L421247
3079.8E38561344J888573J026333N75006L05056K11597K88486N48423Q93652J191735
3098.2E45490205J493573J867474K198755K385021K518653K653659K681076K527833
3114.5E63816249K287507K103150K012730J949072J840591J732052J702487J689136
3130.8E79132974J606941J499296J443982J484513J574159J613676J580179J496315
3147.1E91432035J398563J261831R86576O82354O11365P40468Q14915Q00073Q57472
3165.5E99585652J074314J351953J486719J488745J563191J782298J992405J993418
3181.8F12318695J867115J813352J852095J906395J892329J807630J735568J706063
$$ plain form
3063.5 535237312 533326507 530415118 526848733 524685681 525974035 530299842 535140097 538561344
3079.8 538561344 540449917 541476250 542051256 542356312 542567909 542856395 543404818 544298470 545490205
3098.2 545490205 546983778 548851252 551050007 553435028 555953681 558607340 561288416 563816249
3114.5 563816249 566103756 568206906 570219636 572168708 574009299 575741351 577443838 579132974
3130.8 579132974 580739915 582239211 583683193 585167706 586741865 588355541 589935720 591432035
3147.1 591432035 592830598 594092429 595079005 595761359 596372724 597113192 597928107 598728180 599585652
3165.5 599585652 600659966 602011919 603498638 604987383 606550574 608332872 610325277 612318695
3181.8 612318695 614185810 615999162 617851257 619757652 621649981 623457611 625193179 626899242
3198.1F26899242J621247J427471J278520J305223J401841J390636J310706J314998
3214.4F37949884J375496J405239J394213J338184J289546J311958J329303J296997
3230.7F48690820J277327J240015J179934J150787J126468J075625J022637R57906
3247.1F57721519Q20280O76632O40153O23465M77374K97308K52366K92241L08216L41475
3267.5F62451029L52502J99198k265j21772k44737l66687m54247n33581o15358p11799
3287.8F59952283q01325r46999j194477j469314j765549j993000k049029k114535k559662
3306.2F45058393l378748m086733m501224m877210n411148o061315o682932p194162
3322.5F02864921p707000q333265q757532q683503q221328p388651o088376m417062
$$ plain form
3198.1 626899242 628520489 629947960 631226480 632531703 633933544 635324180 636634886 637949884
3214.4 637949884 639325380 640730619 642124832 643463016 644752562 646064520 647393823 648690820
3230.7 648690820 649968147 651208162 652388096 653538883 654665351 655740976 656763613 657721519
3247.1 657721519 658541799 659218431 659858584 660482049 660959423 661256731 661509097 661801338 662109554 662451029
3267.5 662451029 662803531 663002729 663000464 662878692 662633955 662267268 661813021 661279440 660664082 659952283
3287.8 659952283 659150958 658203959 657009482 655540168 653774619 651781619 649732590 647618055 645058393
3306.2 645058393 641679645 637592912 633091688 628214478 622803330 616742015 610059083 602864921
3322.5 602864921 595157921 586824656 578067124 569383621 561162293 553773642 547685266 543268204
3338.8E43268204k473712l64065J588463L204048M474104N262076N719543O216466
3355.2E66895127O776393P235586P483542P442773P158398O657005N930185N130529
3371.5F20709538M460037L956855L538549L145039K781689K493739K290726K155065
3387.8F45531237K044678J870930J614511J422346J420498J442372J271069J033664
3404.1F57651305R59099J008808J039267R67324Q29756P49051P61628Q08597Q29578
3422.5F65604413Q35835Q82626R62973R54985Q80838Q94964R18567Q44538P96258Q41022
3442.9F74417019R26018J013934J027406R55760Q80420Q66592R03070R41694R47118
3461.2F82879031R57608J057088J140893J035511Q87275R36151J050353J104653J175105
$$ plain form
3338.8 543268204 540794492 540430427 542018890 545222938 549697042 554959118 560678661 566895127
3355.2 566895127 573671520 580907106 588390648 595833421 602991819 609648824 615579009 620709538
3371.5 620709538 625169575 629126430 632664979 635810018 638591707 641085446 643376172 645531237
3387.8 645531237 647575915 649446845 651061356 652483702 653904200 655346572 656617641 657651305
3404.1 657651305 658610404 659619212 660658479 661625803 662455559 663204610 663966238 664774835 665604413
3422.5 665604413 666440248 667322874 668285847 669240832 670121670 671016634 671935201 672779739 673575997 674417019
3442.9 674417019 675343037 676356971 677384377 678340137 679220557 680087149 680990219 681931913 682879031
3461.2 682879031 683836639 684893727 686034620 687070131 687957406 688893557 689943910 691048563 692223668
3479.6F92223668J245320J296818J341403J342416J307904J266361J227557J228094
3495.9G02479541J219273J142144J092017J163661J208961J143933J129746J196086
3512.2G11775362J240016J226723J187384J146436J134693J172483J205921J197815
3528.5G21286833J173437J157045J178146J178026J117170J093030J092255J065791
3544.8G30341733J035273J047968J090646J160920J241088J213670J147687J129806
3561.1G39408791R89318Q12471J118719J664103J679480J463413J399278J387954J453758
3579.5G51377285J565992J445592J116514J109123J496196J544535J361549J438916
3595.8G62455702J596749J616120J589000J375139R74476Q95024J196742J337290J225173
$$ plain form
3479.6 692223668 693468988 694765806 696107209 697449625 698757529 700023890 701251447 702479541
3495.9 702479541 703698814 704840958 705932975 707096636 708305597 709449530 710579276 711775362
3512.2 711775362 713015378 714242101 715429485 716575921 717710614 718883097 720089018 721286833
3528.5 721286833 722460270 723617315 724795461 725973487 727090657 728183687 729275942 730341733
3544.8 730341733 731377006 732424974 733515620 734676540 735917628 737131298 738278985 739408791
3561.1 739408791 740398109 741210580 742329299 743993402 745672882 747136295 748535573 749923527 751377285
3579.5 751377285 752943277 754388869 755505383 756614506 758110702 759655237 761016786 762455702
3595.8 762455702 764052451 765668571 767257571 768632710 769607186 770502210 771698952 773036242 774261415
3614.2G74261415R53853R23038J408159J520157R35495K66552L16560J202882J403928
3632.5G83192039J031160Q21829P19726N86927L35634j28866n39183j30713Q25464
3650.9G86714017R01938N93543P75814R36031N85378K41220P7426k01643l09467q34
3671.3G90313423j02222k10882M74513Q01802N52892K74301L1233j13964l9518K96354
3691.7G92277932N93603N48661K41458n6684p6711J24156K7359l71337n26786m1604
3712.1G92740047M65870K93553j23620l11852k51412r1613J56403K65002n7816m79520
3732.5G92605042l23832L80576N86689o0201p90954o16908O7651q8632j57416N05329
3752.9G92107344O29961J65224m4107R4712K3245k27689k60949p1943J84834K40147
$$ plain form
3614.2 774261415 775215268 776138306 777546465 779066622 780002117 780268669 780585229 781788111 783192039
3632.5 783192039 784223199 785045028 785764754 786351681 786687315 786558449 786019266 785888553 786714017
3650.9 786714017 787615955 788209498 788985312 789921343 790506721 790747941 790825367 790623724 790314257 790313423
3671.3 790313423 790211201 790000319 790474832 791276634 791829526 792103827 792135060 792021096 791981578 792277932
3691.7 792277932 792871535 793420196 793661654 793604970 793528259 793652415 793679774 793308437 792781651 792740047
3712.1 792740047 793205917 793499470 793375850 793063998 792812586 792720973 792877376 793142378 793084562 792605042
3732.5 792605042 792281210 792661786 793248475 793188274 792397320 791780412 791848063 791759431 791602015 792107344
3752.9 792107344 792737305 792902529 792858422 792953134 792976379 792748690 792487741 792415798 792600632 792840779
3773.3G92840779K2173j57178j06156j3530o1691n5730N3227R0003k742k81095n35012
3795.7G91793048n15401m68969k43008J10626R5188J98484L32951K5094m19557n04911
3816.1G90403545l33846l04043P6592M19736K06888o1810k71917l45051k60294l02672
3836.5G89227128k53558N6445K50817K94745J53005l14355r95994j133024J21534Q61823
3856.9G88268566L86655k01046m17531k30908j50859k40565l6895K05517K24590L994
3877.3G87811518l16084k42650p5460j05440o3479j39773j64032N8591k682m21226
3897.7G86339283o68585m50969M6968M61400M72188J85788q9348k55167k99454j74284
3918.1G85567820l2306m8458n4479M0889k5272k08140j42872Q4758O0021j72138k87473
$$ plain form
3773.3 792840779 792862952 792705774 792599618 792586088 792524397 792468667 792521894 792611897 792609155 792328060 791793048
3795.7 791793048 791277647 790808678 790565670 790676296 790771484 790969968 791302919 791328013 790908456 790403545
3816.1 790403545 790069699 789765656 789842248 790261984 790468872 790407062 790135145 789790094 789529800 789227128
3836.5 789227128 788973570 789030015 789280832 789575577 789728582 789414227 788418233 787285209 787406743 788268566
3856.9 788268566 788655221 788454175 788036644 787805736 787654877 787414312 787377417 787582934 787807524 787811518
3877.3 787811518 787495434 787252784 787177324 787071884 787008405 786868632 786704600 786763191 786760509 786339283
3897.7 786339283 785670698 785219729 785266697 785728097 786200285 786386073 786296725 786041558 785742104 785567820
3918.1 785567820 785535514 785487056 785432577 785473466 785448194 785240054 785097182 785181940 785241961 785069823 784782350
3940.5G84782350j79052k8611k7120m1246K6464K087j19865j63138j13428n2333m5299
3962.9G84040809j00255j40310j53899j79171k06829j82747j33634j01864n8949m3571
3983.3G82739580r6917j50919j18077o5446r6500j53542j63912
3997.6G81894267
$$ plain form
3940.5 784782350 784603298 784574687 784547567 784506321 784532785 784534872 784415007 784251869 784138441 784086108 784040809
3962.9 784040809 783940554 783800244 783646345 783467174 783260345 783077598 782943964 782842100 782783151 782739580
3983.3 782739580 782642663 782491744 782373667 782308221 782211721 782058179 781894267
3997.6 781894267
##END=$$ End of the data block
