##TITLE=B8M - Rodrigo - Chalcona $$ Begin of the data block
##JCAMP-DX=5.00 $$ ACD/SpecManager v 10.08
##SPECTROMETER/DATA SYSTEM=Alpha
##DATE=13 Apr 2015 08:10:36
##DATA TYPE=INFRARED SPECTRUM
##DATA CLASS=XYDATA
##ORIGIN=
##OWNER=
##NPOINTS=1765
##FIRSTX=399.76428223
##LASTX=3997.64306641
##MAXX=3997.64306641
##MINX=399.76428223
##MAXY=0.83829862
##MINY=0.18765022
##XFACTOR=1.0000000000
##YFACTOR=1.000000000000000e-9
##FIRSTY=0.77678597
##DELTAX=2.03961372
##XUNITS=1/CM
##YUNITS=ARBITRARY UNITS
##XYDATA=(X++(Y..Y))
399.8G76785970j0556877N870640J4243961L689825j3306021j4452279J512587J3991773
$$ 776785970 766229093 772099733 786343694 790033519 776727498 762275219 763787806 777779579
416.1G77779579Q452177r802103j2505591J565576J3689637Q387327r303987j7793596
$$ 777779579 786231756 776429653 763924062 765489638 779179275 787566602 778262615 760469019
432.4G60469019o555676J0696590J3061046r02831j2768984o634116R456515J3465643
$$ 760469019 753913343 764609933 777670979 776768148 763999164 757365048 766821563 780287206
448.7G80287206n5253j4364064j1473894N017340J4013231K561688j2863219j3835191
$$ 780287206 780231953 765867889 754393995 759411335 773424566 775986254 763123035 749287844
465G49287844k07067J0528326M017115j2731433j8803537r557486r13858p830560k7200818
$$ 749287844 749080777 759609103 763626218 750894785 732091248 722533762 721619904 713789344 686588526
483.4F86588526m1097284m0121138j8140196K9763221O4214766M8636556J9144416
$$ 686588526 645491242 605370104 587229908 616993129 681207895 729844451 748988867
497.7G48988867J2097478J4420747M850090j1189401j5163779l318251Q132101M269719
$$ 748988867 761086345 775507092 780357182 769167781 754004002 750685751 758817852 763087571
514G63087571j0692001j8899679r098351P818282J3879120M728496o555915m743159
$$ 763087571 752395570 733495891 724397540 732215822 746094942 750823438 744267523 739524364
530.3G39524364O812275J2142301K928018j0479748j2070179p96259Q429766L392160
$$ 739524364 746336639 758478940 761406958 750927210 738857031 738060772 746490538 749882698
546.6G49882698j0286331j6492486r754002j774490o441414k2935510l8035393m2359173
$$ 749882698 739596367 723103881 713349879 711575389 705133975 682198465 644163072 601803899
562.9F01803899l5881102j7893374J4541268M8668802O0936868N1410556L5403013
$$ 601803899 565922797 548029423 562570691 611239493 672176361 723586917 758989930
577.2G58989930J6369701l046155j1450053m179239O900430O902456m725158j3645411
$$ 758989930 775359631 772313476 760863423 756684184 763584614 770487070 765761912 752116501
593.5G52116501q290708M897237J0275006J834453r628356j0583520j084685N659520
$$ 752116501 743825793 748723030 758998036 760832489 751204133 740620613 739535928 745195448
609.8G45195448j336157j7615259k1866083p48217K2458911K0280302J692474j0480643
$$ 745195448 743859291 726244032 704377949 703629732 726088643 746368945 748061419 737580776
626.2G37580776p675111K628744O738662m00662r991229j0541916j922309M899144
$$ 737580776 729905665 732534409 739273071 738872409 728881180 718339264 716416955 721316099
642.5G21316099J434505q444846j3410627q636654j927316m042029j4795006k4537265
$$ 721316099 722750604 714305758 700895131 692258477 690331161 686289132 671494126 646956861
658.8F46956861k7209043k7740658k9884398k9405832r998620J1976958J9753694K6462615
$$ 646956861 619747818 592007160 562122762 532716930 522718310 534695268 554448962 580911577
675.1E80911577J7574250r173393l6704242o1936617q4066838p6078504j7992765N4637849
$$ 580911577 598485827 589312434 552608192 490671575 406604737 330526233 312533468 367171317
691.4C67171317R3712330R7537071Q1901014N3021729K2877216N210638N690992J7447591
$$ 367171317 460883647 558420718 640321732 693343461 716220677 721431315 727122307 744569898
707.7G44569898K1000385P371843q261144j0724128m219412j694262q265317j7019033
$$ 744569898 765570283 772942126 764680982 753956854 749737442 748043180 739777863 722758830
724.1G22758830j9255877j5336096j3986230k1564901l4731865m7187567o0679853
$$ 722758830 703502953 688166857 674180627 652615726 617883861 570696294 510016441
738.3E10016441q2148671j03191465r4303891m0674895L4779221R8743424J28481954
$$ 510016441 427867770 324676305 230372414 189697519 224476740 323220164 451702118
752.6D51702118J20003581R0071142N8845222L9054870L1389416K5359392J3569474
$$ 451702118 571705699 661776841 720622063 759676933 791066349 816425741 829995215
766.9H29995215J212239k275526K806544O190658L69489j0669708j8032909k0411909
$$ 829995215 831207454 828931928 831738472 837929130 838298619 827628911 809596002 789184093
783.2G89184093j9802689j2347996r67980Q640588J8620312K4066329J8534064O166637
$$ 789184093 769381404 757033408 756065428 764706016 783326328 807392657 825926721 832093358
799.5H32093358m179656n880118l84807M069387J733482m367590o617188k069056L776789
$$ 832093358 827913702 822033584 821648777 825718164 827451646 823084056 816466868 814397812 818174601
817.9H18174601L932476j654745o297945m735053O24657K837061j197814p207990r084404
$$ 818174601 822107077 820452332 814154387 809419334 810043991 812881052 811683238 804475248 795390844
836.2G95390844n983233k291620j612604l666937n863011o344139o562591r199619
$$ 795390844 789407611 787115991 785503387 781836450 775973439 769629300 763066709 753867090
852.6G53867090j3932407k1078706l1706214l6382794j2635529L6231696O1186314
$$ 753867090 739934683 718855977 687149763 650766969 638131440 674363136 735549450
866.8G35549450M2927861J7996073P813513L651440j350045m851162l979087p85768
$$ 735549450 778477311 796473384 804286897 807938337 806588292 801737130 797758043 796972275
883.2G96972275j80423l976882p307529m329205K546430N798041L288866j494587m078031
$$ 796972275 796791852 792814970 785507441 781178236 783724666 789522707 792811573 791316986 787238955
901.5G87238955k665579K87593Q63492j829684m843712n058884k502442n90741k274037
$$ 787238955 784573376 784860969 785724461 783894777 779051065 773992181 771489739 770898998 768624961
919.9G68624961n926728o862759l676475l02434j205027n387127o531656j096427N189240
$$ 768624961 762698233 755835474 752158999 751856565 750651538 745264411 738732755 737636328 742825568
938.2G42825568N101144J91510m253209n744755m853845l925621m890025p361770r321391
$$ 742825568 747926712 748118222 743865013 738120258 733266413 729340792 724450767 717088997 707767606
956.6G07767606r878159j0483146j3612270k0387649k9792130l6757648l5400272k9846012
$$ 707767606 697889447 687406301 673794031 653406382 623614252 586856604 551456332 521610320
972.9E21610320l0732543l0050754j909524M7057628P0564568N0922454J4266550j7218768
$$ 521610320 490877777 460827023 458917499 505975127 576539695 627462149 641728699 624509931
989.2F24509931l7638784m0631413k0881236R981513L9906085N7205259M1981221O419301
$$ 624509931 586871147 546239734 525358498 535340011 575246096 632451355 674432576 680851877
1005.5F80851877k1265269m0156424n8713197p0680321n0622642J4730990Q1271172
$$ 680851877 659586608 619430184 560716987 490036666 439414024 454145014 535416186
1019.8E35416186Q7987006M2093336M876316L967583J528859k8090537m5265615j6336262
$$ 535416186 623403192 665496528 670372844 674340427 675869286 647778749 602513134 586176872
1036.1E86176872L2326639N6784391M9212039L0705631J6471505Q459925M330576K060473
$$ 586176872 618503511 675287902 724499941 755205572 771677077 780137002 784467578 786528051
1052.4G86528051L48866j160622k471149l634751n109727p434070j0736406j4058232
$$ 786528051 786876917 785716295 783245146 779610395 774500668 767066598 756330192 742271960
1068.8G42271960j4289320p917642K687990R108901Q245588M859626L149033M033863
$$ 742271960 727982640 720064998 722752988 731861889 740107477 744967103 748116136 752149999
1085.1G52149999O246448O601572L790498J91450j920522k538621k596259k447903
$$ 752149999 758396447 764998019 768788517 768979967 767059445 764520824 761924565 759476662
1101.4G59476662j820267m97877Q94844J481891R95457j17242r88841j008094n19454
$$ 759476662 757656395 757158518 758053362 759535253 760530710 760413468 759424627 758416533 757897079
1119.8G57897079n20349j366615k380490k501547j520455m66645n24521j613081k596855
$$ 757897079 757376730 756010115 753629625 751128078 749607623 749140978 748616457 747003376 744406521
1138.1G44406521k654254k165437k389610m385888q926213j5703023j7271757n374789
$$ 744406521 741752267 739586830 737197220 732811332 723885119 708182096 690910339 685535550
1154.4F85535550R252131J1366606N524874R40680j983583n140543r661972j5972436
$$ 685535550 694787681 706154287 711679161 712619841 710636258 705495715 695833743 679861307
1170.7F79861307k1973371k2635520j5498936l869951O538451J0695815R339273P379889
$$ 679861307 657887936 635252416 619753480 615883529 622421980 633117795 642457068 649836957
1187.1F49836957N023003m65870q159876j5100002k0439506k4838805k8179168k8564394
$$ 649836957 654859960 654394090 646234214 631134212 610694706 585855901 557676733 529112339
1203.4E29112339k4284720j9572407k2691489l4409731m5965165m6492785k8286010
$$ 529112339 504827619 485255212 462563723 428153992 382188827 335696042 307410032
1217.7C07410032Q103191N0951779Q1916064Q8849902P5870395N6133986L8182854
$$ 307410032 315513223 366465002 448381066 537230968 613101363 669235349 707418203
1231.9G07418203K4185956J4108479Q011460N227149L506720J089454k427876n908192
$$ 707418203 731604159 745712638 753724098 758951247 762457967 763547421 761119545 755211353
1248.2G55211353p322728o058157l906250l118813l981113m837752m268050l129482
$$ 755211353 747888625 741830468 737924218 734805405 730824292 725986540 721718490 718589008
1264.6G18589008l456414n925536q955479j0582685j0969699j2856423j8919528k9031396
$$ 718589008 715132594 709207058 700251579 689668894 678699195 665842772 646923244 617891848
1280.9F17891848l9341271m1423559k2812903J7526031N1001191M9436986K3470819
$$ 617891848 578550577 537127018 514314115 531840146 582841337 632278323 655749142
1295.2F55749142j43766j3444841k2313774l0737638l8204313m2297244l9639622k3391306
$$ 655749142 655605376 642160535 619846761 589109123 550904810 508607566 468967944 445576638
1311.5D45576638J4712155O0713202P6535821N0508380J1501133j5659154l0178010
$$ 445576638 460288793 521001995 597537816 648046196 659547329 643888175 613710165
1325.8F13710165l5595715l6145270l9981663m8832625n4159671m7332645k1707862
$$ 613710165 578114450 541969180 501987517 453154892 398995221 351662576 329954714
1340C29954714K0851969O1615050Q3382875Q3329737P1985483N7044208M1130722K6335358
$$ 329954714 350806683 412421733 495804608 579134345 651119828 708164036 749294758 775630116
1356.4G75630116J3854802N173326J115024O47962M72009j317143l586054m424215
$$ 775630116 789484918 794658244 795773268 796421230 796893239 795576096 791990042 787565827
1372.7G87565827l432393j861691k133012m122138n252719m022002j882792j338482
$$ 787565827 784133434 782271743 780138731 776016593 770763874 766741872 764859080 763520598
1389G63520598k577722l937482l303290p6651K471268K008080k51353j721859j046359
$$ 763520598 760942876 757005394 753702104 753625453 756096721 758104801 757853448 756131589 755085230
1407.3G55085230K97665M7029j656533l173351l494918k658725j938403l322244n471408
$$ 755085230 755382895 755429924 753773391 750600040 747105122 744446397 742507994 739185750 733714342
1425.7G33714342o180942o204665o174743q300125j7493487k8570771l2718658m7075630
$$ 733714342 727533400 721328735 715153992 706853867 689360380 660789609 628070951 580995321
1442E80995321p2297394q1014216k4350434Q9896559J39209062R6228600L8413107
$$ 580995321 508697927 427683711 403333277 493229836 632438898 728667498 767080605
1456.3G67080605O129622k591133k804994k700865l039003l885984n828977q755326
$$ 767080605 773210227 770619094 767814100 765113235 762074232 758188248 752359271 743603945
1472.6G43603945r104371p736445o979644n611837l314793j309991k304733r182811
$$ 743603945 734499574 726763129 719783485 714171648 710856855 709546864 707242131 698059320
1488.9F98059320k0914077k8575301k8048039j511216M1087866M2146563J8120945
$$ 698059320 677145243 648569942 620521903 619010687 660098553 702245116 720366061
1503.2G20366061K122164l657997j204670Q75235r0778j945257k769232k262413k563358
$$ 720366061 722488225 718830228 717625558 718500793 718410015 716464758 713695526 711433113 708869755
1521.6G08869755l672182m814029n411863m140318l559828m787266m780233m675865
$$ 708869755 705197573 700383544 694971681 690831363 687271535 682484269 677704036 673028171
1537.9F73028171o659567o087780m471124n599498p448375r412945r908140r763956
$$ 673028171 666368604 660280824 655809700 650210202 642761827 633348882 623440742 613676786
1554.2F13676786j0399997j7658353k4083614j6708612j7869115k4202645l3851773
$$ 613676786 603276789 585618436 561534822 544826210 526957095 502754450 468902677
1568.5D68902677m7895193m7668308l1195283J0693670O0979515P5395197M8580586
$$ 468902677 421007484 373339176 342143893 352837563 413817078 489212275 537792861
1582.8E37792861n079329m3221265n9799164o1687917m3755829j8833667r905726k0475685
$$ 537792861 532713532 489492267 429693103 368005186 324249357 305415690 295509964 275034279
1599.1B75034279l6436618l8314432j2633010L3677682P9188317R6960366Q1607312
$$ 275034279 238597661 200283229 187650219 221327901 300516218 397476584 479083896
1613.4D79083896N8743775M4267177L4806967L0563831K5319338J3013005K902329
$$ 479083896 537827671 582094848 616901815 647465646 672784984 685797989 688700318
1627.6F88700318j798093l806233o936968j4401018j7466844j4694869j3436317j3398648
$$ 688700318 686902225 683095992 676159024 661758006 644291162 629596293 616159976 602761328
1643.9F02761328j9494951k6559829k3944021l5655230o3953727o0596079o2022448
$$ 602761328 583266377 556706548 532762527 497107297 433153570 372557491 310535043
1658.2C10535043o0018032j5528113N7000697R8376363J16838038J12324596P0159554
$$ 310535043 250517011 234988898 291989595 390365958 507203996 619528592 689688146
1672.5F89688146M0110588K5513590J3216078O956160N405188Q721172J1907935J1677862
$$ 689688146 729798734 755312324 768528402 775484562 780889750 789610922 801518857 813196719
1688.8H13196719R368300M619777R44853p52449r68516j522183j332104j112402n34475
$$ 813196719 822565019 827184796 828129649 827377200 826408684 824886501 823554397 822441995 821907520
1707.2H21907520J44244j55211j439571l195048m079759k308905M1246M84407K5273
$$ 821907520 822051764 821896553 820456982 817261934 813182175 810873270 810914516 811398923 811424196
1725.5H11424196k77221K75909R95517R51886J76788n93007r62436m97460J02400m67836
$$ 811424196 811146975 811422884 812418401 813370287 813547075 812954068 811991632 811494172 811596572 811128736
1745.9H11128736j634598k500475j932144r29832j065910j866460k498686k667606
$$ 811128736 809494138 806993663 805061519 804131687 803065777 801199317 798700631 796033025
1762.2G96033025j906932j610279k592683l730297m192412k481877l98279L62337N46575
$$ 796033025 794126093 792515814 789923131 786192834 782000422 779518545 779120266 779482603 780029178
1780.6G80029178Q62240J474798K008200J869738Q43525l26216n24283j24097r5844
$$ 780029178 780891418 782366216 784374416 786244154 787087679 786761463 786237180 786113083 786017239
1799G86017239o92546j577437k013922j729369j208842j474559k831519m223645m389643
$$ 786017239 785324693 783747256 781733334 780003965 778795123 777320564 774489045 770265400 765875757
1817.3G65875757k717674n70774L62694J90139N1677M15623J140535J453877J071930
$$ 765875757 763158083 762587309 762950003 763140142 763191819 763607442 764747977 766201854 767273784
1835.7G67273784Q28445J268923J926184K172470J574814M64559j87636M5061P15316
$$ 767273784 768102229 769371152 771297336 773469806 775044620 775509179 775321543 775366604 776081920
1854G76081920R56475M40479k45929m11332q5413j431o05225j276732j374066j194417
$$ 776081920 777038395 777478874 777232945 776821613 776736200 776734769 776129544 774852812 773478746 772284329
1874.4G72284329r82106j060843j624227k151608j980782j177370o83070j028835j958371
$$ 772284329 771302223 770241380 768617153 766465545 764484763 763307393 762624323 761595488 759637117
1892.8G59637117k993106l352225k964497k632737k442241j676082N5015K044320L001988
$$ 759637117 756644011 753291786 750327289 747694552 745252311 743576229 743631244 745675564 748677552
1911.1G48677552K536356J544416R67920J005232J079321R01580Q19385J028896J407504
$$ 748677552 751213908 752758324 753726244 754731476 755810797 756712377 757531762 758560658 759968162
1929.5G59968162J600146J215637K91407o49333j138926j235664j238048j503050k061904
$$ 759968162 761568308 762783945 763075352 762426019 761287093 760051429 758813381 757310331 755248427
1947.9G55248427k299904j884938j335025j365304k242624l569305m396141l851294
$$ 755248427 752948523 751063585 749728560 748363256 746120632 742551327 738155186 734303892
1964.2G34303892j938701L42607J758099K306402K666652K767622K344311J623273
$$ 734303892 732365191 732707798 734465897 736772299 739438951 742206573 744550884 746174157
1980.5G46174157J108527J122117J483858J682758J371562P71940M03404M07100N03004
$$ 746174157 747282684 748404801 749888659 751571417 752942979 753714919 754118323 754525423 755028427
1998.8G55028427K91824l75569j008630j012146m53890L4392L0637k34783k23517J31249
$$ 755028427 755320251 754944682 753936052 752923906 752470016 752504408 752535045 752300262 752076745 752207994
2019.2G52207994K53201k77996j078963j367629j047790l39150N77628J086652Q01087
$$ 752207994 752461195 752183199 751104236 749736607 748688817 748349667 748927295 750013947 750815034
2037.6G50815034K11060n7459q7917l44932q77619j116335o15299K45333O39558K38180
$$ 750815034 751026094 750968635 750880718 750535786 749658167 748541832 747926533 748171866 748811424 749049604
2058G49049604m35710o54876l26813L0518k8551m51445p42018n39899l3617K59638
$$ 749049604 748613894 747959018 747632205 747662723 747634172 747182727 746440709 745900810 745867193 746126831
2078.4G46126831O4134l35753m40419j33991J61112J9550m82559q05438n55515J5080
$$ 746126831 746190965 745855212 745414793 745280802 745441914 745461464 744978905 744173467 743617952 743633032
2098.8G43633032K69711k8610m41790m41432L576M00484K71499k56836n81980l91603
$$ 743633032 743902743 743874133 743432343 742990911 742994487 743394971 743666470 743409634 742827654 742436051
2119.2G42436051r715K1159l91304p57515n84186M3691N34355M24624j05024l91364
$$ 742436051 742426336 742447495 742056191 741298676 740714490 740758181 741292536 741717160 741612136 741220772
2139.6G41220772j32382K61009K40624k34723o68228n99324j65642N5611k19702o24597
$$ 741220772 741088390 741349399 741590023 741355300 740687072 740087748 739922106 739977717 739758015 739133418
2160G39133418n96106j06574L12567K12968k57671n74589m17769L1590K14875j16408
$$ 739133418 738537312 738430738 738743305 738956273 738698602 738124013 737706244 737737834 737952709 737836301
2180.4G37836301n81801o71923k87473J04964K4259m32372p10309m23789J01805K24531
$$ 737836301 737254500 736582577 736295104 736400068 736424327 735991955 735281646 734857857 734959662 735184193
2200.8G35184193j89603o65307o63817j98245J51992j7524m85539p33972m82022n484
$$ 735184193 734994590 734329283 733665466 733467221 733619213 733601689 733116150 732382178 731900156 731894672
2221.2G31894672J04666l30627p92325p05063j36554L23951K13504k72990n06818k17914
$$ 731894672 731999338 731668711 730876386 730171323 730034769 730358720 730572224 730299234 729792416 729574502
2241.6G29574502J99139J54078l87848q11338o48558r5904K28584m5240o02424p91252
$$ 729574502 729773641 729927719 729539871 728728533 728079975 727984071 728212655 728167415 727564991 726773739
2262G26773739l88265J09792J24991k51770m90546l05832J17064K77698p4566n29587
$$ 726773739 726385474 726495266 726620257 726368487 725877941 725572109 725689173 725966871 725892305 725362718
2282.3G25362718n07057j5854L95178K54155l09229o38187l76523J15276K29895j98245
$$ 725362718 724855661 724839807 725234985 725489140 725179911 724541724 724165201 724280477 724510372 724312127
2302.7G24312127p20621q50081n95212l97384n93007q77142o47247R3282O99520O00576
$$ 724312127 723591506 722741425 722146213 721748829 721155822 720278680 719631433 719724715 720424235 721024811
2323.1G21024811r2268p55012r06348n86152l01004m10199n93066l39866K30015N20467
$$ 721024811 720932543 720177531 719271183 718685031 718384027 717973828 717380762 717040896 717270911 717791378
2343.5G17791378K97249J27315J81258J67430K53856M87864K61843l05891m39882j03832
$$ 717791378 718088627 718215942 718397200 718564630 718818486 719306350 719568193 719262302 718822420 718718588
2363.9G18718588J94669N5432m33862p21812m77493k3544N8592l06070o28472m91142
$$ 718718588 718913257 718968689 718534827 717813015 717335522 717311978 717370570 717064500 716436028 715944886
2384.3G15944886K3902M21881K90990k25067n70655l86953O7174J98365j95802o48260
$$ 715944886 715968788 716390669 716681659 716456592 715885937 715498984 715566158 715764523 715568721 714920461
2404.7G14920461o17325j67489J75178L3736m13418o24656l39032R8944J58429k35736
$$ 714920461 714303136 714135647 714310825 714344561 713931143 713306487 712967455 713066399 713224828 712989092
2425.1G12989092o25134n42223o1631K99334J95623j61767k82288L040L65078L13819
$$ 712989092 712363958 711821735 711760104 712059438 712255061 712093294 711811006 711814046 712179124 712492943
2445.5G12492943j86205n81026m83573j31428o854l30747p98463q48532l37243K54571
$$ 712492943 712306738 711725712 711242139 711110711 711103857 710773110 709974647 709126115 708788872 709043443
2465.9G09043443L26097j42574n52833m75168j40369n7340l94762p66694o94692k37763
$$ 709043443 709369540 709226966 708674133 708198965 708058596 708001256 707606494 706839800 706145108 705907345
2486.3G05907345R0778n7102m90844p10785m88997j22606p1109l88503o24359l82840
$$ 705907345 705998123 705941021 705450177 704739392 704250395 704127789 704056680 703668177 703043818 702660978
2506.7G02660978J75178N13255K89321k61664n65648l44098O4791J26123j95444m47929
$$ 702660978 702836156 703349411 703638732 703377068 702811420 702467322 702532113 702658236 702462792 702014863
2527.1G02014863k84969J58250M20690J88529l01897m91262k43068K7120o2823m30107
$$ 702014863 701729894 701888144 702308834 702497363 702195466 701704204 701461136 701488256 701425433 700995326
2547.5G00995326o44863m06563O4314K33531q8990n15104n91874l21030q8275k17855
$$ 700995326 700350463 699943900 700008214 700241745 700152755 699637651 699045777 698724747 698636472 698418617
2567.9F98418617n80847p05540l58224J22785J87219k86520q69810j125575j021683
$$ 698418617 697837770 697132230 696774006 696896791 697084010 696797490 695927680 694802105 693780422
2586.2F93780422p87854n57840l17454q3447J68860L62814K00510l27230p79032q07941
$$ 693780422 692992568 692434728 692117274 692033827 692202687 692565501 692766011 692438781 691659749 690851808
2606.6F90851808m74215j50442j78278m23610l98695P4029O19292Q00133O13808L84868
$$ 690851808 690377593 690227151 690048873 689625263 689226568 689300597 689919889 690720022 691333830 691718698
2627F91718698L69668M95910M42267R2566k40207j98364J64032M08768K45333j37150
$$ 691718698 692088366 692584276 693026543 693119109 692878902 692680538 692844570 693253338 693498671 693361521
2647.4F93361521l47495j96278J24752K02298j26958n17487n27382j80662P5519p9810
$$ 693361521 693014026 692817748 692942500 693144798 693017840 692500353 691972971 691792309 691867828 691788018
2667.8F91788018m60267o07133l24726J28328L49522K40445M2856l3557K1576J7465
$$ 691788018 691327751 690720618 690395892 690524220 690873742 691114187 691157043 691123486 691145062 691162527
2688.2F91162527k47240o13332p48396n73158l22283l15368n58853p12752n06223m8995
$$ 691162527 690915287 690301955 689553559 688980401 688658118 688342750 687783897 687071145 686564922 686515927
2708.6F86515927L01659K98679M1783j14560R775J52230P391l43620o28054n90563
$$ 686515927 686817586 687116265 687158048 687043488 687053263 687205493 687212884 686869264 686241210 685650647
2729F85650647k34247J4961j10090m03404n43117m01378j85192j68204l77119o03497
$$ 685650647 685416400 685431361 685321271 684917867 684374750 683973372 683788180 683619976 683242857 682639360
2749.4F82639360n31792j51456J01149o1750l69310m59612l69727l56913n04792o20722
$$ 682639360 682107568 681956112 682057261 681995511 681626201 681166589 680796862 680439949 679935157 679314435
2769.8F79314435n02289k35617j13726k26438l88562m31419l12984j60813k35617o15180
$$ 679314435 678812146 678576529 678462803 678236365 677847803 677416384 677103400 676942587 676706970 676091790
2790.2F76091790r62972q78633m52220j81138l32475o38366p28667m67777O1333N08487
$$ 676091790 675128818 674250185 673797965 673616827 673284352 672645986 671917319 671449542 671510875 672019362
2810.6F72019362O26803N81145N69999O05107N63204L32594o080k28345k00927m9413
$$ 672019362 672646165 673227310 673797309 674402416 674965620 675298214 675292134 675063789 674862862 674813449
2831F74813449j5318j62125l19779l95953l83675l06309l58045n94377p86662p16806
$$ 674813449 674798131 674636006 674316227 673920274 673536599 673230290 672872245 672277868 671491206 670774400
2851.4F70774400m82082l87848m32431m13239k84016j20819j24931l78251n92769n26964
$$ 670774400 670292318 669904470 669472039 669058800 668774784 668653965 668529034 668150783 667558014 667031050
2871.8F67031050l71695l52144m23133n30303n36680k94030j8001N007j51694k68399
$$ 667031050 666659355 666307211 665884078 665353775 664817095 664523065 664505064 664510071 664358377 664089978
2892.2F64089978l11077l48270n00500q24928j083374j025260o85453l07143j60635
$$ 664089978 663778901 663430631 662930131 662105203 661021829 659996569 659311116 659003973 658843338
2910.5F58843338l57091p86006j114786j067698p35998m06087k69055j86384l516R4950
$$ 658843338 658486247 657700241 656585455 655517757 654781759 654375672 654106617 653920233 653916717 654011667
2930.9F54011667R8943J53900K04622L10898N64754O67811L32713k17676m78924l35693
$$ 654011667 654110610 654264510 654469132 654780030 655344784 656012595 656345308 656127632 655648708 655313015
2951.3F55313015k93434n48780p41660p26640n81444m61638n43058p48455q35836o32048
$$ 655313015 655019581 654470801 653729141 653002501 652421057 651959419 651416361 650667906 649832070 649200022
2971.7F49200022k64227m5955m5181k41577o28054r52959j069367j197279j501322
$$ 649200022 648935795 648889840 648844659 648603082 647975028 647022069 645952702 644755423 643254101
2990.1F43254101k070486l029228m165232m661023l231824J05381K806664K790630
$$ 643254101 641183615 638154387 633989155 629328132 626096308 626201689 629008353 631798983
3006.4F31798983Q09311j607716l857731n449653n510092m126191k546608j387656
$$ 631798983 632608294 631000578 627142847 621693194 616183102 612056911 609510303 608122647
3022.7F08122647m27187L60132M03404j71423m00365o74545j324952j116514L52740
$$ 608122647 607695460 608055592 608458996 608287573 607887208 607212663 605887711 604771197 605123937
3041.1F05123937J599729P08461k496600o199241r042203j1048317j1714041r783924
$$ 605123937 606723666 607432127 604935527 598736286 589694083 578645766 566931725 557147801
3057.4E57147801m694879L816843J3767183J9585788J8332303J2982428P691145M210889
$$ 557147801 552452922 556269765 570036948 589622736 607955039 620937467 628628612 632839501
3073.7F32839501K068162N10394k50160K20120J532733K571225K591670J808405P94172
$$ 632839501 634907663 635418057 635167897 635388017 636920750 639491975 642083645 643892050 644686222
3092.1F44686222j01745q29577j463175j799286j236379M60923K328753L059268K477765
$$ 644686222 644584477 643754900 642291725 640492439 639256060 639716983 642045736 645105004 647582769
3110.4F47582769J490832P96258L99173J68859l6656l03865m67181m05312k30074j81198
$$ 647582769 649073601 649869859 650269032 650437891 650401235 650097370 649630189 649224877 648994803 648813605
3130.8F48813605l38077m96805m97639l83675l39270n32091r07778j227081j205742
$$ 648813605 648475528 647978723 647481084 647097409 646758139 646226048 645318270 644091189 642885447
3149.2F42885447o98209M8339N06640M73439J35839l06546o81878r21368j042307r62376
$$ 642885447 642187238 642235577 642742217 643215656 643351495 643044949 642363071 641441703 640399396 639437020
3169.6F39437020o70135l24190j00136r4711k27333m17828o45161q41975j010835j091361
$$ 639437020 638766885 638442695 638342559 638247848 638020515 637602687 636957526 636115551 635104716 634013355
3189.9F34013355q93116m10915L8326J81198N6982j13189j86086k27213l34084n31435
$$ 634013355 633120239 632709324 632747650 632928848 632985830 632872641 632686555 632459342 632125258 631593823
3210.3F31593823p71164r27151r78887j042843j144349j269520j450955j568675j473845
$$ 631593823 630822659 629895508 628916621 627873778 626729429 625459909 624008954 622440279 620966434
3228.7F20966434j179575q20339n66364m00781k09689j32501l62039q20041j278877
$$ 620966434 619786859 618966520 618400156 617999375 617789686 617657185 617295146 616475105 615196228
3247.1F15196228j411557j004696l95656j71303m03703n69164l11792J13845L08096
$$ 615196228 613784671 612779975 612384319 612213016 611809313 611240149 610928357 611042202 611350298
3265.4F11350298K40922R0241j42574m18246o06715p16925p45297o75022n79834n59628
$$ 611350298 611591220 611681461 611538887 611120641 610513926 609797001 609051704 608376682 607796848 607237220
3285.8F07237220o39379p43091q24809r06349j025855j199186j342952j412928j506567
$$ 607237220 606597841 605854750 605029941 604123592 603097737 601898551 600555599 599142671 597636104
3304.2E97636104j693190j946032k139627k080739j576304o58453J96219M83691J52528
$$ 597636104 595942914 593996882 591857255 589776516 588200212 587541759 587737978 588221669 588374197
3322.5E88374197m49717r00864j143873j387417j636863j795053j847268j843452j884461
$$ 588374197 587924480 587023616 585879743 584492326 582855463 581060410 579213142 577369690 575485229
3340.9E75485229k014458k140820k051651j795650j821398k124668k242505k149403
$$ 575485229 573470771 571329951 569278300 567482650 565661252 563536584 561294079 559144676
3357.2E59144676k085209k132297k135038j957417j911580k243042k559543k405882
$$ 559144676 557059467 554927170 552792132 550834715 548923135 546680093 544120550 541714668
3373.5E41714668k033651j884341j890600j912295j878143j693070j373171j082182
$$ 541714668 539681017 537796676 535906076 533993781 532115638 530422568 529049397 527967215
3389.8E27967215j192987j581908j550495j039744q29935j332879j745581j420320
$$ 527967215 526774228 525192320 523641825 522602081 521772146 520439267 518693686 517273366
3406.1E17273366r94324r63629j087963j231253j204968q97228o76096o54221n85734
$$ 517273366 516279042 515315413 514227450 512996197 511791229 510894001 510217905 509563684 508977950
3424.5E08977950l98457k30432k44200k29836j18911k53081m67420l22223M1306K45452
$$ 508977950 508579493 508349061 508104861 507875025 507756114 507503033 507035613 506713390 506754696 507000148
3444.9E07000148K28286K05159L30031M64559M90010N52952P05719P33137Q14438J130700
$$ 507000148 507228434 507433593 507763624 508228183 508718193 509271145 509976864 510710001 511524439 512655139
3465.3E12655139J178563P05421K74717L79265P49826J028836R72390O21677O52611
$$ 512655139 513833702 514539123 514813840 515193105 515942931 516971767 517944157 518565834 519218445
3483.6E19218445J028657J044154Q44121Q72493R85980J009226R51051Q97706Q64327
$$ 519218445 520247102 521291256 522135377 523007870 523993850 525003076 525954127 526851833 527716160
3502E27716160P35462P11321R37403J202106J313210J132607Q89003R13442J078248
$$ 527716160 528451622 529162943 530100346 531302452 532615662 533748269 534637272 535550714 536628962
3520.4E36628962J123488R20176P46846R25422J222193J332879J295567J163125J097858
$$ 536628962 537752450 538672626 539419472 540344894 541567087 542899966 544195533 545358658 546456516
3538.7E46456516J335025J524329J199305P48157Q45909J150132J268089J343429J341939
$$ 546456516 547791541 549315870 550515175 551263332 552109241 553259373 554527462 555870891 557212830
3557.1E57212830J289367J322747J278340R65000Q97407J420736J655817J533628J593351
$$ 557212830 558502197 559824944 561103284 562068284 562965691 564386427 566042244 567575872 569169223
3575.4E69169223J696825J690030J721383J750350J469492J127363J492381J801729
$$ 569169223 570866048 572556078 574277461 576027811 577497303 578624666 580117047 581918776
3591.7E81918776J624525J727521K046228J925885J654327J602173J353979J034916
$$ 581918776 583543301 585270822 587317050 589242935 590897262 592499435 593853414 594888330
3608.1E94888330J115143J204610J278698J411796J313328J527608J864254J697779
$$ 594888330 596003473 597208083 598486781 599898577 601211905 602739513 604603767 606301546
3624.4F06301546R97424K9862M32670J289010J051009O48260N20229N45860P01308
$$ 606301546 607298970 607328832 607761502 609050512 610101521 610749781 611270010 611815870 612517178
3642.7F12517178O25312m4465m62234P51138J851916J472533R84252J041829P48158
$$ 612517178 613142490 613098025 612635791 613386929 615238845 616711378 617695630 618737459 619485617
3661.1F19485617L90529N15640L43561m29213k30253J87397n66065k15590O88672P43628
$$ 619485617 619876146 620391786 620735347 620306134 620075881 620263278 619697213 619481623 620170295 620913923
3681.5F20913923P93874P41482M6730p68721m19498K89381M30286K60532j13488m18901
$$ 620913923 621707797 622449279 622496009 621727288 621307790 621597171 622027457 622287989 622174501 621755600
3701.9F21755600P689M90367K06054n93841q98183p9989M31478K73227N8473m5538
$$ 621755600 621763289 622253656 622459710 621865869 620967686 620887697 621319175 621592402 621650875 621605337
3722.3F21605337j64211q4639L84808N38051O1870n51939m06087M81427P18713l84927
$$ 621605337 621441126 621356487 621741295 622279346 622341216 621789277 621383190 621864617 622583330 622198403
3742.7F22198403j346648k21193P4685p62343l6598Q36253L92199k94149n4717L28898
$$ 622198403 620851755 620630562 620705247 619942904 619906306 620742559 621134758 620840609 620785892 621114790
3763.1F21114790P0453j99675m44055k99156L28243M99129Q9407m15504l94523k03430
$$ 621114790 621185243 620985568 620541513 620242357 620570600 621069729 621159136 620743632 620349109 620145679
3783.5F20145679j76251k2114l576r1553j33037j87397O0618j75953p83921j93715
$$ 620145679 619969428 619947314 619943738 619852185 619719148 619531751 619592369 619416416 618632495 618438780
3803.9F18438780k6285k87831K40207L96907k59459o85036j26362l18766n25951K34961
$$ 618438780 618412495 618124664 618364871 618761778 618502319 617817283 617690921 617372155 616846204 617081165
3824.3F17081165K32816N9426K0742j56998j88291o29425j023889l24786K44797K58445
$$ 617081165 617313981 617373407 617394149 617237151 617048860 616419435 615395546 615070760 615315557 615574002
3844.6F15574002L31939L49342l34501j889646j272559Q77380R69172K48372k83420
$$ 615574002 615905941 616255283 615920782 614031136 612758577 613635957 614605129 614853501 614570081
3863F14570081j87695L5703n09679o41882r1315K42472L64721k31564m99726o1869
$$ 614570081 614382386 614418089 613908410 613266528 613175213 613417685 613782406 613550842 613051116 612989247
3883.4F12989247j38998O3896P8440n03779k17676L41714k1995p06195r03607n92351
$$ 612989247 612850249 612914145 612992585 612488806 612271130 612612844 612590849 611884654 610981047 610388696
3903.8F10388696J21653O47188N26964K04504q2910m15385m47631q9526m113k66969
$$ 610388696 610510349 611157537 611684501 611889005 611806095 611390710 610943079 610853553 610849440 610582471
3924.2F10582471j84834J08421k9028k42948r8884m1485j39117k14041l69370l84509
$$ 610582471 610397637 610506058 610477030 610234082 610135198 610093713 609954596 609740555 609371185 608986676
3944.6F08986676l04103l16858j79708R179m4942j65403r1910O7591J72734K12849
$$ 608986676 608682573 608365715 608186007 608195186 608150244 607984841 607892931 607960522 608133256 608346105
3965F08346105J13129q4638j56463p2658P034k4140j64509k35081j69873j67310k64049
$$ 608346105 608459234 608374596 608218133 608145475 608152509 608128369 607963860 607728779 607558906 607391596 607127547
3987.4F07127547l49343l55899k41518r0837o080
$$ 607127547 606778204 606422305 606180787 606089950 606083870
3997.6F06083870
$$ 606083870
##END=$$ End of the data block
