##TITLE=B8M - Mariane 2 $$ Begin of the data block
##JCAMP-DX=5.00 $$ ACD/SpecManager v 10.08
##SPECTROMETER/DATA SYSTEM=Alpha
##DATE=22 Jun 2015 10:50:00
##DATA TYPE=INFRARED SPECTRUM
##DATA CLASS=XYDATA
##ORIGIN=
##OWNER=
##NPOINTS=1765
##FIRSTX=399.76428223
##LASTX=3997.64306641
##MAXX=3997.64306641
##MINX=399.76428223
##MAXY=0.89211667
##MINY=0.67511159
##XFACTOR=1.0000000000
##YFACTOR=1.000000000000000e-9
##FIRSTY=0.85585111
##DELTAX=2.03961372
##XUNITS=1/CM
##YUNITS=ARBITRARY UNITS
##XYDATA=(X++(Y..Y))
399.8H55851114R81688K054334q44002j237273J086593J50978j315593p3791q44419
$$ 855851114 856832802 858887136 858043134 856805861 857892454 858043432 856727839 856654048 855809629
418.1H55809629k809405l05832J353681o69539j376450l5345j056433k999842k285838
$$ 855809629 853000224 852694392 854048073 853378534 852002084 851966739 850910306 847910464 845624626
436.5H45624626k053440m687905p489920j1105716j6596317j6568065l940821J5259385
$$ 845624626 843571186 838883281 831393361 820287645 803691328 787123263 783182442 798441827
452.8G98441827K4494052J9904018J1086762L867149Q46803J286507R74834o74606
$$ 798441827 822935879 842839897 853926659 857793808 858640611 859927118 860901952 860227346
469.1H60227346o18815K50876p06434j635015j016796q73566j221656n85497o06239
$$ 860227346 859608531 859859407 859152973 857517958 856501162 855627596 854405940 853820443 853214204
487.5H53214204k009213k057075n13613j112700m401982q429885j4024317j8605769
$$ 853214204 851204991 849147916 848634303 847521603 843119621 834689736 820665419 802059650
503.8H02059650j2921035J738548J1660636J5834331J8400312J4123797N842626J283527
$$ 802059650 789138615 790877163 802537799 818372130 836772442 850896239 856738865 858022392
520.1H58022392L15249j07885p01546p86126o69062p46310o66678m82142o26147j066923
$$ 858022392 858337641 858229756 857528210 856742084 856073022 855326712 854660034 854177892 853551745 852484822
540.5H52484822j346469j200378r20295o64950p4744N82933N93484K85506L42012M39703
$$ 852484822 851138353 849937975 849017680 848352730 848277986 848860919 849454403 849739909 850081921 850521624
560.9H50521624J15991k17140m3392l8445o46353q60274l22580K09391L09229J71482
$$ 850521624 850637615 850420475 850377083 850338638 849692285 848832011 848509431 848718822 849028051 849199533
581.3H49199533k06589n41926K01464J281798Q62360j43588j69754l43620j630903
$$ 849199533 848992944 848451018 848652482 849934280 850796640 850653052 850483298 850139678 848508775
599.6H48508775k889395l738582l252923J106083O434977O583512K794743P33792J083196
$$ 848508775 845619380 841880798 838627875 839733958 846168935 852752447 855547190 856280982 857364178
618H57364178Q29160J21772P01368J064122L8385k13682Q12351Q39532Q4877M80890
$$ 857364178 858193338 858315110 859016478 860080600 860118985 859905303 860717654 861557186 861642063 862122953
638.4H62122953Q37982p5043k18331P38978L67403o27041R0659P00831m59134q03233
$$ 862122953 862960935 862885892 862667561 863406539 863773942 863146901 863237560 863938391 863479257 862676024
658.8H62676024K62976P7248p68245n56588n27382j330375o68288J021088Q46564r39488
$$ 862676024 862939000 863016248 862248003 861691415 861164033 859833658 859165370 860186458 861033022 860093534
679.2H60093534r91821l31760r06288r37224k84374j407802k888620k281129k488971
$$ 860093534 859101713 858769953 857863665 856926441 856642067 855234265 852345645 850064516 847575545
697.5H47575545n555808p983983r099602j0443628n310953R696305K0480931J6431808
$$ 847575545 842019737 834035754 824936152 814492524 809181571 818877876 839358807 855790615
713.9H55790615P031262K110600n86092k867758k335966r69648j890660k747774j784563
$$ 855790615 862821877 864932477 864346385 861478627 859142661 858173013 856282353 853534579 851750016
732.2H51750016j995504l622472l360510k095759k571106k748847p18534O82533O36697
$$ 851750016 849754512 846132040 842771530 840675771 838104665 835355818 834637284 835319817 835956514
750.6H35956514K179861M641890M835070M254162N112052M904568K741814K061069
$$ 835956514 838136375 842778265 847613335 851867497 856979549 861884117 864625931 866687000
766.9H66687000K718687J586437K66135J262009J856506L31402l0637J197576O83844
$$ 866687000 869405687 870992124 871258259 872520268 874376774 874708176 874677539 875875115 876558959
785.3H76558959o34133M0710N35667j056672j741290p69078j110375j964510r00447
$$ 876558959 875924826 875965536 876501203 875444531 873703241 872934163 871823788 869859278 868958831
803.6H68958831m28438k579272m460633n093574p181228j0273933j1392534j0049045
$$ 868958831 868530393 865951121 861490488 856396914 849215686 838941753 827549219 817500174
819.9H17500174o555855l156603m769086q701861m442156O650806R492159J855850
$$ 817500174 810944319 807787716 803018630 794316769 789874613 796525419 806017578 807873428
836.2H07873428J275182J2694597J7616451J2114644J0277211J1426151Q245409M037320
$$ 807873428 809148610 821843207 839459658 851574302 861851513 873277664 881523073 885560393
852.6H85560393K605796J537264l79384o10411M17769j37150j002610N0664O04927
$$ 885560393 888166189 889703453 889324069 888713658 889131427 888994277 887991667 888042331 888647258
870.9H88647258r12845j633763p96795p53820q39710Q23796K015411Q85845P3909O79791
$$ 888647258 887734413 886100650 885303855 884550035 883710325 884534121 886549532 887435377 887509286 888189077
891.3H88189077K81155q20636l72291L26276m97460q85308J51157K54989p13468m83274
$$ 888189077 888470232 887649596 887277305 887603581 887106121 886220813 886371970 886626959 885913491 885430217
911.7H85430217K30074m31836j037121m09484m31895j237571o34909N35309J967r43660
$$ 885430217 885660291 885228455 884191334 883781850 883349955 882112384 881477475 882012784 882014751 881071091
932.1H81071091o13511o48916j815974j797378m85361m53889r39608k64108l25203
$$ 881071091 880457580 879808664 877992690 876195312 875709951 875256062 874316454 874052346 873727143
950.5H73727143j957476l048957l032565l488123m436076m611909m362285l273011
$$ 873727143 871769667 868720710 865688145 862200022 857763946 853152037 848789752 845516741
966.8H45516741J226247P411182R131372N667626K044261K14159j204609j861811j315713
$$ 845516741 846742988 854154170 863285542 868953168 870997429 871211588 870006979 868145168 866829455
985.1H66829455j215637j989603k084195j786650k597630l772497m098058m721641
$$ 866829455 865613818 863624215 861540020 859753370 857155740 853383243 849285185 844563544
1001.4H44563544p250667j1144280j2389124n763590M072726P129848N401671N209446
$$ 844563544 837312877 826168597 813779473 808015883 812088609 819218457 824620128 829829574
1017.8H29829574O311297O790876N600572L264308J805782R81391q63493k639115k851247
$$ 829829574 836140871 842931747 848532319 851796627 853602409 854583800 853720307 851081192 848229945
1036.1H48229945k008796k65002K384841M093170L488243K045274J266956N68867l43144
$$ 848229945 846221149 845956147 848340988 852434158 855922401 857967675 859234631 859803498 859460354
1054.5H59460354n58853k03967j49072j81794q642m15326j371324j442253q71480j441896
$$ 859460354 858901501 858697534 858548462 858366668 858358026 857942700 856571376 855129123 854257643 852815747
1074.9H52815747k823710l756941m902660p491887j2471735j9542933j9810498k315998
$$ 852815747 849992037 846235096 841332436 833840549 821368814 801825881 782015383 779699385
1091.2G79699385K1434367K8470456J8162668N825758j41442q0347K601862M080117
$$ 779699385 801133752 829604208 847766876 853592634 853451192 853370845 855972707 860052824
1107.5H60052824K675176k55168k370298k623021j208604J181722K792358K182782
$$ 860052824 862728000 862472832 860102534 857479513 856270909 857452631 860244989 862427771
1123.8H62427771K64466q92818m93884J02639k52962l34203N49674Q14438k6584o33836
$$ 862427771 862692237 861799419 861305535 861408174 861155212 860821009 861370683 862185121 862158537 861524701
1144.2H61524701p71582r41455q56579n41448o44565j108825j350999j608133k537608
$$ 861524701 860753119 859811664 858955085 858413637 857769072 856660247 855309248 853701115 851163507
1162.6H51163507m361392p578194j0059416l685176R884178J4255345O708145R03309
$$ 851163507 846802115 839223921 829164505 825479329 835363507 849618852 856326997 857230306
1178.9H57230306J951813L368974J485646m30226p10607p42137r47476r04798p98822
$$ 857230306 859182119 862551093 864036739 863606513 862895906 862153769 861206293 860301495 859502673
1197.3H59502673r91523j138270j052022j112342j417041j528740j437246j394868
$$ 859502673 858511150 857372880 856320858 855208516 853791475 852262735 850825489 849430621
1213.6H49430621j319647j201034j415729k041042k498508k471029k294958k218008
$$ 849430621 848110974 846909940 845494211 843453169 840954661 838483632 836188674 833970666
1229.9H33970666j996458j543462q85308m9710M18901j02758j340508k676905m190623
$$ 833970666 831974208 830430746 829545438 829495728 829914629 829811871 828471363 825794458 821603835
1248.2H21603835o153942q260369r901345j0175764o642163L101349J5889525K2528529
$$ 821603835 815449893 807189524 797288179 787112415 780470252 783571601 799461126 821989655
1264.6H21989655J8066884Q321940J058221k354562l655016m118443m622698n346179
$$ 821989655 840056539 848378479 849436700 847082138 843427122 839308679 834685981 829339802
1280.9H29339802n858421o383538p779062q866131n268097L254711O615281n52356
$$ 829339802 823481381 817097843 809318781 800452650 795184553 798439264 805054545 804502189
1297.2H04502189q997857j2294829j3365627j4441967j4685750j2820899q279383r55344
$$ 804502189 795504332 783209503 769843876 755401909 740716159 727895260 719615877 718660533
1313.5G18660533P952810J5972197K0902097K1297574J7608345J2388348Q397281O306529
$$ 718660533 726613343 742585540 763487637 784785211 802393556 814781904 823179185 829485714
1329.8H29485714N271435M729271L893376J791834q77261k683043l753841m436016
$$ 829485714 834757149 839486420 843379796 845171630 844294369 841611326 837857485 833421469
1346.2H33421469m006684k412856j120209j396120l079295n617857q970618j2847841
$$ 833421469 829414785 827001929 825881720 824485600 821406305 815788448 806817830 793969989
1362.5G93969989j6142667j8022954j5888631n928994P592023J5809119J4572441Q218467
$$ 793969989 777827322 759804368 743915737 737986743 745578766 761387885 775960326 784178793
1378.8G84178793J594425l073514m834592n315185n390465m441679k649962J051127
$$ 784178793 785773218 782699704 777865112 772549927 767159462 762717783 760067821 761118948
1395.1G61118948Q080483J6544223K0288825J7048061J1707663O993711L370643N42581
$$ 761118948 769199431 785743654 806032479 823080540 834788203 841781914 845152557 845695138
1411.4H45695138j276791k131760k909243l327608k559364k305210k807796l009200
$$ 845695138 844418347 842286587 839377344 836049736 833490372 831185162 828377366 825368166
1427.7H25368166k783060k507985k985179m025877l874480k820671k721190k598525
$$ 825368166 822585106 820077121 817091942 813066065 809191585 806370914 803649724 801051199
1444.1H01051199j912117p33137O26326R86993r1493j857519k104104j628041l223359
$$ 801051199 799139082 798405945 799032271 800019264 799927771 798070252 795966148 794338107 791114748
1462.4G91114748n636454o192863n570650o234110o550073l620267j967073m893183
$$ 791114748 785478294 779285431 773714781 767480671 760930598 757310331 755343258 750450075
1478.7G50450075r491861j2768567j3999700j4184177j2045920l505409R368658K0159900
$$ 750450075 740958214 728189647 714189947 700005770 687959850 684454441 693823099 713982999
1495G13982999K5465012K2498727J7016113J1999249O750584K036094p76648l208637
$$ 713982999 739448011 761946738 778962851 790962100 797712684 799748778 798972130 795763493
1511.4G95763493n933464p608712p729590p588207q719683q259654p425547p795632
$$ 795763493 789830029 782221317 774491727 766903520 758183837 749924183 742498636 734703004
1527.7G34703004p095456o221175n306780l125847j534700r3103L309548O467402R169996
$$ 734703004 727607548 721386373 716079593 712953746 711419046 711325943 714635491 721102893 730272889
1546G30272889J2071431J5587508J8085421J8391788J5951633J4796436J4877617R367645
$$ 730272889 742344320 757931828 776017249 794409037 810360670 825157106 840034723 849402368
1562.4H49402368N191624L263355J606226J28388j286388l644466o990373q903682
$$ 849402368 854593992 857857347 859463573 859591961 858305573 854661107 847670734 838767052
1578.7H38767052j0559917j3019204j4685273j5755653j6042948j4580488j0921956
$$ 838767052 828207135 815187931 800502658 784747005 768704057 754123569 743201613
1593G43201613n420386N29885L589332J103342m798711q311271o003082J054764Q822202
$$ 743201613 737781227 738311112 741900444 743003786 738205075 729893804 723890722 724945486 733767688
1611.3G33767688J2704611J3372719J2577296Q766830M741311K182662J30415k218902
$$ 733767688 746472299 759845018 772422314 781189144 785930455 788113117 788243532 786024630
1627.6G86024630m476309n672097o838798q126557o051243k999365j454473m78267
$$ 786024630 781548321 775876224 769037426 760910869 754859626 751860261 750405788 749927521
1643.9G49927521M81188J842439J616419p36118k661824k331555l142893l796101k158642
$$ 749927521 750408709 752251148 753867567 753131449 750469625 748138070 744995177 741199076 739040434
1662.3G39040434J069010K852261L007531L115117K913774L053188M378736N738497
$$ 739040434 740109444 742961705 745969236 749084353 751998127 755051315 759430051 765168548
1678.6G65168548O305635P083356Q999109Q863569Q123338R017050Q517444P404745
$$ 765168548 771474183 778557539 787556648 796420217 804543555 813560605 822078049 829482794
1694.9H29482794O569803N742132O296277N639255M353047M169166L658950K713502
$$ 829482794 836052597 841794729 848091006 853730261 858083308 862252474 865911424 868624926
1711.3H68624926J928329J445413J589536K295494K343834J749277J248062R41813
$$ 868624926 870553255 871998668 873588204 875883698 878227532 879976809 881224871 882166684
1727.6H82166684P57873K71320L9756J014412J251936N91814N01693O97195L56853
$$ 882166684 882924557 883195877 883235633 884250045 885501981 886093795 886595488 887292683 887649536
1745.9H87649536j55628m6789O22749N72622N7697J0193o9857j76132K77341L57449
$$ 887649536 887493908 887447119 888069868 888642490 888700187 888710380 888640523 888464391 888741732 889099181
1766.3H89099181j70768n28574j67667N63800N51700L06309M09722L74436J67668K76804
$$ 889099181 888928413 888399839 888232172 888795972 889347672 889653981 890063703 890438139 890605807 890882611
1786.7H90882611J24157n04613l05653N07832L60608j48296J06990N33104K75254n9426
$$ 890882611 891006768 890502155 890196502 890704334 891064942 890916646 891023636 891556740 891831994 891772568
1807.1H91772568K980N4002j1742J05739J93119l2365k42889j65880p9870k25664j72793
$$ 891772568 891775548 891829550 891817808 891923547 892116666 892084301 891841412 891675532 891595662 891369998 891197205
1829.6H91197205K92658K02001k61188j62959p8261n85675p27952O9499L96013J69158
$$ 891197205 891489863 891691864 891430676 891267717 891189456 890603781 889875829 889945328 890341341 890510499
1850H90510499K83123L45885L9399o1989J16646m7683m19319m92930l32296j31309
$$ 890510499 890793622 891139507 891178906 891116917 891233563 891185880 890766561 890273631 889941335 889810026
1870.3H89810026M5240O0737k41995n87642m78328k67386n12004q30412q87811r68695
$$ 889810026 889855266 889916003 889674008 889086366 888608038 888340652 887828648 886998236 886110425 885141730
1890.7H85141730j290679j579165j776457j986265j242876Q64923K500117K404570
$$ 885141730 883851051 882271886 880495429 878509164 877266288 878131211 880631328 883035898
1907.1H83035898J695395J234770O31928n066p4745J44482k2769q6188K33233J74641
$$ 883035898 884731293 885966063 886597991 886592925 886518180 886662662 886639893 886553705 886786938 886961579
1927.5H86961579j27792o6042J907k52306l50595k16066l22998m28259j83165n2810
$$ 886961579 886833787 886767745 886769652 886517346 886166751 885950685 885627687 885199428 885016263 884963453
1947.9H84963453k78890l67284j09434j3173j67012r8229L7790k04563m13895j66774
$$ 884963453 884684563 884317279 884207845 884194672 884027660 883929431 883967221 883762658 883348763 883181989
1968.3H83181989k2650k40266k59936r1076j77621k64884m8041O3360j19865j50442
$$ 883181989 883159339 882919073 882659137 882568061 882390440 882125556 882077515 882140875 882021010 881870568
1988.7H81870568J1742j6093j15157l278P1824j06096j78636k2947o5327k56836j81795
$$ 881870568 881882310 881866217 881751060 881747782 881819606 881713510 881534874 881511927 881446600 881189764 881007969
2011.1H81007969l9875j94609l43323k98739m32848p60496n95272K16008N79237K53797
$$ 881007969 880968094 880773485 880430162 880131423 879698575 878938079 878342807 878558815 879138052 879391849
2031.5H79391849P1824q405k02655j82331m351o6996k11775j17242m7267j88827k19047
$$ 879391849 879463673 879455268 879252613 879070282 879065931 878998935 878787160 878669918 878622651 878433824 878214777
2053.9H78214777q4341j04070j95741j12296o4551k04981k42471j01805o6161j28985
$$ 878214777 878130436 878026366 877830625 877718329 877653778 877448797 877206326 877104521 877038360 876909375
2074.3H76909375j4186J50919Q2612J6451J31369J27852k1756j0967P3194n0604j93536
$$ 876909375 876895189 877046108 877128720 877145171 877276540 877404392 877382636 877371669 877444863 877394259 877200723
2096.8H77200723r0719Q166o8962p3433K3067k0683j26064n6624J4364j05917j89662
$$ 877200723 877110004 877118170 877049208 876975775 876998842 876978159 876852095 876795471 876809835 876703918 876514256
2119.2H76514256j22726j37269k10047j15276J252k9325j6034J09613J08242k4855
$$ 876514256 876391530 876254261 876044214 875928938 875930190 875900865 875884831 875994444 876102686 876077831
2139.6H76077831n4538j6332p5221j31905j16766j89066k97546k16425J193J15335
$$ 876077831 876023293 876006961 875931740 875799835 875683069 875494003 875196457 874980032 874981225 875096560
2160H75096560J20341J52707J14918m9114o1691J06990R9600n9724m4346O9440M768
$$ 875096560 875216901 875369608 875484526 875435412 875373721 875480711 875580311 875520587 875476241 875545681 875550449
2182.4H75550449j42396j40488r5904j34348j19865m2797l5226k7418O5327O7174o8486
$$ 875550449 875408053 875267565 875171661 875037313 874917448 874874651 874839425 874812007 874877334 874944508 874876022
2204.8H74876022j00314l0279p9692j74045j27972p1525j18315j16349j4066K6941
$$ 874876022 874775708 874745429 874665737 874491692 874363720 874292195 874173880 874057531 874043465 874070406
2225.2H74070406l8147m1783J7464j7404q5652r2328j21176j73926j25528k2113n2452
$$ 874070406 874032259 873990476 874007940 873990536 873904884 873812556 873691380 873517454 873391926 873369813 873317361
2247.7H73317361j42217r0480q106m8458j04368j00672j45853k23219j88768j42455
$$ 873317361 873175144 873084664 873076558 873028100 872923732 872823060 872677207 872453988 872265220 872122765
2268.1H72122765k26736k79963j94967j26899j01864J2100J21534O8545k0802j1563
$$ 872122765 871896029 871616066 871421099 871294200 871192336 871204436 871325970 871394515 871373713 871362150
2288.5H71362150o676l9756K5332J25169M4764p2241L636N2630p0571j32680j03295
$$ 871362150 871355474 871315718 871341050 871466219 871510983 871438742 871442378 871495008 871424437 871291757 871188462
2310.9H71188462j65344k32398j69516j65999l23474l94583l12686l19361m04179l05832
$$ 871188462 871023118 870790720 870621204 870455205 870131731 869737148 869424462 869105101 868700922 868395090
2331.3H68395090o3479M9710P5460J53243R1136j24097k3663L14474L22759M8220j48892
$$ 868395090 868331611 868381321 868456781 868610024 868701160 868577063 868553400 868867874 869190633 869238853 869089961
2353.7H69089961k18809l62575l49998j42813n9366k4855N9664j0014j47223r9599
$$ 869089961 868871152 868508577 868158579 868015766 867956400 867931545 867991209 867981195 867833972 867734373
2374.1H67734373k3067j04785j45018k7299N1260Q881K0563J01447O6340m1365n9545
$$ 867734373 867711306 867606521 867461503 867434204 867485464 867494345 867514908 867616355 867682695 867641330 867581785
2396.6H67581785p5817j84954k15292j01685l3379q642P9870R2923m2915j12414m4644
$$ 867581785 867505968 867321014 867105722 867004037 866970658 866962016 867041886 867134809 867091894 866979480 866934836
2419H66934836m9114j44780Tr2089j38163j97649j43469r0360r2090j4543O4015j0252
$$ 866934836 866885722 866740942 866596162 866504073 866365910 866168261 866024792 865934432 865842342 865827799 865891814 865881562
2443.5H65881562j06573j00970r2507j18076p9692l8504j25170j90437j04904j7882
$$ 865881562 865774989 865674019 865581512 865463436 865383744 865345240 865220070 865029633 864924729 864906847
2463.9H64906847j8775p033J9312n9069j57773j41740j29282j96875k04444j54793
$$ 864906847 864888072 864881039 864900351 864841282 864683509 864541769 864412487 864215612 864011168 863856375
2484.3H63856375j73509k07305j76728j51157j79172j68860r3460o8426q8095l3021
$$ 863856375 863682866 863475561 863298833 863147676 862968504 862799644 862706184 862637758 862549663 862516642
2504.7H62516642K6464r298l0875j6809r9063k29657k09331o3002O437K2173Q0884
$$ 862516642 862543106 862533808 862502933 862486124 862387061 862157404 861948073 861885071 861891508 861913681 861994565
2527.1H61994565L8981j22726k03431k31802k94507l00765k43365k28703k45452j68980
$$ 861994565 862033546 861910820 861707389 861475587 861181080 860880315 860636950 860408247 860162795 859993815
2547.5H59993815l0160N6088J26124J93000J56998K5511o8247r0242j03235o7353L9697
$$ 859993815 859963655 860019743 860145867 860338867 860495865 860521376 860453129 860362887 860259652 860192299 860231996
2569.9H60231996J14500R8348O2465O9917M3630q523K6703M9174n5671j45257j31607
$$ 860231996 860346496 860444844 860507309 860577226 860620856 860612333 860639036 860688210 860632539 860487282 860355675
2592.4H60355675j41442j73390j24216r1552j61589k11894j65165j10805q7976n6922
$$ 860355675 860214233 860040843 859916627 859825075 859663486 859451592 859286427 859175622 859087646 859030724
2612.8H59030724m6075r3281j38760j35958j38283j36375q2970n8532j11103j57952
$$ 859030724 858984649 858891368 858752608 858616650 858478367 858341992 858259022 858200490 858089387 857931435
2633.2H57931435j56760j70529k01762j47879m1783j1801n3227p7129p5102q6188p6115
$$ 857931435 857774675 857604146 857402384 857254505 857212722 857200921 857147694 857070565 856995463 856909275 856833160
2655.6H56833160m6372m8399n3347m1544o0022r9599j05202q9705j14680j65343j81794
$$ 856833160 856786788 856738389 856685042 856643498 856583476 856483877 856378675 856288970 856174290 856008947 855827153
2678H55827153j78218j78874j58608j14143q2254q0645r8467j23918j35601j18494
$$ 855827153 855648935 855470061 855311453 855197310 855115056 855034411 854935944 854812026 854676425 854557931
2698.4H54557931j13487j55687j98186k05576j83702j54912j24455p0571m5002n8293
$$ 854557931 854444444 854288757 854090571 853884995 853701293 853546381 853421926 853351355 853306353 853248060
2718.8H53248060n4956n1737l9041L219N1498N9128n305n3525p3432j54615k18868
$$ 853248060 853193104 853141367 853102326 853105545 853157043 853216171 853210866 853157341 853083909 852929294 852710426
2741.2H52710426k13206k07961k23815k84970l71873l92974l52203l25621l34739l65854
$$ 852710426 852497220 852289259 852065444 851780474 851408601 851015627 850663424 850337803 850003064 849637210
2761.6H49637210l92913l83437l62098l45290k83361k15172k46883l12566l18766k88725
$$ 849637210 849244297 848860860 848498762 848153472 847870111 847654939 847408056 847095490 846776724 846487999
2782H46487999k30432j57475j52230k55645l63111l56436k30372p2956O8367K75731
$$ 846487999 846257567 846100092 845947862 845692217 845329106 844972670 844742298 844669342 844737709 845013440
2802.4H45013440N11408O24358N41806K56181l4630j65224k75195l93450m23968m68492
$$ 845013440 845524848 846149206 846691012 846947193 846912563 846747339 846472144 846078694 845654726 845186234
2822.8H45186234n59330n50151m63844m17292l70562k54929j60754l34024o83665q13246
$$ 845186234 844626904 844076753 843612909 843195617 842825055 842570126 842409372 842075348 841391683 840578437
2843.2H40578437p77781p96139p74861o02364l48926j10149J23322K18630J45077J90318
$$ 840578437 839800656 839004517 838229656 837627292 837278366 837168217 837291539 837510169 837655246 837845564
2863.6H37845564L83377N10693O36756P64430N37395L0220k11895k00152k71976l71635
$$ 837845564 838228941 838739634 839376390 840140820 840678215 840708435 840496540 840296388 840024412 839652777
2884H39652777l64304l61085m39167m54604m02689n00083o23346m59552j93297j70529
$$ 839652777 839288473 838927388 838488221 838033617 837630928 837130845 836507499 836047947 835854650 835684121
2904.4H35684121k73109k90572l04401m10080n76675p41542q33869p87139n98788m27723
$$ 835684121 835411012 835120440 834816039 834405959 833829284 833087742 832253873 831466734 830867946 830440223
2924.8H30440223k74062m411K61963M69684P17879R10341Q87990P59483P06792N72264
$$ 830440223 830166161 830161750 830423713 830893397 831611276 832521617 833409607 834169090 834875882 835448146
2945.2H35448146K18809n8651q2255j69992l94583m19438k98381l14772m01437l91841
$$ 835448146 835666955 835608304 835526049 835356057 834961474 834542036 834243655 833928883 833527446 833135605
2965.6H33135605l78251m50731m22775k53976k09033k16305m1604O1094r3639k32279
$$ 833135605 832757354 832306623 831883848 831629872 831420839 831204534 831162930 831224024 831130385 830898106
2986H30898106k03490j61529j98185j99974j24514j17659q6129J31965K49207J62661
$$ 830898106 830694616 830533087 830334902 830134928 830010414 829892755 829806626 829938591 830187798 830350459
3006.4H30350459J77502K09987m6551m10855n41627n69105o73533o56128n66959o66499
$$ 830350459 830527961 830737948 830691397 830280542 829738915 829169810 828496277 827840149 827273190 826606691
3026.8H26606691p31170n59032m68254o77824q39651o97792o23762q01683r56893j042366
$$ 826606691 825875521 825316489 824848235 824170411 823330760 822632968 822009206 821207523 820250630 819208264
3047.2H19208264j132667j164317j175046j240432j231253r48727n77152m05371k19524
$$ 819208264 818075597 816911280 815736234 814495802 813264549 812315822 811738670 811333299 811113775
3065.5H11113775L6657L6299q0526P4148M16279N78523N27262N17667M60386J58310
$$ 811113775 811150432 811186731 811106205 811180353 811596632 812175155 812702417 813220084 813680470 813838780
3085.9H13838780j26541l26454p04050r80497q19623o37472q78751j359642j787543
$$ 813838780 813712239 813385785 812681735 811701238 810881615 810244143 809365392 808005750 806218207
3104.3H06218207k159238k414942k204120j286685k50876j29462r95636k064228k532601
$$ 806218207 804058969 801644027 799439907 798153222 797902346 797772884 796777248 794713020 792180419
3122.6G92180419j903892n36680Q13008J841962K510011K731562K548158K078771J384378
$$ 792180419 790276527 789739847 790552855 792394817 794904828 797636390 800184548 802263319 803647697
3141H03647697Q07464O57261P33852P42376N31077O855n91874r51827j136899j248121
$$ 803647697 804455161 805112422 805846274 806588650 807119727 807126582 806534708 805582881 804445982 803197861
3161.4H03197861j401484j659870j841307j957536k193868k455354k594769k724230
$$ 803197861 801796377 800136507 798295200 796337664 794143796 791688442 789093673 786369443
3177.7G86369443k868593k870559k704800k497434k233267j723707r76980j60813P15673
$$ 786369443 783500850 780630291 777925491 775428057 773194790 771471083 770494103 770333290 771048963
3196.1G71048963J487494J791358J680493J476049J235962R01103N84305L50177P2300
$$ 771048963 772536457 774327815 776008308 777484357 778720319 779621422 780205727 780555904 780628204
3214.4G80628204k78055o00994q85665j184225j451016j567125j601815j681030j840830
$$ 780628204 780350149 779749155 778863490 777679265 776228249 774661124 773059309 771378279 769537449
3232.8G69537449k193511k616286k845287k906561k925098k948403k987206l014625
$$ 769537449 767343938 764727652 761882365 758975804 756050706 753102303 750115097 747100472
3249.1G47100472k924740k673626k361178k074301j717389j140952l67642L83199Q92937
$$ 747100472 744175732 741502106 739140928 737066627 735349238 734208286 733840644 734223843 735116780
3267.5G35116780J077711P78616J49131l17753m83989n34237o50227q47280j084089
$$ 735116780 736194491 736973107 737122238 736804485 736320496 735786259 735136032 734288752 733204663
3285.8G33204663j365364j646817k039968k679050l378511l787339l563225k649426
$$ 733204663 731839299 730192482 728152514 725473464 722094953 718307614 714744389 712094963
3302.1G12094963j426697l97921K62797P31945J194954J675189K000570K091169K098322
$$ 712094963 710668266 710270345 710533142 711265087 712460041 714135230 716135800 718226969 720325291
3320.5G20325291K137959K028167J608670J226604J096547R73344Q53002Q62181P61032
$$ 720325291 722463250 724491417 726100087 727326691 728423238 729396582 730249584 731111765 731872797
3338.8G31872797M76360L02434K28167J22428Q702k88725p56621j054943j130819j225174
$$ 731872797 732349157 732651591 732879758 733002186 733010888 732722163 731965542 730910599 729779780 728554606
3359.2G28554606j515626j779616j711667j612484j908780k382278k528191k348899
$$ 728554606 727038980 725259364 723547697 721935213 720026433 717644155 715115964 712767065
3375.5G12767065k225161k219081k202451k151728k019465j736462j439989j559436
$$ 712767065 710541904 708322823 706120372 703968644 701949179 700212717 698772728 697213292
3391.9F97213292j982808j978338j473725j178503j547694j984835j773476j315773
$$ 697213292 695230484 693252146 691778421 690599918 689052224 687067389 685293913 683978140
3408.2F83978140j145661j187264j285732j237869r78768q10206p51436n66423l08990
$$ 683978140 682832479 681645215 680359483 679121614 678142846 677332640 676581204 676014781 675705791
3426.5F75705791j39773j24574l1412J75596N4001k78115k49922Q8274L70205N00858
$$ 675705791 675566018 675441444 675410032 675585628 675639629 675361514 675111592 675199866 675570071 676070929
3446.9F76070929N28216N64516O67870P74681Q68559R69827R53376R32098J174390
$$ 676070929 676599145 677163661 677831531 678606212 679474771 680444598 681397974 682330072 683504462
3465.3F83504462J393378J097202N63085N28396R33885J238465J155973Q67665R02116
$$ 683504462 684897840 685995042 686558127 687086523 688020408 689258873 690414846 691282511 692184627
3483.6F92184627J135171J117587J042068J127243J214146J255095J247287J224876
$$ 692184627 693319798 694437385 695479453 696606696 697820842 699075937 700323224 701548100
3500G01548100J230716J148284J075387J139760J328945J614988J642048J394987J348317
$$ 701548100 702778816 703927100 705002487 706142247 707471192 709086180 710728228 712123215 713471532
3518.3G13471532J505256J615047J532853J392543J478910J662970J763284J844704
$$ 713471532 714976788 716591835 718124688 719517231 720996141 722659111 724422395 726267099
3534.6G26267099J783431J632869J740098J878679J704693J505077J575887J659810
$$ 726267099 728050530 729683399 731423497 733302176 735006869 736511946 738087833 739747643
3551G39747643J653970J758277J865685J857460J782238J533449J262128J620353K374529
$$ 739747643 741401613 743159890 745025575 746883035 748665273 750198722 751460850 753081203 755455732
3569.3G55455732K477169K133370K016246K118826K238929K316237K204716J865208
$$ 755455732 757932901 760066271 762082517 764201343 766440272 768756509 770961225 772826433
3585.6G72826433J788795K273441K456784K201199K189637K388536K403796K297998
$$ 772826433 774615228 776888669 779345453 781546652 783736289 786124825 788528621 790826619
3601.9G90826619K096653J727342J584709J784921J944124K065003J890242J577556
$$ 790826619 792923272 794650614 796235323 798020244 799964368 802029371 803919613 805497169
3618.3H05497169J912058K205610J648545O85215M47512J556397K029657J583576J278937
$$ 805497169 807409227 809614837 811263382 811948597 812396109 813952506 815982163 817565739 818844676
3636.6H18844676J059771Q49425P34330L80814k00928J2994J208782J460672P84457
$$ 818844676 819904447 820753872 821488202 821869016 821668088 821681082 822889864 824350536 825134993
3655H25134993P02440J029194P03990K14756L1173l57509o92725j67370k1100l46839
$$ 825134993 825837433 826866627 827570617 827785373 827816546 827459037 826766312 826598942 826577842 826231003
3675.4H26231003M28498J064062Q81076N81443K12133j33693k7538O43373J055538
$$ 826231003 826659501 827723563 828604639 829186082 829398215 829264522 829236984 829880357 830935895
3693.7H30935895P98285K65182q8513k98L49164K47836l22104o56068j34230O89984
$$ 830935895 831734180 831999362 831910849 831910551 832259715 832507551 832185447 831529379 831395149 832085133
3714.1H32085133P02738J95563j93953l03388j97172O9618J98066j86562o87778n46158
$$ 832085133 832787871 832983434 832789481 832486093 832288921 832358539 832556605 832370043 831682265 831136107
3734.5H31136107K94686Q13603K13266r27687r62675J57833L7373l11673N92649R70781
$$ 831136107 831430793 832244396 832457662 831529975 830567300 830725133 830762506 830450833 831043482 832014263
3754.9H32014263L25739q7738J72019K24113j01864k31027j75834J00911L54528J84298
$$ 832014263 832340002 832252264 832424283 832648396 832546532 832315505 832139671 832240582 832595110 832779408
3775.3H32779408j52588k40326l2902L1650j3411R1255J50859K5153l02613n02288
$$ 832779408 832626820 832386494 832353592 832385242 832371831 832463086 832613945 832639098 832336485 831834197
3795.7H31834197l58999n15222n06699J49369J94907J29223M39405K17438n01990p80344
$$ 831834197 831475198 830959976 830453277 830602646 830797553 830926776 831366181 831583619 831081629 830301285
3816.1H30301285m20630l45409M7386N73277L43859J9312j88231k19167j46329m45783
$$ 830301285 829880655 829535246 829582632 830155909 830499768 830519080 830330849 830111682 829965353 829519570
3836.5H29519570n22077Q0883M60863M71712L31699j16229r96232j601398j76489J200855
$$ 829519570 828997493 829078376 829539239 830010951 830342650 830226421 829230189 827628791 827452302 828653157
3856.9H28653157P34269q7976m62353k48432j06633l24965q3565K85923K94030J26123
$$ 828653157 829387426 829299450 828837097 828588665 828482032 828157067 828073502 828359425 828653455 828779578
3877.3H28779578k54512k59518o3598q3328Q5414l278j49966J83284J72079l80397
$$ 828779578 828525066 828265548 828201950 828118622 828204036 828200758 828050792 828234076 828406155 828025758
3897.7H28025758o72877n07474r7095N09262P05480L53515M9055j07884k91348k34902
$$ 828025758 827352881 826845407 826748312 827257574 827963054 828316569 828365624 828257740 827966392 827731490
3918.1H27731490Q2195J44601m4406o0677j8418j29640j10209R7930J29760l8565j87754
$$ 827731490 827813685 827958286 827913880 827853203 827834785 827705145 827594936 827692866 827822626 827784061 827596307
3940.5H27596307j96576q5712o3896p8380K2948O6697L5882N2274J311j32740j20639
$$ 827596307 827399731 827314019 827250123 827171743 827194691 827261388 827297270 827349544 827350855 827218115 827097476
3962.9H27097476L6418O9261n37N245n0485j34110o1333R954K1338L4451k8133j30653
$$ 827097476 827133894 827203155 827202618 827207863 827157378 827023268 826961935 826971889 826993227 827027678 826999545 826868892
3987.4H26868892j62542j05381j3948L9399J6749
$$ 826868892 826706350 826600969 826587021 826626420 826643169
3997.6H26643169
$$ 826643169
##END=$$ End of the data block
