##TITLE=B8M - Leandro 2 $$ Begin of the data block
##JCAMP-DX=5.00 $$ ACD/SpecManager v 10.08
##SPECTROMETER/DATA SYSTEM=Alpha
##DATE=23 Jun 2015 08:35:04
##DATA TYPE=INFRARED SPECTRUM
##DATA CLASS=XYDATA
##ORIGIN=
##OWNER=
##NPOINTS=1667
##FIRSTX=599.64648438
##LASTX=3997.64306641
##MAXX=3997.64306641
##MINX=599.64648438
##MAXY=1.11379457
##MINY=0.43081751
##XFACTOR=1.0000000000
##YFACTOR=0.000000010000000
##FIRSTY=1.06369376
##DELTAX=2.03961372
##XUNITS=1/CM
##YUNITS=ARBITRARY UNITS
##XYDATA=(X++(Y..Y))
599.6 106369376 106444025 106466913 106425738 106293488 105943131 105332613 104847419 104989016 105668545 106294382
620 106294382 106573009 106639338 106659925 106656408 106618547 106578290 106552374 106536961 106514561 106453526 106368506 106285822
644.5 106285822 106166577 105993533 105778646 105500901 105106223 104552257 103842366 102973008 101941299 100888598
664.9 100888598 99627995 97670227 95341736 92236918 87160045 78475815 65372878 51683104
681.2 51683104 43825886 43972817 50017309 59516823 70241785 80286795 88464504 94207102
697.5 94207102 97350281 98072034 97384244 97215748 98776734 101343799 103531504 104828417 105474758
715.9 105474758 105781853 105925667 105997300 106024635 106005907 105950642 105857694 105689418 105418384 105041862 104527032
738.3 104527032 103792810 102749252 101312900 99367487 96739447 93133521 88051140 80951405 71869421
756.7 71869421 62153602 54392135 50997239 52683991 58188629 64950550 70492911 74378353 78285134
775.1 78285134 83596891 89835942 95501620 99574697 102024519 103293383 103779113 103901327 104169750
793.4 104169750 104758871 105390191 105818141 106048822 106179309 106270838 106323946 106327236 106300437 106263876 106199062
815.8 106199062 106024170 105657697 105048788 104187202 103234303 102527916 102298284 102434027 102721012 103110361
836.2 103110361 103611338 104187834 104768813 105241299 105426621 105141008 104690337 104862809 105720627 106524801
856.6 106524801 106932342 107097268 107176590 107238233 107291257 107327223 107343996 107352495 107355845 107331860 107272756 107193696
881.1 107193696 107091427 106923842 106658220 106297100 105839658 105277371 104578304 103629637 102260542 100368440
901.5 100368440 98107153 96156490 95545870 96637660 98543674 100025666 100520957 100095749 99004030
919.9 99004030 97538513 96090764 95186150 95320773 96612340 98672485 100890589 102796197 104213548
938.2 104213548 105190361 105843842 106267190 106526291 106675053 106754363 106787765 106791735 106771779 106714129 106592095
960.7 106592095 106397903 106161499 105938184 105803251 105811691 105950320 106146908 106326568 106418383 106376386
981.1 106376386 106227362 106053495 105928349 105876589 105871451 105760264 105278325 104528189 103968179 103590238
1001.5 103590238 103510821 104212296 105225229 105760312 105773091 105436349 104642189 102708268 98715341
1019.8 98715341 93500310 90167457 91111916 95759290 101101911 104558659 106066120 106658781 106930399
1038.2 106930399 107075346 107143891 107152212 107124376 107069421 106970835 106820214 106573701 106153882 105461240 104325640
1060.6 104325640 102448499 99489850 95605201 92209774 90983027 91844618 93843800 96679276
1076.9 96679276 99697524 101850104 102932608 103352118 103379083 103037477 102363217 101650000 101339972
1095.3 101339972 101616287 102207732 102711916 103045583 103460646 104116488 104876971 105535054 106001651 106285858
1115.7 106285858 106442893 106533170 106589711 106628501 106658268 106677759 106676853 106646895 106575656 106460202 106317914
1138.1 106317914 106176174 106027949 105812848 105458176 104878950 103966904 102627635 100894725 98936141
1156.5 98936141 96788818 94500238 92994386 93609548 96111006 98746437 100323939 100986326 101430547
1174.8 101430547 102084363 102866769 103510165 103908908 104114246 104192019 104172802 104085243 103981292 103896141
1195.2 103896141 103827548 103762543 103684592 103572857 103417897 103228092 103042698 102936304 102982461 103207278
1215.6 103207278 103557789 103930879 104239798 104450989 104571497 104627264 104643750 104629052 104580057 104486418
1236 104486418 104330218 104079247 103708422 103252721 102872455 102800632 103100467 103549457 103868341 103930664
1256.4 103930664 103714085 103222311 102441657 101285672 99591953 97278726 94615579 92316002 91095054
1274.8 91095054 91134113 92084849 93380886 94522077 95192206 95232636 94539148 93001169 90530932
1293.1 90530932 87267178 83939648 81857514 82116991 84625250 88040650 90941548 92851955 94061708
1311.5 94061708 95011145 95918900 96674806 96837997 95886165 93666023 90708375 88327473 87866676
1329.8 87866676 89528418 92264336 94861954 96640474 97154498 95860422 92707336 89603186 89787722
1348.2 89787722 93649548 98122579 101051033 102540827 103277040 103663456 103912628 104176319 104457974
1366.6 104457974 104667675 104757810 104798448 104856837 104947567 105027235 105092847 105142748 105165386 105154467 105121303
1389 105121303 105082870 105016124 104944503 104872227 104799199 104705060 104587018 104425466 104252672 104083943 103877902
1411.4 103877902 103600729 103202176 102609885 101708710 100616014 99173307 97030270 93723029 88309121
1429.8 88309121 80457324 71077240 60973316 54618388 57004982 66394204 77878559 86491907
1446.1 86491907 90147817 89722311 89085102 90927660 94342005 96378040 96145082 94427162 90311474
1464.5 90311474 82758552 72453046 60134047 48802176 44440100 44803753 44444674 43081751
1480.8 43081751 43141913 46994162 55347544 66457641 76855963 84031987 88955939 92950332
1497.1 92950332 95775938 97420543 98300356 98609865 97992909 96588397 95399845 95102859 95458817
1515.4 95458817 95518154 94490701 92058367 89656436 89242941 91333240 94866806 98499596 101563096
1533.8 101563096 103402328 104322159 104988921 105432427 105665314 105842280 105979455 106097996 106200063
1552.2 106200063 106279385 106300747 106242073 106115019 105966485 105603445 104813004 103530085 102384055 102304602
1572.6 102304602 103029585 103898513 104357505 104423869 104221451 103784084 103200436 102720118 102589345 102807593
1593 102807593 103162527 103406060 103482890 103526318 103658915 103920090 104345155 104862964 105298853 105558026
1613.4 105558026 105648470 105633700 105711377 106046176 106607819 107117534 107428169 107625043 107747281 107800555
1633.7 107800555 107816470 107859766 107921815 107970870 108001876 108012116 108045018 108088005 108079588 108053446 108095050 108145142
1658.2 108145142 108168507 108174896 108186984 108197522 108179665 108152413 108134687 108102822 108049524 107982147 107890344 107770240
1682.7 107770240 107647848 107594681 107597685 107624030 107646561 107634139 107612586 107605302 107617247 107649422 107692719 107762969
1707.2 107762969 107847500 107912469 107943022 107939517 107911432 107886231 107861137 107822251 107766855 107688904 107597244 107501113
1731.7 107501113 107381010 107286131 107245183 107219875 107217669 107236445 107251799 107245827 107222974 107208133 107199013 107185245
1756.1 107185245 107188094 107218432 107284462 107384944 107487094 107584906 107688916 107819998 107986391 108159018
1776.5 108159018 108307016 108406281 108447707 108432257 108358455 108227944 108032906 107796180 107594788 107440996
1796.9 107440996 107315922 107248306 107278574 107381654 107510042 107654428 107818663 107991469 108156943 108303261
1817.3 108303261 108428252 108533812 108619165 108696020 108765423 108822787 108881414 108937824 108973789 108987427 108983862
1839.8 108983862 108969021 108950293 108940434 108948743 108965445 108978426 108985984 108990526 108993626 108997667 108991504 108966327 108929074
1866.3 108929074 108887923 108848715 108807850 108756661 108687198 108592808 108470857 108319724 108144152 107959068 107769704
1888.7 107769704 107605636 107501400 107452333 107451582 107488513 107559276 107653654 107738841 107804000 107873261 107955563
1911.1 107955563 108041954 108129179 108228791 108348107 108460069 108554399 108636832 108692431 108715284 108716285 108690059
1933.6 108690059 108631527 108544612 108417475 108245230 108051026 107850182 107641792 107445967 107288897 107183123
1954 107183123 107130361 107128775 107167506 107229686 107301080 107377601 107467997 107572651 107686639 107799947 107908785
1976.4 107908785 108028352 108166432 108311093 108446980 108571315 108687043 108792138 108886194 108970284 109041774
1996.8 109041774 109105575 109167254 109221864 109266293 109299946 109318066 109324050 109332311 109345436 109354675 109364295 109382582
2021.3 109382582 109397137 109402680 109417832 109442389 109456468 109464109 109480190 109498549 109508693 109509850 109509420 109514678 109519184
2047.8 109519184 109518278 109518075 109519160 109517264 109510767 109501517 109490788 109475231 109461117 109458673 109463799 109467530 109466076 109466326
2076.4 109466326 109474039 109477925 109468305 109453082 109435499 109412086 109392858 109385741 109386551 109383440 109376955 109382129 109392679
2102.9 109392679 109398103 109407115 109420705 109428561 109429944 109422898 109411871 109411764 109420228 109433639 109452581 109468532 109479272
2129.4 109479272 109492373 109508002 109518468 109523690 109532583 109539223 109530163 109521508 109528625 109532475 109518635 109496140 109467936
2155.9 109467936 109437501 109418631 109413564 109419239 109434569 109451187 109457934 109457421 109464633 109482002 109496164 109500515 109503162
2182.4 109503162 109510899 109520423 109529257 109533000 109528899 109522796 109515893 109506142 109492719 109484959 109497142 109521663 109538424
2208.9 109538424 109540319 109533298 109523427 109514415 109506297 109496891 109485292 109462440 109424591 109384704 109348261 109319997 109312367
2235.4 109312367 109325182 109343970 109358513 109372783 109387207 109394944 109397829 109399283 109398055 109400260 109406877 109402704 109390211
2262 109390211 109390187 109405279 109428489 109459078 109490132 109509575 109517276 109525073 109541023 109562004 109583211 109603333 109619117
2288.5 109619117 109634233 109648824 109651029 109640455 109622347 109598589 109564996 109514427 109456146 109391642 109310639 109221601
2312.9 109221601 109137774 109073865 109044886 109042633 109060419 109100354 109130037 109112954 109060407 109004891 108958292 108907890
2337.4 108907890 108854973 108829498 108862066 108951664 109053671 109161937 109298539 109430373 109496224 109512305 109534860
2359.9 109534860 109564674 109556556 109512901 109476340 109446883 109421062 109403110 109376705 109354603 109361267 109384239 109406853
2384.3 109406853 109434605 109468138 109495187 109509897 109518838 109533155 109552610 109572816 109589362 109601986 109625149 109659207
2408.8 109659207 109691274 109713769 109726763 109743702 109763634 109771538 109775436 109785664 109793687 109798396 109804022 109813118 109825051
2435.3 109825051 109830272 109829378 109828782 109827721 109826839 109829330 109833062 109838986 109849179 109856164 109857285 109856379 109860694 109875727 109895384
2465.9 109895384 109911358 109921002 109923983 109918499 109911132 109914088 109925056 109934974 109941733 109947467 109955609 109965134 109975195
2492.4 109975195 109990394 110009348 110023510 110023427 110006380 109983468 109963191 109946823 109937322 109930182 109922826 109919453 109914684
2518.9 109914684 109896970 109860873 109810901 109750378 109681928 109614491 109562087 109547257 109576476 109631765 109697056
2541.4 109697056 109763873 109822869 109867358 109903216 109935582 109962213 109988666 110013902 110015297 109984195 109938419 109889436
2565.8 109889436 109838784 109789419 109741914 109701800 109688234 109708881 109739661 109755647 109758353 109760714 109767890 109784412
2590.3 109784412 109817183 109851384 109869444 109882522 109897435 109909236 109927428 109952188 109973764 109998536 110025156
2612.8 110025156 110043442 110051668 110050249 110042143 110027671 110013473 110008514 110004938 109995556 109978187 109956729 109949446 109962738
2639.3 109962738 109990406 110026038 110056758 110080755 110105538 110125160 110136962 110151994 110166955 110175848 110184896 110188222
2663.7 110188222 110176587 110152912 110116673 110064900 110006249 109943402 109869981 109797239 109742987 109708858 109689093
2686.2 109689093 109674931 109656453 109628630 109580457 109491396 109350312 109163249 108946419 108729386 108552229
2706.6 108552229 108453083 108455014 108554649 108722293 108909118 109064794 109174764 109257674 109321225 109374726 109421217
2729 109421217 109435856 109404171 109331632 109239233 109147775 109042287 108899987 108732092 108572030 108458686 108412659
2751.4 108412659 108419907 108466458 108550048 108651841 108756363 108863509 108960080 109032297 109080935 109096980 109070814
2773.9 109070814 109038806 109042203 109079480 109144568 109230256 109308779 109360766 109396386 109419155 109408247 109355032 109289408
2798.4 109289408 109246802 109230590 109241903 109274924 109306860 109350097 109421504 109500253 109567034 109617662 109651303
2820.8 109651303 109666073 109666193 109664679 109660900 109636366 109581077 109494650 109379137 109274769 109210408 109130132 108982205
2845.3 108982205 108790505 108606839 108462405 108362401 108315611 108327520 108396220 108527696 108691049 108833444
2865.7 108833444 108949816 109027994 109039617 109080303 109237444 109388208 109414184 109336793 109207857 109073818
2886.1 109073818 108955514 108855653 108765662 108671892 108594191 108554280 108529663 108493125 108432984 108324015 108142173
2908.5 108142173 107891095 107608402 107353377 107161176 107024968 106932080 106870246 106844223 106860864 106925428
2928.9 106925428 107096088 107389796 107730603 108048844 108302486 108433390 108434486 108411932 108458102 108515799
2949.3 108515799 108487058 108460164 108541608 108659363 108748424 108824062 108930814 109080243 109208989 109267330 109253609
2971.7 109253609 109204996 109172845 109138513 109088242 109084415 109126222 109133351 109060133 108906507 108721340 108568060
2994.2 108568060 108438206 108326662 108255231 108187485 108083272 107916105 107632232 107205081 106681490 106129289
3014.5 106129289 105609059 105223286 105068314 105107343 105222952 105344641 105435073 105476117 105473948 105463302 105451655
3037 105451655 105359316 105153310 104881167 104551506 104105413 103469551 102667165 101794517 100929141 100140810
3057.4 100140810 99438745 98768294 98138648 97647136 97407764 97490585 97861087 98416495 99114221 99973857
3077.8 99973857 100964439 101956534 102812600 103507841 104087663 104596555 105074346 105509436 105849242 106073332
3098.2 106073332 106213021 106311750 106380761 106425989 106503010 106662381 106835127 106928980 106983948 107069480 107205451
3120.6 107205451 107394516 107598388 107763386 107880878 107976699 108048129 108053184 107973051 107866585 107834601 107902622
3143 107902622 108025622 108170295 108293748 108365190 108438742 108556199 108655119 108694446 108713651 108744454 108779037
3165.5 108779037 108795440 108798230 108811462 108835852 108856976 108864021 108859074 108855510 108861148 108875692 108888853 108895648 108911085
3192 108911085 108943820 108972287 108979392 108981335 108994389 109015560 109041953 109081352 109118259 109122980 109112072 109111571 109116912
3218.5 109116912 109135211 109163606 109172595 109165597 109164202 109147882 109109581 109110045 109167111 109220302 109231055 109203231
3243 109203231 109159756 109137118 109155786 109179938 109165943 109136057 109131527 109138238 109129906 109120464 109111607 109068859 108992529
3269.5 108992529 108947468 108960354 108991456 109017599 109027791 109014249 108989513 108967352 108937407 108877134 108808589
3291.9 108808589 108773720 108769667 108783352 108797538 108763266 108674836 108591926 108562768 108594096 108639824 108646715 108631444
3316.4 108631444 108628976 108621264 108576477 108511198 108475888 108481061 108482444 108450544 108393490 108319581 108258140 108240008
3340.9 108240008 108242333 108237803 108201516 108123016 108075666 108098781 108118784 108087826 108029938 107982540 107938957 107857382
3365.4 107857382 107762539 107725823 107760775 107806003 107811940 107799864 107792389 107782876 107775247 107773137 107746887 107685101
3389.8 107685101 107646489 107675993 107726932 107723129 107671416 107667351 107737577 107789171 107792675 107804310 107834423 107870889
3414.3 107870889 107915258 107950652 107969415 107992399 108013999 108009207 107989025 107991326 108007646 108001637 108009350 108068895
3438.8 108068895 108137000 108173060 108191419 108219266 108258402 108293509 108323216 108351552 108359909 108348918 108359861 108387196
3463.2 108387196 108381534 108354557 108373582 108458257 108545637 108585525 108585954 108586097 108625579 108674717 108701205 108747292
3487.7 108747292 108811140 108845484 108866358 108895683 108925903 108950198 108968675 109021330 109106934 109171176 109201229
3510.2 109201229 109202349 109208441 109255958 109324622 109370029 109374595 109395170 109464419 109527850 109564722 109584057 109587777
3534.6 109587777 109604728 109646416 109672129 109659791 109649670 109696007 109780478 109833729 109859586 109892106 109919798
3557.1 109919798 109937370 109955740 109987116 110018265 110018969 110021138 110064304 110116374 110149634 110177732 110200953 110206461
3581.5 110206461 110197651 110205209 110277402 110377502 110438883 110472202 110486293 110486662 110497916 110530269 110564685 110587037
3606 110587037 110613310 110641265 110639346 110623920 110626614 110621047 110602522 110604882 110613894 110610783 110604966 110594583 110582280
3632.5 110582280 110587692 110599804 110594964 110589170 110605896 110625708 110620272 110584986 110571110 110603547 110630167 110630870 110628784
3659 110628784 110654378 110709393 110763681 110798264 110819733 110839784 110844743 110845959 110866845 110887539 110900974 110906196
3683.5 110906196 110897171 110880041 110881424 110900187 110896003 110878217 110873783 110868919 110852349 110837889 110836804 110849583 110869980
3710 110869980 110896671 110923016 110947144 110982072 111024451 111054420 111068356 111086380 111120927 111149716 111142015 111102664
3734.5 111102664 111064875 111057436 111081362 111112642 111131859 111138332 111141086 111131966 111112142 111107445 111112535 111118639 111140049
3761 111140049 111161506 111164045 111169124 111186171 111199284 111203945 111198986 111166358 111124253 111128581 111157298 111173999 111192703
3787.5 111192703 111210251 111221671 111242676 111261892 111271191 111297524 111321974 111305940 111281943 111279643 111284852 111290634
3812 111290634 111288416 111268044 111254346 111253786 111257684 111258411 111257136 111271226 111292148 111286044 111247206 111221468 111219656 111206496
3840.6 111206496 111190259 111185038 111194777 111227393 111276662 111316299 111303103 111262691 111246789 111257291 111270475 111271918
3865 111271918 111268806 111270094 111265481 111256576 111263192 111261916 111222947 111174369 111145806 111138296 111153102 111163127 111159647
3891.6 111159647 111168885 111187541 111197639 111201847 111204934 111205280 111214972 111243498 111270368 111276686 111278915 111289632 111302578
3918.1 111302578 111320078 111329198 111316311 111302853 111301875 111308002 111326921 111342001 111339426 111343145 111358237 111362374 111348867
3944.6 111348867 111342061 111360991 111379457 111368716 111343110 111325610 111319184 111318040 111319351 111329913 111349237 111350513
3969.1 111350513 111325192 111299360 111286855 111285150 111284018 111268032 111241019 111221457 111212039 111203361 111201620 111215281
3993.5 111215281 111228406 111227632
3997.6 111227632
##END=$$ End of the data block
