##TITLE=B8M - Leandro - Epoxido $$ Begin of the data block
##JCAMP-DX=5.00 $$ ACD/SpecManager v 10.08
##SPECTROMETER/DATA SYSTEM=Alpha
##DATE=16 Apr 2015 08:31:26
##DATA TYPE=INFRARED SPECTRUM
##DATA CLASS=XYDATA
##ORIGIN=
##OWNER=
##NPOINTS=1765
##FIRSTX=399.76428223
##LASTX=3997.64306641
##MAXX=3997.64306641
##MINX=399.76428223
##MAXY=0.86993194
##MINY=0.19202082
##XFACTOR=1.0000000000
##YFACTOR=1.000000000000000e-9
##FIRSTY=0.84967995
##DELTAX=2.03961372
##XUNITS=1/CM
##YUNITS=ARBITRARY UNITS
##XYDATA=(X++(Y..Y))
399.8H49679947O685257m72784l399253r39310K968431K993882j096011l981828k032638
418.1H50405693K578378K179920k527535o337046o437421n427599m336297l35455M700124
436.5H34462762O588817O653726N548179J415133k760410k663672Q65519L243029J546204
454.8H54899287k206623l421784l51012K291918R15110l448546o229579m093707J535952
473.2H39891016M779637K352953j042425n14150K427578K739489q04424l879607k919197
491.5H43030870N93543K044559o0320k817393k727866J71721K183437L95239l401637
509.9H39412153m698932k735973j257539m166901j1111021j9588411l3566415n0436318
526.2G11850643l4197032K3115515O1416269M8833191K2514999R217084K561211j882076
$$ plain form
399.8 849679947 856365204 855892420 852493167 851553857 854522288 857516170 856420159 852438331 850405693
418.1 850405693 852984071 855163991 852636456 846299410 839861989 834434390 830098093 829762638 834462762
436.5 834462762 841051579 847705305 853253484 854668617 851908207 849244535 850110054 853353083 854899287
454.8 854899287 852692664 849270880 848919868 851211786 852126896 848678350 842448771 838355064 839891016
473.2 839891016 844670653 847023606 845981181 845467031 847894609 850634098 849829674 845950067 843030870
491.5 843030870 843624413 845668972 845608652 842791259 840063393 840235114 842418551 842813790 839412153
509.9 839412153 834713221 831977248 830719709 826552808 815441787 795853376 762286961 711850643
526.2 711850643 677653611 700769126 762185395 811018586 833533585 842750669 845311880 843429804
542.5H43429804k510667K66254K453506J142144k197504l353417j011848J836300J562297
560.9H41616869j506627l388404j792968J397014J959741r32515l913819l379703m24385
579.3H29635203O18040k442836p248402j1174083j8282413l9163172o0814739l0662000
595.6F60465598M1301489P0351124M4302702J6702711L480196j842737j890957j90258
611.9H32679868k917350r232282n599261N995512R086967M892290Q64029k502978l224671
630.2H30042124p94292J506269M35889k864420m463733k931654n69701j135350m551768
648.6H14673364p387459o691873m624784n826831j3152778k6125074m3075263n2430809
664.9F55358493k4235069N6561589O4362943K1196604j221419j1898994k3925543l5336196
$$ plain form
542.5 843429804 840919137 841185391 843638897 844781041 842583537 839230120 838218272 840054572 841616869
560.9 841616869 840110242 836721838 834928870 836325884 838285625 837353110 833439291 830059588 829635203
579.3 829635203 830253243 827810407 820562005 809387922 791105509 751942337 691127598 660465598
595.6 660465598 701767087 772118211 816420913 833123624 836603820 834761083 832870126 832679868
611.9 832679868 829762518 820530236 814930975 820926487 830013454 834905744 835769773 833266795 830042124
630.2 830042124 829247832 830754101 831189990 828325570 823861837 820930183 820360482 819225132 814673364
648.6 814673364 807285905 800594032 795969248 790142417 776989639 750864565 707789302 655358493
664.9 655358493 631123424 687685013 752047956 773244560 772023141 760124147 736198604 700862408
681.2G00862408l0951083k2025168m1783392q9318633j16566301q3469599l5219372
695.5B81528860k3623496j2174204L4146234J02311880J47129178J32390499Q8623524
709.8G50332475N3617537K9802322J3677895N632639L649831K900362L15189l059923
726.1H56868327m213095l038585k511323n437851j0755062j5468001j9205690k5963008
742.4G70275712m0864348o4978183r1667354r9655896n9067428K7803093J03789806
756.7E45635402J17951811Q4197819M5943916K1071195L148020j5776992m0531814
771G61639357p4605585r5237851m3461859O5064073J15602553Q0368936L5412013J4411748
787.3H59193385M289746k659857n977631o576121r107292j6801953k4481594k1340728
$$ plain form
681.2 700862408 669911325 647886157 606102765 516784132 400217831 316748232 281528860
695.5 281528860 257905364 245731160 279877394 382189274 529318452 661708951 750332475
709.8 750332475 803950012 833752334 847430229 853062868 856712699 859613061 859928250 856868327
726.1 856868327 852655232 849616647 847105324 841667473 830912411 815444410 796238720 770275712
742.4 770275712 729411364 664433181 572765827 473109931 414042503 441845596 545635402
756.7 545635402 663587213 747785032 793728948 814800143 817948163 802171171 761639357
771 761639357 687033772 591795921 548334062 613398135 729000688 809369624 844781637 859193385
787.3 859193385 863483131 860823274 854845643 848269522 839162230 822360277 797878683 776537955
803.6G76537955p243514O563067J4643669J7543733J4751137J0110676P725954N452454
819.9H46085131K97725p236659j6611517l0005395l8752615j9231141K2323489M2938232
836.2G99807250L3000768J8210888Q530438O75559n909861j1538505j2834072l020287
852.6H26922178P681310N959392M18663k361596q367538j6672432j7012835n420268
868.9G91146874P134557R246290K314925o810307j3864875j8186689k2768438l2772719
885.2G15439618n0621212o8787396o3290894j2129962N8815479R1511190P3988557
899.5G44925380M3035209K3791611J5866876J1902511P746696L980518K661049L397107
915.8H57306957L339410R72807k370834l769994j735985N80013k418399j2879491k4743855
$$ plain form
803.6 776537955 769294441 775857508 790501177 808044910 822796047 832906723 840632677 846085131
819.9 846085131 846382856 839146197 822534680 792529285 753776670 734545529 756869018 799807250
836.2 799807250 832808018 851018906 859549344 860224903 854315042 842776537 829942465 826922178
852.6 826922178 834603488 840562880 840981543 838619947 830252409 813579977 796567142 791146874
868.9 791146874 798281431 807527721 809842646 803032339 789167464 770980775 748212337 715439618
885.2 715439618 664818406 596031010 532740116 520610154 579425633 670936823 744925380
899.5 744925380 787960589 811752200 827619076 839521587 847268283 851248801 853909850 857306957
915.8 857306957 860646367 861619174 859248340 855478346 853742361 854322374 851903975 839024484 814280629
934.1H14280629j8640399J0404527K9550076K1088660O607711J308918J801312K516508
950.5H68917942J013994j403689k103448o57082P20621r9183k536833m073262l483355
968.8H56295705k292156l241480p115125q102417j584053L732204M86493m707992m761815
987.2H28709364j260877o08980n991161j6557157k4909854k1642804j6117990j7997861
1003.5G23622680k8336227l9346338j2376844M6612680P0664823M9115240K2349477
1017.8H32305491O613910j833737p562101j4946997k2007704k1005153q730114R902656
1034.1G72736251K3935795K5430560J7185092P642091K044797o557j987636o447613
1050.4H40532780j4101506k4266660k9332876j5044630J3872147K8539836J8655003
$$ plain form
934.1 814280629 795640230 806044757 835594833 856683493 863291204 864600122 866401434 868917942
950.5 868917942 869931936 868528247 866424799 865767717 866488338 866389155 863852322 859779060 856295705
968.8 856295705 854003549 850762069 843646944 835544527 833960474 837692678 838179171 833471179 828709364
987.2 828709364 827448487 826839507 820848346 804291189 779381335 757738531 741620541 723622680
1003.5 723622680 695286453 655940115 643563271 690175951 760840774 809956014 832305491
1017.8 832305491 838919401 837085664 829523563 814576566 792568862 771563709 762833595 772736251
1034.1 772736251 796672046 822102606 839287698 846929789 848974586 848968029 846980393 840532780
1050.4 840532780 826431274 802164614 772831738 757787108 771659255 800199091 818854094
1064.7H18854094P34388j3865053j8172682m348933J3012230J0722339n409956j1712253
1081G89814174J944065J8870771J9749284J0566711L532947o15061l097951l005088
1097.3H37759852j194298j39236j792848p243932j6891241k6730716k0800114P350266
1113.6G70317733L0279756K7334273J3626218N423665K772927J386166l66211j545072
1129.9H49229455j210332m2438M41074k71916j237870j155376j71125K59995j120090
1148.3H44721377m119635o260633m855454k015531k407789l931702n22256M282594
1164.6H24890971L129840j623273o019115j0153592j4318883j7765463j7125070n663812
1180.9G55351603J5111566K4748742J3295591l153920j1698544r728909N07832Q993864
$$ plain form
1064.7 818854094 819588482 805723429 787550747 783201814 796214044 806936383 801526427 789814174
1081 789814174 791758239 810629010 830378294 840945005 844477952 843862891 840764940 837759852
1097.3 837759852 836565554 836426318 834633470 827389538 810498297 783767581 762967467 770317733
1113.6 770317733 800597489 827931762 841557980 846981645 849754572 851140738 850774527 849229455
1129.9 849229455 848019123 847976685 848417759 848145843 846907973 845752597 845581472 845841467 844721377
1148.3 844721377 840601742 834341109 829485655 827470124 825062335 821130633 820608377 824890971
1164.6 824890971 828020811 826397538 820378423 810224831 795905948 778140485 761015415 755351603
1180.9 755351603 770463169 795211911 808507502 805353582 793655038 783926129 784433961 793427825
1197.3G93427825R182572M576743j04249l344833n037547n816102o793320q649349
1213.6G77441740j1132002j3757706j7070829k2818745l0600011l5624266l5482525
1227.9F10955656l6277354m2994976n0423175m6330422j8077016K9918372P0186675
1242.1E16957760Q1333756O7683637M5836330K8804302K1469236K0046114J7784000
1256.4G99915135J2690067P310748M170955L436207L327668K154529m1246k058983
1272.7H30905080l213644l814697l965617k939403p57277J061380R11415k062261p540405
1291.1H08584571j1173010m864037R136081J5574038R863496J417636m255354p180095
1307.4H17103326q121311r486020r314835j544774O884039P331133P600248J0745585
$$ plain form
1197.3 793427825 802610397 807187140 807082891 803738058 798700511 792884409 786091089 777441740
1213.6 777441740 766309738 752552032 735481203 712662458 682062447 646438181 610955656
1227.9 610955656 574678302 531683326 481260151 434929729 416852713 446771085 516957760
1242.1 516957760 598291516 665975153 711811483 740615785 762085021 782131135 799915135
1256.4 799915135 812605202 819915950 824086905 827523112 830850780 833005309 832964063 830905080
1272.7 830905080 827691436 823876739 819911122 816971719 816214442 817275822 818187237 816124976 808584571
1291.1 808584571 797411561 792547524 801683605 817257643 827121139 828538775 824283421 817103326
1307.4 817103326 808982015 799495995 790181160 788636386 795520425 802851558 810451806 821197391
1323.7H21197391R441733M334450N63979j472712l397226n608022p506192q048534
1340H09504867p331968p242083r980262j8131733k8098762k4927556p17938K7295887
1356.4G40370452L6053479K7877092J6978086Q425533K955616Q0705j196743j473605
1372.7H30070615j685679k440095l925741n646944o358027o283224q104861j2212157
1389G83413887j5128255j6787112j7098605j4871717j3534546j3228893j5089214k3676872
1405.3F53998673l6134958m2849362k8503478J0822773M5046866N5345476M8551500
1419.6G06277490L3063054K5367737K2149145J6190350J0812342N811394J507938j749635
1435.9H19429815n071044r023547j6654551k8544784m9428284p8331769o5736949Q34286
$$ plain form
1323.7 821197391 830639124 834973574 835537553 834064841 830667615 825059593 817553401 809504867
1340 809504867 802172899 794930816 784950554 766818821 738720059 713792503 713074565 740370452
1356.4 740370452 776423931 804301023 821279109 829704642 832660258 832740963 831544220 830070615
1372.7 830070615 828384936 825944841 822019100 816372156 810014129 803730905 795626044 783413887
1389 783413887 768285632 751498520 734399915 719528198 705993652 692764759 677675545 653998673
1405.3 653998673 617863715 575014353 546510875 557333648 602380514 657725990 706277490
1419.6 706277490 739340544 764708281 786857426 803047776 813860118 819671512 821179450 819429815
1435.9 819429815 814358771 805335224 788680673 760135889 710707605 632375836 566638887 567473173
1452.2E67473173M5695365J8407642k7245223J1728883O3991129Q2940579N5683970
1466.5H18675518J9265592N642176K377629K56717j445293k293944k175212j734913
1482.8H38568270k050340n040824j3795019k2674977k0266354j9958318j1810600K6555061
1499.1G69526899M3218493K5422871R262920K409935j087845j779139j228272J4960
1515.4H45760822J249373J385272Q83043J07586l95536o29843q58664j275003j932383
1533.8H44294667j619220r26613j385331l108264m097521m453599m217625l971279
1550.1H20515215l202200j872301k54273K301753L234684R76503k59519j468479m362166
1568.5H15609217q030057r897530k0632923m4054449k9664397J5702427L5227775J7880738
$$ plain form
1452.2 567473173 613168538 631576180 604330957 616059840 680050969 762991548 818675518
1466.5 818675518 837941110 843583286 845960915 846217632 844772339 842478395 840303183 838568270
1482.8 838568270 836517930 831477106 817682087 795007110 774740756 754782438 742971838 769526899
1499.1 769526899 812745392 838168263 847431183 849841118 848753273 846974134 845745862 845760822
1515.4 845760822 847010195 848395467 849278510 849386096 848990560 848360717 847502053 846227050 844294667
1533.8 844294667 842675447 841748834 840363503 837255239 833157718 828704119 824486494 820515215
1550.1 820515215 817313015 815440714 815186441 817488194 820722878 821699381 821439862 819971383 815609217
1568.5 815609217 807579160 797681630 777048707 732994258 703329861 719032288 754260063 772140801
1584.8G72140801m884660k0297468m0194988n5798292l4558297K6094199O6594779
1599.1G09096074N5610776K5774181P432461J550376K98441n90861j630366k404630
1615.4G95136452l023267k659559k544761l650367m535556m756510m309178k756297
1631.7G66900957j044691M5955K39134m98354k009213m124105l906668J572192M360974
1650.1G61536181J644194m083812n516648n664409p841110j2397170j5335262j4958977
1666.4F97382987k0007909l0573129l1030179k5504410k2767961l1002819n1890374
1680.7D84606206r0275228j31594032p0716127K2578075Q6837351J08445734J08061999
1694.9E17943978R3575120O6315294N6742072L7457227K4355889K0259499J2605846
$$ plain form
1584.8 772140801 767256141 746958673 706763685 650965393 616407096 642501295 709096074
1599.1 709096074 764706850 790481031 797913492 799463868 799762309 799171448 797541082 795136452
1615.4 795136452 792113185 789453626 786908865 783258498 778722942 773966432 769657254 766900957
1631.7 766900957 765856266 765902221 766141355 765643001 763633788 759509683 755603015 757175207 761536181
1650.1 761536181 763180375 759096563 753579915 747915506 740074396 727677226 712341964 697382987
1666.4 697382987 677375078 646801949 615771770 590267360 567499399 536496580 484606206
1680.7 484606206 394330978 262736946 192020819 214598894 301436245 409881979 517943978
1694.9 517943978 611519098 677834392 734576464 772033691 796389580 816649079 829254925
1709.2H29254925P292688N420804N745351O586075M477859J525462K23755o4849k35498
1727.6H60226572j98484m9531L43501M55380L13341K46942R7275J22368L07203M27127
1748H62291694j7286o13629q55566q08239p71522p84516j086593j444638j668513k052009
1768.4H52189183k529740l312945l052831j685739l07023Q60512J603007J907766J769901
1786.7H47442091J251518P54297L16203R2089N25534J043320R54449K07484m25876
1805.1H52161109o84082q00490j074136j679718k472043l150523k924860j562714J64509
1823.4H37977052J074910Q19504N89848R79125J179517Q42750L11493K5213J35541
1841.8H43934953L88324N02050M41075M19140M16994M41074M52876L56436J74165J0609
$$ plain form
1709.2 829254925 836547613 841968417 847713768 854299843 858777702 860303164 860526919 860462070 860226572
1727.6 860226572 860028088 859978557 860322058 860777438 861090779 861337721 861434996 861557364 861864567 862291694
1748 862291694 862274408 861660779 860805213 859996974 859225452 858440936 857354343 855909705 854241192 852189183
1768.4 852189183 849659443 846346498 843293667 841607928 841300905 842161417 843764424 845672190 847442091
1786.7 847442091 848693609 849447906 849764109 849856198 850381732 851425052 852379501 852586985 852161109
1805.1 852161109 851477027 850676537 849602401 847922683 845450640 842300117 839375257 837812543 837977052
1823.4 837977052 839051962 839871466 840461314 841440439 842619956 843462706 843774199 843799412 843934953
1841.8 843934953 844323277 844825327 845266402 845685542 846102536 846543610 846996486 847352922 847527087 847537696
1862.2H47537696n5313j36196k31445j88947r7394j72079l84748p08401j082837j337409
1882.6H43142927j478195j657069k079129k667070k967000k583980j154006P95364
1898.9H29351842K004803J911401Q52168m74095j524270k131700k542198k846062j931131
1917.3H22670758J281559M514337M988849L067613R79483l29018r62138r96053n73755
1935.6H34641635K23518J009345J163363N23210k79725p11798r91285j535356k441943
1954H31600964l286481l261924j883566J40309J441717J540959R08673J78576m74513
1972.3H26904714j474321k899885l629088k634466o98507J220822K960384L656328
1988.7H23405981K914071J853526J410424J154781M15325j16825K56777R47475J260638
$$ plain form
1862.2 847537696 847482383 847346187 847114742 846925795 846828401 846656322 846271574 845563173 844480336 843142927
1882.6 843142927 841664732 840007663 837928534 835261464 832294464 829710484 828556478 829351842
1898.9 829351842 831356645 833268046 834120214 833646119 832121849 829990149 827447951 824601889 822670758
1917.3 822670758 823952317 828466654 833455503 836523116 837502599 837173581 836211443 835215390 834641635
1935.6 834641635 834865153 835874498 837037861 837561071 837281346 836569548 835578263 834042907 831600964
1954 831600964 828314483 825052559 823168993 823309302 824751019 826291978 827200651 827379227 826904714
1972.3 826904714 825430393 822530508 818901420 816266954 815568447 816789269 819749653 823405981
1988.7 823405981 826320052 828173578 829584002 830738783 831154108 831037283 831294060 832241535 833502173
2007H33502173J029551N04494J65463J60753K35260O6101l85999q40605q25047j80304
2027.4H33431840K78711O9201k80916l45171j37865Q2075P7129q9646j45793k4199
2047.8H32915366J05083K2471k61963m50492l26216m6432O3241r1076k73347j97292
2068.2H31459343N7817K11954J02639j70052l42905k54810n7936l5465k28166l95119
2088.6H30347300k99991m2855R6202l6955l13640m53711l42547k08259l36409o34849
2109H27774286o97791l28422J79708M01199J80364j74106k38478p629J58727K9028
2129.4H27276886k36393l03685n6207K49564K83838J2815k22564j48714P0870P9870
2149.8H27006280k10225n31733n51760k17677J42575J58906j40071l60668k66135j8477
$$ plain form
2007 833502173 834531724 835036218 835201681 835362434 835597694 835663795 835277796 834437191 833612144 833431840
2027.4 833431840 833710551 833779752 833498836 833153665 833015800 833097875 833175004 833085358 832939565 832915366
2047.8 832915366 833020449 833042920 832780957 832330465 832004249 831957817 832021058 831929982 831656635 831459343
2068.2 831459343 831517160 831729114 831831753 831661701 831318796 831063986 831006050 830970585 830742419 830347300
2088.6 830347300 830047309 830004454 830100656 830063701 829750061 829296350 828953803 828745544 828409135 827774286
2109 827774286 827076495 826748073 826927781 827328980 827509344 827335238 827096760 827089131 827247858 827276886
2129.4 827276886 827040493 826736808 826680601 826930165 827214003 827226818 827004254 826855540 826926410 827006280
2149.8 827006280 826796055 826264322 825712562 825494885 825637460 825796366 825656295 825295627 825029492 825011015
2170.2H25011015L9935k09391m63009l78489p4089M2081j74642m83811n32746k92242
2190.6H22484612q3148j48773m00126n43356m23014k29001k66254n54443p80821o27040
2211H18428636j16706L69310N00560L74019L11017M04179M11391R9004l95417o64592
2231.4H19721401m81248q4996M7028k15829m57465k87474R0480J59860k10583o35743
2251.8H17645431o50406k13504J89245J40607j76370k66552N4359M52340M69863O7950
2272.2H17712963l24250l17633j6391J49786m5359l67284m39703k10345L0577P391
2292.5H16179752k43723m06325k52545J8418M4107k13384m93050n61297m24802l08156
2312.9H13338995l91781o02782p27415o94275n75602k61426K02477L52979J9073m56214
$$ plain form
2170.2 825011015 825050950 824841559 824378550 824000061 823925972 823968053 823793411 823309600 822776854 822484612
2190.6 822484612 822401464 822252691 821852565 821309209 820886195 820657194 820390940 819836497 819055676 818428636
2211 818428636 818311930 818681240 819181800 819555819 819866836 820271015 820682406 820781410 820385993 819721401
2231.4 819721401 819240153 819155157 819202185 818986356 818528891 818241417 818331897 818491757 818281174 817645431
2251.8 817645431 816995025 816781521 816970766 817111373 816935003 816668451 816722810 817175150 817645013 817712963
2272.2 817712963 817388713 817071080 817054689 817204475 817159116 816791832 816352129 816141784 816172361 816179752
2292.5 816179752 815936029 815529704 815277159 815295577 815339684 815126300 814633250 814071953 813647151 813338995
2312.9 813338995 812947214 812344432 811617017 810922742 810347140 810085714 810288191 810641170 810660243 810204029
2333.3H10204029r07242j316786j382172p90239L50476J270354J146912N00560J27852
2351.7H09203744J32263L18765M15802K51949N8234P2062J81019J77801k9922k77281
2372.1H10504436k73466l6954J56462Q6903j88589l90470l28541r7394l338k03967
2392.5H09225082m86195n22732l22998j96695l51310o72996q31068o31153k44379r835
2412.9H04955721o2466k02060q1598L01122N36025L61145O198j10447M5001J57893
2433.3H05906534L8445k25901l89934k74062k2710N5135j22428l80933m85301l48092
2453.7H03750753k03311k94387m60267m11690j12235K23815L52442K58804J21712Q7858
2474.1H03313494J51217J20043j66118n05805n92589m24862k47598k69532m32670m37081
$$ plain form
2333.3 810204029 809296787 807980001 806597829 805807590 806158066 807428420 808575332 809075892 809203744
2351.7 809203744 809336007 809654772 810070574 810322523 810380757 810452819 810633838 810811639 810781717 810504436
2372.1 810504436 810230970 810194016 810350478 810437381 810248792 809858322 809529781 809432387 809429049 809225082
2392.5 809225082 808738887 808216155 807893157 807696462 807345152 806672156 805841088 805209935 804965556 804955721
2412.9 804955721 804893255 804691195 804609597 804910719 805446744 805807889 805814087 805703640 805748641 805906534
2433.3 805906534 805944979 805719078 805329144 805055082 805032372 805087507 804965079 804584146 804098845 803750753
2453.7 803750753 803547442 803253055 802792788 802381098 802268863 802492678 802845120 803103924 803225636 803313494
2474.1 803313494 803464711 803584754 803418636 802912831 802320242 801895380 801647782 801378250 800945580 800508499
2494.5H00508499j20818K55346L42488J23203j14024j21593L8683Q0466j55568m76300
2514.9H00360382n67913l38436m768J17540l8087k12908j45674Q4401J69575j6868
2535.3G99407244k68579l14057j58548m9114j40727l39925m06742k21849J3173L7968
2555.6G97558844j49310l20792k54690n0188l8504l29077o72520p39276m70102j61528
2576G94372857j53482l81232m23848j86026p213o0200j89901j90019j1146J86741J62244
2598.5G93118775j40071m98414n99086l41416K8193J50740k5153j69098k0504K42472
2618.9G91746438K69472N365l22640m49658k97606p7009m1842j84119k66493j33991
2639.3G90247917J02878J83642j490k51115k82049q2195Q8632O1453o1870j01507k0623
$$ plain form
2494.5 800508499 800387681 800643027 800985515 801108718 800994694 800873101 800911784 800992250 800836682 800360382
2514.9 800360382 799792469 799454033 799449265 799566805 799528718 799315810 799170136 799254537 799424112 799407244
2535.3 799407244 799138665 798824608 798666060 798616946 798476219 798136294 797729552 797507703 797520876 797558844
2555.6 797558844 797409534 797088742 796834052 796783864 796745360 796416283 795743763 795004487 794534385 794372857
2576 794372857 794219375 793838143 793414295 793228269 793221056 793160856 792970955 792780936 792769790 792956531 793118775
2598.5 793118775 792978704 792480290 791881204 791539788 791567981 791718721 791693568 791524470 791503966 791746438
2618.9 791746438 792015910 792021275 791698635 791248977 790951371 790874362 790832520 790648401 790381908 790247917
2639.3 790247917 790350795 790534437 790532947 790281832 789999783 789917588 790006220 790067673 790005803 789904296 789883673
2661.7G89883673L3081j12474l64721m42326k77758n5015N3287k0743k12848l02195
2682.1G88181961j69635k3127r5546k65360k80023j33216J2100J7643j11699j75059
2702.5G86958039o5208N6625j4305k90513n45800n74410m33385k95401k85745l56257
2722.9G84153640l08096j44243k2412p0572l12686m70161k99811L3259J73390K4497
2743.3G82756805j48117j63674j05680j15811k53797m02272l69370j76012m4763j03057
2763.7G80874252k78115l84986k70009j908J47820L1173j67608k00451q7619l8266
2784.1G79624283j36614k73644l28601l08812l09228m11869o16669p23660n19037j37151
2804.5G75858998R1911K4020k00271l20852k75552k26200k76685l72886l50893j67668
$$ plain form
2661.7 789883673 789916754 789804280 789439559 788997233 788719475 788664460 788717747 788697004 788484156 788181961
2682.1 788181961 788012326 787989199 787893653 787628293 787348270 787215054 787227154 787244797 787133098 786958039
2702.5 786958039 786892831 786949456 786935151 786644638 786098838 785524428 785091043 784795642 784509897 784153640
2722.9 784153640 783845544 783701301 783678889 783608317 783295631 782825470 782525659 782558918 782732308 782756805
2743.3 782756805 782608688 782445014 782339334 782223523 781969726 781567454 781198084 781022072 780977309 780874252
2763.7 780874252 780596137 780211151 779941142 779939234 780087054 780118227 779950619 779750168 779662549 779624283
2784.1 779624283 779487669 779214025 778885424 778576612 778267384 777855515 777238846 776515186 775996149 775858998
2804.5 775858998 775950909 775974929 775774658 775453806 775178254 774952054 774675369 774302483 773951590 773783922
2824.9G73783922M6194K03490K57790J94788J05620L3617j42217m09365n95808o27160
2845.3G72850871n64575n13375m74751m37617l76940k14756p8260j26243k73228l89695
2865.7G69401431m07994k71499j01983j90914m47571n13375m12166l27468l45648n01155
2886.1G65881658o71685o58512m41492k38359j43468l7074P7247M6850j25528l31580
2906.5G63358057n03600n28514m36605l72588l62933m23968n58436o14762m89592l11852
2926.8G58755207k77996m48585o01768n04911k67565j09136j22130l31342o57082q70824
2947.2G54563868p12872k27928P7069K2173p0214j54793l20077n10276o30736n99384
2967.6G51436830m82977m31478n96225q48234p41303m19795m41671o64592p04467o32763
$$ plain form
2824.9 773783922 773830116 774033606 774291396 774486184 774591804 774625421 774483204 774073839 773478031 772850871
2845.3 772850871 772286296 771772921 771298170 770860553 770483613 770268857 770190597 770064354 769791126 769401431
2865.7 769401431 768993437 768721938 768619955 768429041 767981470 767468095 767055929 766728461 766382813 765881658
2886.1 765881658 765209973 764551461 764109969 763871610 763728142 763691068 763768315 763815165 763689637 763358057
2906.5 763358057 762854457 762325943 761889338 761516750 761153817 760729849 760171413 759556651 759067059 758755207
2926.8 758755207 758477211 758028626 757426858 756921947 756654382 756545246 756423116 756091774 755434692 754563868
2947.2 754563868 753850996 753623068 753700137 753722310 753652096 753497303 753177226 752666950 752036214 751436830
2967.6 751436830 750953853 750522375 749926150 749077916 748336613 747916818 747475147 746810555 746106088 745473325
2988G45473325o16371q10385j338244k096057k953410l770232m329026m377424l643752
3006.4G21538424k269268r53793m92752j345455l357709n645394o402910l820240Q88765
3024.7F98139668L754496K796888j041889n964696r400487q516252k471626N589783
3041.1F82885885J0148525Q707643N345047M862725N283118K892911j154184m172027
3057.4G14799643n499304n969822o379068n755305k080679M852175J1881709J4244020
3073.7G20093369J1124611O353319K475798o48737k970338l179550m01020L208161
3090G36055613M216611K373397j06752j563787j181543P97331K576471K665281J665950
3108.4G47498572R46045R52422J125098Q62300L15189j68323m14729l38078j63555
$$ plain form
2988 745473325 744856954 744046569 742708325 740612268 737658858 733888626 729559600 725182176 721538424
3006.4 721538424 719269156 718315363 717822611 716477156 713119447 707474053 701071143 697250903 698139668
3024.7 698139668 701894164 704691052 703649163 697684467 688283980 679767728 677296102 682885885
3041.1 682885885 693034410 701742053 707087100 711949825 717232943 720125854 718971670 714799643
3057.4 714799643 709300339 703330517 696951449 691196144 689115465 693967640 705849349 720093369
3073.7 720093369 731217980 737571299 740047097 739398360 736428022 733248472 732847452 736055613
3090 736055613 740272224 742645621 742538869 740975082 739793539 740590870 743167341 745832622 747498572
3108.4 747498572 748444617 749397039 750522137 751384437 751699626 751531303 751116574 750778496 750614941
3126.7G50614941j76251l44813m49955l95298k54691k33531m25041n13851l60489k16782
3147.1G47244239j17839p4207k25187l81410l81171m44890o89208r33588q50141l72231
3167.5G42774367M9651K7955k33949l57151l04877k86341m22657o13391o72579m64022
3187.9G39497006j07348M6790j67251n01215o34015n67496n14984n87583o72042o39141
3208.3G35152721n21540m48585n02765o01292o40452o31630o09934o14405o73234o73712
3228.7G29235172m95076l80218o11663q90016q95560p53999n64158m06802n21123q29935
3249.1G22886622q81970o20246m72963o41465q59439r07600p86543m95315j36494K6166
3269.5G17110753k18809n93006p02977o58751o44982o26504n18322l87848l42846l59296
$$ plain form
3126.7 750614941 750438690 750093877 749643922 749248624 748993933 748760402 748335361 747821510 747461021 747244239
3147.1 747244239 747126400 747052193 746827006 746445596 746064425 745619535 744930327 743996739 743146598 742774367
3167.5 742774367 742824018 742851973 742618024 742260873 741955996 741669655 741246998 740633607 739961028 739497006
3187.9 739497006 739389658 739436448 739269197 738767982 738133967 737566471 737051487 736463904 735791862 735152721
3208.3 735152721 734631181 734182596 733679831 733078539 732438087 731806457 731196523 730582118 729908884 729235172
3228.7 729235172 728740096 728359878 727748215 726858199 725962639 725208640 724644482 724237680 723716557 722886622
3249.1 722886622 722004652 721384406 720911443 720269978 719410539 718502939 717716396 717221081 717084587 717110753
3269.5 717110753 716891944 716298938 715595961 714937210 714292228 713665724 713147402 712759554 712416708 712057412
3289.9G12057412m91023p42436r12666r36866q82030p39216o38545p97748j099229
3308.2G04817653j249731j252651j258850j264334j198947j120925j108229j194597
3324.6F95169389j408398j555324j542449j596331j743317j870513k072930k380431
3340.9F80999696k731442l194511l668308l929675l848553l136575j675129j08838
3357.2F58706665O58631M83513O0499m9353j14798m67122q89778j226723j501203j653850
3377.6F54006481j722157j726806j628041j558483j548946j493573j443386j431584
3393.9F41453505j314700j083493j032234j278519j445174j270295j040279r40681
3410.2F32048130r16183j018584j048684q07166o20484o73712o68704m34756j96219
$$ plain form
3289.9 712057412 711566389 710823953 709911287 708974421 708092391 707353175 706714630 705916882 704817653
3308.2 704817653 703567922 702315271 701056421 699792087 698593140 697472215 696363986 695169389
3324.6 695169389 693760991 692205667 690663218 689066887 687323570 685453057 683380127 680999696
3340.9 680999696 678268254 675073743 671405435 667475760 663627207 660490632 658815503 658706665
3357.2 658706665 659365296 659848809 659909308 659859955 659745157 659278035 658388257 657161534 655660331 654006481
3377.6 654006481 652284324 650557518 648929477 647370994 645822048 644328475 642885089 641453505
3393.9 641453505 640138805 639055312 638023078 636744559 635299385 634029090 632988811 632048130
3410.2 632048130 631131947 630113363 629064679 628257513 627637029 626963317 626294613 625859857 625663638
3428.6F25663638k06053k24769j05560k09928m53472l83258o4373J87993K45870J84774
3449F24634862K31266L66390M48942N85675P06494O31750O89625R99689J036704N84662
3469.4F30916059J75715L00228O75380Q93951Q14259N54383N80012Q16346P65383N80788
3489.8F37072504O23822Q05616R12070Q54075P82311P65443O38247N65171P21216R18031
3510.2F44658506J029730R47237P84158Q19624R87709J104772R63747P24435P83145
3528.5F52803063R55761R88185J010657J013100J011252J195729J347780J175821Q32260
3546.9F62333608P43746R11713R84490R40323R92060J146555J169323J008928J016975
3565.2F71247721J280963J327574J145363J084626J143813J232028J390159J530111
$$ plain form
3428.6 625663638 625457585 625232816 625127256 624917328 624463856 624080598 624016225 624204218 624450088 624634862
3449 624634862 624866128 625232518 625681460 626267135 626973629 627605379 628295004 629294693 630331397 630916059
3469.4 630916059 631091774 631392002 632067382 632961333 633775592 634329975 634909987 635726333 636491716 637072504
3489.8 637072504 637696326 638501942 639414012 640268087 641050398 641815841 642454088 643019259 643740475 644658506
3510.2 644658506 645688236 646635473 647419631 648239255 649226964 650331736 651295483 652019918 652803063
3528.5 652803063 653758824 654747009 655757666 656770766 657782018 658977747 660325527 661501348 662333608
3546.9 662333608 663077354 663989067 664973557 665913880 666905940 668052495 669221818 670230746 671247721
3565.2 671247721 672528684 673856258 675001621 676086247 677230060 678462088 679852247 681382358
3581.5F81382358J516819J406074J308441J267493J232981J314879J480460J485765
3597.9F92395270J331627J221001J163364J117349J195430J213789J161933J200140
3614.2G01999903J146435J175046J234591R49562O65545O09696R15826J169085Q65639
3632.5G10731328P16447P37965O80328N57899L60728J41263N4776K02239J00970j26779
3652.9G14157164L27408J243353J453936Q85010L31938N7936m3630J5020J87337J45734
3673.3G18761206J79529K46882J25468J54615K16424K12193K78353K17676Q107L7551
3693.7G20438004N1558j34767k23755k2173J65999M2915k18749m15087l38554p8619
3714.1G19266772N6267P9513l934r3222k2530J21355R0181k7835N5432L61622N08666
$$ plain form
3581.5 681382358 682899177 684305251 685613692 686881185 688114166 689429045 690909505 692395270
3597.9 692395270 693726897 694947898 696111262 697228611 698424041 699637830 700799763 701999903
3614.2 701999903 703146338 704321384 705555975 706505537 707171082 707780778 708696604 709865689 710731328
3632.5 710731328 711447775 712185740 712866068 713423967 713784695 713925958 713980734 714182973 714283943 714157164
3652.9 714157164 714484572 715727925 717181861 718066871 718398809 718456745 718413115 718428135 718615472 718761206
3673.3 718761206 718940735 719187617 719313085 719467700 719684124 719896317 720174670 720392346 720400453 720438004
3693.7 720438004 720489562 720354795 720131040 720108867 720274866 720317781 720099032 719683945 719345391 719266772
3714.1 719266772 719323039 719402552 719398618 719305396 719282866 719404221 719494402 719466567 719521999 719883621 720392287
3736.5G20392287R2685n03421p55608l99113l1352k46524l03865R179J33217R3579
3756.9G18481064J06990J16468k4677j30355j20342r2447m8637p7724j28150n7519
3777.3G18024671K5034j03831k79069k57790j29521m9770r4354k72393l89755l23475
3797.7G16149747k01523m0710r0957l09348k92420k29120k66731k49684j70171k22147
3818.1G14076936l43621j94907m530M7148N0425J9252J16528K47955J33931j33574
3838.5G14015543k05040r4711j3173j11043l53039n86748n03301J45495K99096m9591
3858.9G12543488l20018l74436k27630j87040k34842j53482j58012k32279l24965m54724
3879.3G09876060m30226l18289l12984l86238l29196k2471J80185P5578j072K3186
$$ plain form
3736.5 720392287 720484972 719981551 719225943 718826830 718795478 718548954 718245089 718254268 718387485 718481064
3756.9 718481064 718588054 718704522 718679845 718549490 718429148 718336701 718288064 718210340 718082190 718024671
3777.3 718024671 718049705 717945874 717666805 717409015 717279494 717229724 717135370 716862977 716473222 716149747
3797.7 716149747 715948224 715907514 715816557 715507209 715214789 714985669 714718938 714469254 714299083 714076936
3818.1 714076936 713733315 713538408 713533878 713581026 713631451 713650703 713767231 714015186 714149117 714015543
3838.5 714015543 713810503 713715792 713702619 713591576 713238537 712651789 712148488 712293983 712593079 712543488
3858.9 712543488 712223470 711849034 711621404 711434364 711199522 711046040 710888028 710655749 710330784 709876060
3879.3 709876060 709445834 709127545 708814561 708428323 708099127 708076656 708256841 708332419 708331347 708354533
3899.7G08354533K3722O4671Q9765P15p0035j39296k44916j97947K7240J42693N9426
3922.1G08110571l2723p1406j26720j33932p8082p1287j24812j69277j52409k8193
3942.5G07121730Q5175O497r7990o6698m7386j13546j67072j65165j50919j31905q7142
3965G06185579p6472j30952j88112k18630k24173k18630k22504j76787p2241p8440
3985.4G04578638j98841k39253j95682j91808k25305k60055
3997.6G03267694
$$ plain form
3899.7 708354533 708378255 708442926 708532691 708533406 708463371 708324075 708079159 707881212 707908452 708051145 708110571
3922.1 708110571 708077848 708006442 707879722 707745790 707667708 707596421 707471609 707302332 707149923 707121730
3942.5 707121730 707206905 707213402 707115412 707048714 707001328 706887782 706720710 706555545 706404626 706272721 706185579
3965 706185579 706109107 705978155 705790043 705571413 705347240 705128610 704906106 704729319 704657078 704578638
3985.4 704578638 704379797 704140544 703944862 703753054 703527749 703267694
3997.6 703267694
##END=$$ End of the data block
