##TITLE=B8M - Leandro - Chalcona $$ Begin of the data block
##JCAMP-DX=5.00 $$ ACD/SpecManager v 10.08
##SPECTROMETER/DATA SYSTEM=Alpha
##DATE=13 Apr 2015 15:31:48
##DATA TYPE=INFRARED SPECTRUM
##DATA CLASS=XYDATA
##ORIGIN=
##OWNER=
##NPOINTS=1765
##FIRSTX=399.76428223
##LASTX=3997.64306641
##MAXX=3997.64306641
##MINX=399.76428223
##MAXY=0.84895301
##MINY=0.42526981
##XFACTOR=1.0000000000
##YFACTOR=1.000000000000000e-9
##FIRSTY=0.78629702
##DELTAX=2.03961372
##XUNITS=1/CM
##YUNITS=ARBITRARY UNITS
##XYDATA=(X++(Y..Y))
$$ plain form
399.8 786297023 783248246 780069530 782383084 783942878 780084908 778326988 781942487 783815682
416.1 783815682 781938851 782946289 785242379 782505274 778809786 780268013 781455636 776704609
432.4 776704609 772991359 775759816 777835250 775815487 776521087 780178189 779236376 775462985 776097775
450.8 776097775 778510034 776227593 772915304 774517357 775429606 771188438 768336296 769983828 769021153
469.1 769021153 763197660 759589493 758591592 752521634 741687059 731878519 720827878 703424513
485.4 703424513 684481025 679198444 700245023 737641275 769173145 786512613 790424049 785726786
501.7 785726786 782571971 783231318 780551493 774775565 772653937 772394419 767498016 760883927 759833336
520.1 759833336 761955261 762116849 763292730 768150210 770737290 768049359 766299069 768144488 767522454
$$ packed form
399.8G86297023l048777l178716K313554J559794l857970j757920L615499J873195
416.1G83815682j876831J007438K296090k737105l695488J458227J187623m751027
432.4G76704609l713250K768457K075434k019763P05600L657102r41813l773391O34790
450.8G76097775K412259k282441l312289J602053R12249m241168k852142J647532r62675
469.1G69021153n823493l608167r97901o069958j0834575r808540j1050641j7403365
485.4G03424513j8943488n282581K1046579L7396252L1531870J7339468L911436m697263
501.7G85726786l154815O59347k679825n775928k121628k59518m896403o614089j050591
520.1G59833336K121925J61588J175881M857480K587080k687931j750290J845419o22034
$$ plain form
538.5 767522454 763226449 761353910 761874199 758701324 752710640 749474287 746786177 738903165 727649987
556.8 727649987 716492593 701124787 678134620 655965328 648781598 664552867 699815512 740738511
573.1 740738511 771478176 784416854 785192907 784788370 785580933 783075809 778485417 776900172 776383400
591.5 776383400 772462368 768609464 769385278 770956039 768751562 766141951 766265273 765216887 760377109
609.8 760377109 754867017 749237239 743323922 743872762 753200293 761784315 762514293 759130478 757884622
628.2 757884622 758059561 755569339 751916647 750823200 750193834 746622801 742649317 741290748 739432931
646.6 739432931 734231889 728616297 724440098 718008101 707488954 695782185 683083236 665714324
662.9 665714324 645864129 633516788 640768588 653772950 663490176 674068749 678803980 668989837
$$ packed form
538.5G67522454m296005j872539N20289l172875n990684l236353k688110p883012j1253178
556.8G27649987j1157394j5367806k2990167k2169292p183730J5771269L5262645M0922999
573.1G40738511L0739665J2938678P76053m04537P92563k505124m590392j585245n16772
591.5G76383400l921032l852904P75814J570761k204477k609611J23322j048386m839778
609.8G60377109n510092n629778n913317N48840R327531Q584022P29978l383815j245856
628.2G57884622J74939k490222l652692j093447o29366l571033l973484j358569j857817
646.6G39432931n201042n615592m176199o431997j0519147j1706769j2698949j7368912
662.9F65714324j9850195j2347341P251800J3004362R717226J0578573M735231r814143
$$ plain form
679.2 668989837 644879460 607311547 558027625 516553998 513100326 553675950 614825547 673123360
695.5 673123360 718303204 747492373 761976361 766832292 770893514 779531300 787605524 788978994
711.8 788978994 786159277 782329738 775882483 767208457 759601891 752258539 741796553 728975117
728.1 728975117 716087937 700934529 679869175 652365923 616867900 567722321 505783439
742.4 505783439 450936168 431183696 457635880 519577503 596138299 667996824 724652290
756.7 724652290 764976740 794065118 816108167 830589592 838334382 843809903 848248601 848953009
773 848953009 846507907 843981922 839971185 830437064 815288484 799756229 790902078 791113436 799586773
791.4 799586773 814613521 828450263 834703982 836428404 837545931 836822748 833803952 831713259
$$ packed form
679.2F68989837k4110377l7567913m9283922m1473627l453672M0575624O1149597N8297813
695.5F73123360M5179844K9189169J4483988M855931M061222Q637786Q074224J373470
711.8G88978994k819717l829539o447255q674026p606566p343352j0461986j2821436
728.1G28975117j2887180j5153408k1065354k7503252l5498023m9145579o1938882
742.4E05783439n4847271j9752472K6452184O1941623P6560796P1858525N6655466
756.7G24652290M0324450K9088378K2043049J4481425P744790N475521M438698P04408
773H48953009k445102k525985m010737r534121j5148580j5532255q854151K11358Q473337
791.4G99586773J5026748J3836742O253719J724422J117527p23183l018796k090693
$$ plain form
807.7 831713259 831458986 830314755 828026354 827274382 827686071 826436937 824086905 823229134 822873294
826 822873294 820561886 817527711 815853059 813929558 809560418 804304123 800641418 798211336 795939624
844.4 795939624 793984890 791273892 785215259 776155293 767559767 758421898 743158042 724641263
860.7 724641263 720965505 744868577 780472994 804490030 814269245 816823483 815528333 813201010
877 813201010 812289059 811528265 808906913 805555642 802876472 800347984 798638403 799490929 801789582
895.4 801789582 802461445 800922215 799548745 799213827 798110008 795822561 794132411 793108642 790899098
913.7 790899098 787818432 785768032 784028292 780641198 776890576 775257826 774643779 772204340 768386006
932.1 768386006 766338408 767290115 769123018 769829035 769438326 767607808 764047205 760254085 757084310
$$ packed form
807.7H31713259k54273j144231k288401p51972M11689j249134k350032q57771l55840
826H22873294k311408l034175j674652j923501m369140n256295l662705k430082k271712
844.4G95939624j954734k710998o058633r059966q595526r137869j5263856j8516779
860.7G24641263l675758K3903072L5604417K4017036R779215K554238j295150k327323
877H13201010r11951p60794k621352l351271k679170k528488j709581Q52526K298653
895.4H01789582O71863j539230j373470l34918j103819k287447j690150j023769k209544
913.7G90899098l080666k050400j739740l387094l750622j632750o14047k439439l818334
932.1G68386006k047598R51707J832903P06017l90709j830518l560603l793120l169775
$$ plain form
950.5 757084310 753154278 747775316 742266655 736873686 729770184 719888985 707465768 691681445
966.8 691681445 672601759 654155254 639059961 624298751 611420035 615191340 644385278 682501137
983.1 682501137 706341267 709440887 697441757 677186728 657443643 649163485 656999111 680284441
999.4 680284441 711841106 733390987 734470546 719901979 694845438 660736799 622315466 597022653
1015.7 597022653 608708382 657224536 708845019 733401775 736088872 738111734 737714946 719619691
1032 719619691 693371236 686239421 707420528 741023242 769226611 787331939 797609866 802294433
1048.4 802294433 803755641 804293394 804186463 802660704 800165415 797537863 793921709 788063645 780402780
1066.7 780402780 772174418 764665902 760586202 762358248 767925560 772682011 774935961 776460469
$$ packed form
950.5G57084310l930032n378962n508661n392969p103502r881199j2423217j5784323
966.8F91681445j9079686j8446505j5095293j4761210j2878716L771305K9193938L8115859
983.1F82501137K3840130L099620j1999130k0255029j9743085q280158P835626K3285330
999.4F80284441L1556665K1549881J079559j4568567k5056541l4108639l8421333k5292813
1015.7E97022653J1685729M8516154N1620483K4556756K687097K022862l96788j8095255
1032G19619691k6248455p131815K1181107L3602714K8203369J8105328J0277927M684567
1048.4H02294433J461208N37753j06931j525759k495289k627552l616154n858064p660865
1066.7G80402780q228362p508516m079700J772046N567312M756451K253950J524508
$$ plain form
1083 776460469 779057980 782447100 785211027 786732256 786992431 785667181 783184230 781012654 779793203
1101.4 779793203 778943419 778469145 778947830 779820144 779850006 779160380 778835833 778762281 777918696 776479602
1121.8 776479602 775451005 774616838 773218095 771837056 771314800 770910800 769625545 767951310 766611636
1140.1 766611636 764989793 762282610 758650601 753467500 744800866 735123575 732280135 737599492
1156.5 737599492 743619680 746012330 745908022 744164824 740159154 733353734 723595858 710964739
1172.8 710964739 697558999 688066423 686378062 691713274 699011862 704564154 708542526 710883200
1189.1 710883200 709642708 704023063 695035100 683268607 668872237 653074443 638026118 625124872
1205.4 625124872 612736523 596314907 572698176 544211090 519522190 510565400 525661230
$$ packed form
1083G76460469K597511L389120K763927J521229K60175j325250k482951k171576j219451
1101.4G79793203q49784m74274M78685Q72314K9862o89626l24547p3552q43585j439094
1121.8G76479602j028597q34167j398743j381039n22256m04000j285255j674235j339674
1140.1G66611636j621843k707183l632009n183101q666634r677291k843440N319357
1156.5G37599492O020188K392650j04308j743198m005670o805420r757876j2631119
1172.8G10964739j3405740r492576j688361N335212P298588N552292L978372K340674
1189.1G10883200j240492n619645q987963j1766493j4396370j5797794j5048325j2901246
1205.4F25124872j2388349j6421616k3616731k8487086k4688900q956790J5095830
$$ plain form
1219.7 525661230 563787580 614895463 666329503 709563136 741273880 761649907 773789823
1234 773789823 781416714 786280930 788721979 789210260 788173854 785297751 780778050 776128650 772295058
1252.3 772295058 768691719 765047550 762085438 759707808 756763577 752972245 749071240 744919837
1268.6 744919837 739527822 732893646 725684881 716991186 704543114 687085748 665719330 645394862
1285 645394862 636995673 650784135 680929601 707461238 717598557 713887990 703231454 688351035
1301.3 688351035 669433475 647910774 626708210 609450221 602795541 617235899 654463589
1315.6 654463589 695932686 719269753 720247388 707782030 688806236 667002797 644081295 618320763
1331.9 618320763 588502049 558826685 537324846 533327997 552565575 591416955 639854252
$$ packed form
1219.7E25661230L8126350N1107883N1434040M3233633L1710744K0376027J2139916
1234G73789823P626891M864216K441049M88281j036406k876103m519701m649400l833592
1252.3G72295058l603339l644169k962112k377630k944231l791332l901005m151403
1268.6G44919837n392015o634176p208765q693695j2448072j7457366k1366418k0324468
1285F45394862q399189J3788462L0145466K6531637J0137319l710567j0656536j4880419
1301.3F88351035j8917560k1522701k1202564j7257989o654680J4440358L7227690
1315.6F54463589M1469097K3337067R77635j2465358j8975794k1803439k2921502k5760532
1331.9F18320763k9818714k9675364k1501839l996849J9237578L8851380M8437297
$$ plain form
1346.2 639854252 687469482 728529274 760726988 783864319 798982024 807134271 810330629 811163664
1362.5 811163664 810814023 809102893 806611776 804588318 802734852 799775541 796431839 793830633
1378.8 793830633 791169345 787785053 784957886 783633709 782483160 780468225 778445840 777611673
1395.1 777611673 777605593 777325451 777167737 777512729 777364731 776197731 775079787 774529457 773743451 772222579
1415.5 772222579 770422041 768436491 765874624 762554586 759214640 756190836 751918912 746217072
1431.8 746217072 739856660 729496419 712785423 693064213 666050136 627014279 585186779
1446.1 585186779 575721860 629578292 710675359 766334713 787286103 789881945 788324475 785864234
1462.4 785864234 782466292 779304862 776757479 773372293 768222749 762623906 757155955 752006888
$$ packed form
1346.2F39854252M7615230M1059792L2197714K3137331J5117705Q152247L196358Q33035
1362.5H11163664l49641j711130k491117k023458j853466k959311l343702k601206
1378.8G93830633k661288l384292k827167j324177j150549k014935k022385q34167
1395.1G77611673o080k80142j57714L44992j47998j167000j117944n50330p86006j520872
1415.5G72222579j800538j985550k561867l320038l339946l023804m271924n701840
1431.8G46217072o360412j0360241j6710996j9721210k7014077l9035857m1827500
1446.1E85186779r464919N3856432Q1097067N5659354K0951390K595842j557470k460241
1462.4G85864234l397942l161430k547383l385186n149544n598843n467951n149067
$$ plain form
1478.7 752006888 748833299 748129725 747811496 745090663 737913549 725022733 708612978 694387317
1495 694387317 697675884 723523080 746711075 755654633 756650329 755038023 753304780 752305806 752100527
1513.4 752100527 752044618 750830472 748544097 746213019 744074225 741180837 737635911 735045314 732702315
1531.8 732702315 728912652 725337982 723133922 720265567 715915561 711980343 708626091 704616666
1548.1 704616666 698739827 692220747 686366856 680537343 670511901 656879544 647247434 636448681
1564.4 636448681 621691763 602228820 576026857 550137639 534593463 545705914 584810078
1578.7 584810078 627021611 649729192 642111540 615106523 580008924 544896901 520357490
1593 520357490 508566797 499858081 484099835 459162116 433887511 425269812 446236283 496175200
$$ packed form
1478.7G52006888l173589p03574l18229k720833p177114j2890816j6409755j4225661
1495F94387317L288567K5847196K3187995Q943558R95696j612306j733243r98974k05279
1513.4G52100527n5909j214146k286375k331078k138794k893388l544926k590597k342999
1531.8G32702315l789663l574670k204060k868355m350006l935218l354252m009425
1548.1G04616666n876839o519080n853891n829513j0025442j3632357r632110j0798753
1564.4F36448681j4756918j9462943k6201963k5889218j5544176J1112451L9104164
1578.7E84810078M2211533K2707581p617652k7005017l5097599l5112023k4539411
1593E20357490j1790693q708716j5758246k4937719k5274605q617699K0966471M9938917
$$ plain form
1609.3 496175200 557583928 609635234 647850096 677392244 699766278 717617452 731392324
1623.5 731392324 738498390 739663780 736629903 731988192 726435900 716786623 704791486 694939613
1639.9 694939613 686690986 678591728 666923165 652138293 639519155 620081544 583720386 548769534
1656.2 548769534 513752103 480388194 471674502 503449559 559764087 628473938 696171701
1670.5 696171701 740236521 766446769 781929612 788502812 792118192 796006262 801249325 807769060
1686.8 807769060 815523148 823029876 827537239 829900801 831689060 832084775 830265105 829203367
1703.1 829203367 829811931 830255806 829274714 828028440 827480733 826444507 823666394 821452320 821307838
1721.5 821307838 821265340 820649147 820707440 821893692 822636366 821871102 821338117 821667314 821168661 819835246
$$ packed form
1609.3D96175200O1408728N2051306L8214862K9542148K2374034J7851174J3774872
1623.5G31392324P106066J165390l033877m641711n552292r649277j1995137r851873
1639.9F94939613q248627q099258j1668563j4784872j2619138j9437611l6361158l4950852
1656.2E48769534l5017431l3363909q713692L1775057N6314528O8709851O7697763
1670.5F96171701M4064820K6210248J5482843O573200L615380L888070N243063O519735
1686.8H07769060P754088P506728M507363K363562J788259L95715j819670j061738
1703.1H29203367O08564M43875r81092j246274n47707j036226k778113k214074j44482
1721.5H21307838m2498o16193N8293J186252P42674p65264n32985L29197m98653j333415
$$ plain form
1741.9 819835246 819296062 819265842 818305135 816345930 815077901 814399898 812823892 810831010 809807360
1760.2 809807360 808922827 807068944 804964542 803378165 801719308 798907936 796757638 796594083 796955287
1778.6 796955287 796918988 797498047 799239993 800645769 800882220 801048100 801834464 801954269 801037610
1796.9 801037610 800304532 800103903 799190640 797511995 796459496 796046793 794614553 791909873 789411068
1815.3 789411068 787465096 785598755 784389794 784679890 785687149 785966039 785843551 786524951 787494123
1833.6 787494123 787754059 788098514 789603293 791355550 792020857 792275965 793116629 793632030 793237686
1852 793237686 793075383 793858349 794402838 793959677 793627799 794004560 793965757 792896926 792064428 791907549
1872.4 791907549 791128814 789569199 788463354 787869036 786642134 784969330 784169078 783988118 783016503
$$ packed form
1741.9H19835246n39184l0220r60707j959205j268029o78003j576006j992882j023650
1760.2H09807360q84533j853883k104402j586377j658857k811372k150298j63555L61204
1778.6G96955287l6299N79059J741946J405776K36451J65880P86364J19805r16659
1796.9H01037610p33078k00629r13263j678645j052499m12703j432240k704680k498805
1815.3G89411068j945972j866341j208961K90096J007259K78890j22488O81400R69172
1833.6G87494123K59936L44455J504779J752257O65307K55108Q40664N15401l94344
1852G93237686j62303P82966N44489m43161l31878L76761l8803j068831q32498j56879
1872.4G91907549p78735j559615j105845n94318j226902j672804q00252j80960r71615
$$ plain form
1890.7 783016503 781343579 779845655 778193235 775756359 773359001 772201896 771975696 771963596 772719264
1909.1 772719264 774614453 776414216 777221859 777851820 778997064 779705644 779514670 779759467 781123698
1927.5 781123698 782393813 782788515 783107102 783678710 783580422 782611072 781692028 780996621 779665291
1945.8 779665291 777824581 776630521 776043475 774926782 773271978 771859646 770238698 767562449
1962.1 767562449 764813185 763731956 764281929 765228271 766480803 768446684 770287812 771173120 771860421
1980.5 771860421 773177624 774449766 774983227 775478005 776504993 777309299 777416289 777582228 778121710
1998.8 778121710 778188825 777480364 776917040 776845992 776506007 775815427 775654972 776082039 776179552 775782764
2019.2 775782764 775553584 775278628 774339914 773437679 773378134 773623228 773619413 773857892 774731159 775439620
$$ packed form
1890.7G83016503j672924j497924j652420k436876k397358j157105k26200j2100P55668
1909.1G72719264J895189J799763Q07643O29961J145244P08580j90974K44797J364231
1927.5G81123698J270115L94702L18587N71608r8288r69350r19044o95407j331330
1945.8G79665291j840710j194060n87046j116693j654804j412332j620948k676249
1962.1G67562449k749264j081229N49973R46342J252532J965881J841128Q85308O87301
1980.5G71860421J317203J272142N33461M94778J026988Q04306J06990J65939N39482
1998.8G78121710O7115p08461n63324p1048l39985o90580j60455M27067R7513l96788
2019.2G75782764k29180k74956r38714r02235n9545K45094l815K38479Q73267P08461
$$ plain form
2039.6 775439620 775192201 774573088 774360120 774100244 773326039 772799850 773106456 773457170 773189545 772922933
2060 772922933 773119032 773096383 772488177 772077024 772186875 772059798 771489501 771266460 771530986 771498322
2080.4 771498322 771101713 771062911 771315157 771100521 770544469 770419538 770566344 770240307 769684076 769660234
2100.8 769660234 769899130 769682944 769333959 769518733 769817889 769584298 769262075 769396126 769461215 768970072
2121.2 768970072 768507659 768541515 768492401 768006504 767781794 768167615 768419981 768178642 768122971 768466175
2141.6 768466175 768491626 768055499 767880619 768038511 767800212 767179668 766944528 767068565 766838133 766387343
2162 766387343 766399980 766613781 766329348 765895903 766020238 766279638 765976131 765522540 765534401 765588343
2182.4 765588343 765165627 764771283 764870882 764900625 764424860 764026999 764120698 764113307 763657391 763395429
$$ packed form
2039.6G75439620k47419o19113k12968k59876p74205n26189L06606L50714k67625k66612
2060G72922933J96099k2649o08206m11153J09851j27077n70297k23041K64526l2664
2080.4G71498322l96609l8802K52246k14636n56052j24931J46806l26037n56231k3842
2100.8G69660234K38896k16186l48985J84774K99156k33591l22223J34051O5089m91143
2121.2G68970072m62413L3856m9114m85897k24710L85821K52366k41339n5671L43204
2141.6G68466175K5451m36127j74880J57892k38299o20544k35140J24037k30432m50790
2162G66387343J2637K13801k84433m33445J24335K59400l03507m53591J1861N3942
2182.4G65588343m22716l94344R9599K9743m75765l97861R3699p391m55916k61962
$$ plain form
2202.8 763395429 763591230 763537645 763010740 762714446 762822807 762654901 762120724 761918485 762066603 761834919
2223.2 761834919 761249900 761040747 761122465 760830939 760401726 760505617 760803461 760572433 760131657 760141373
2243.6 760141373 760229886 759807348 759328306 759369552 759451926 759032369 758606970 758628309 758535087 757981360
2264 757981360 757641613 757832706 757879913 757509172 757335424 757544160 757477820 757014155 756885290 757168531
2284.4 757168531 757106364 756649971 756505430 756655753 756436229 755955100 755874336 755975366 755541742 754767418
2304.8 754767418 754286647 753848314 752872467 751796544 751391053 751359522 751020849 750599504 750552833 750406086
2325.2 750406086 749642849 748789251 748381257 747943103 747134030 746597111 746765971 747037411 747055411 747630239
2345.6 747630239 748782158 749262035 748605072 747648120 747172713 746756077 746337414 746568859 747230589
$$ packed form
2202.8G63395429J95801n3585n26905k96294J08361j67906n34177k02239J48118k31684
2223.2G61834919n85019k09153Q1718k91526m29213J03891K97844k31028m40776R716
2243.6G60141373Q8513m22538m79042M1246Q2374m19557m25399K1339r3222n53727
2264G57981360l39747J91093M7207l70741j73748K08736o6340m63665j28865K83241
2284.4G57168531o2167m56393j44541J50323k19524m81129q0764J01030m33624p74324
2304.8G54767418m80771m38333r75847j075923m05491l1531l38673m21345m6671j46747
2325.2G50406086p63237q53598m07994m38154q09073n36919J68860K71440J8000N74828
2345.6G47630239J151919M79877o56963r56952m75407m16636m18663K31445O61730
$$ plain form
2363.9 747230589 747520208 747584760 748047471 748655140 748862565 749057174 749728024 750364065 750434339 750389576
2384.3 750389576 750745475 751075506 750881851 750622034 750771940 750848114 750441015 750096917 750194252 750160277
2404.7 750160277 749687970 749407411 749562502 749498188 749022424 748775423 748909652 748809397 748389781 748261094
2425.1 748261094 748439372 748300552 747876465 747808218 748034716 747973382 747762263 747933388 748222649 748054206
2445.5 748054206 747708678 747690022 747679889 747254431 746787906 746681631 746536374 745996416 745560646 745644510
2465.9 745644510 745754600 745477736 745262623 745386422 745320320 744801223 744361281 744266331 744050622 743584037
2486.3 743584037 743374467 743466139 743307531 742852330 742605805 742560148 742230237 741727054 741613328 741796255
2506.7 741796255 741751969 741576612 741682708 741854429 741645455 741320431 741350770 741458535 741220236 740927935
$$ packed form
2363.9G47230589K89619O4552M62711O07669K07425J94609O70850O36041P0274m4763
2384.3G50389576L55899L30031j93655k59817J49906P6174m07099l44098R7335l3975
2404.7G50160277m72307k80559J55091o4314m75764k47001J34229j00255m19616j28687
2425.1G48261094J78278j38820m24087o8247K26498o1334k11119J71125K89261j68443
2445.5G48054206l45528j8656j0133m25458m66525j06275j45257n39958m35770Q3864
2465.9G45644510J10090k76864k15113J23799o6102n19097m39942r4950k15709m66585
2486.3G43584037k09570R1672j58608m55201k46525m5657l29911n03183j13726J82927
2506.7G41796255m4286j75357J06096J71721k08974l25024L0339J07765k38299k92301
$$ plain form
2527.1 740927935 740960658 741060495 740933359 740862191 741067231 741146803 740840137 740535378 740451038 740265131
2547.5 740265131 739877760 739666522 739738822 739706814 739442766 739261329 739213884 738981009 738552928 738282204
2567.9 738282204 738168836 737873375 737480879 737375081 737426043 737176716 736653984 736184776 735658944 734848917
2588.3 734848917 734149039 734059632 734330058 734428525 734375417 734420240 734389484 734012306 733477652 733121514
2608.7 733121514 732894719 732606649 732389867 732439280 732600391 732709885 732958019 733462214 733929873 734147847
2629.1 734147847 734325528 734582365 734680414 734557569 734508634 734625041 734676242 734628260 734669268 734799445
2649.5 734799445 734812260 734679759 734597385 734554946 734356880 734084725 733981252 733967841 733778298 733453095
2669.9 733453095 733249903 733169675 733083844 733113587 733371973 733623028 733606756 733419597 733248413 733026385
$$ packed form
2527.1G40927935L2723R9837j27136p1168K05040P9572l06666l04759q4340j85907
2547.5G40265131l87371k11238P2300l2008k64048j81437m7445k32875m28081k70724
2567.9G38282204j13368k95461l92496j05798N0962k49327n22732m69208n25832q10027
2588.3G34848917o99878q9407K70426R8467n3108M4823l0756l77178n34654l56138
2608.7G33121514k26795k88070k16782M9413J61111J09494K48134N04195M67659K17974
2629.1G34147847J77681K56837R8049j22845m8935J16407N1201m7982M1008J30177
2649.5G34799445J2815j32501q2374m2439j98066k72155j03473j3411j89543l25203
2669.9G33453095k03192q0228q5831K9743K58386K51055j6272j87159j71184k22028
$$ plain form
2690.3 733026385 732654750 732276261 732025266 731761098 731345415 730913341 730609655 730349898 730092227 730045557
2710.7 730045557 730291486 730542600 730590522 730573416 730576336 730476618 730273783 730048239 729785323 729491293
2731.1 729491293 729234278 729090869 728991449 728759766 728435397 728231847 728154123 727973640 727597415 727201641
2751.4 727201641 726955652 726818681 726726651 726697445 726630569 726352215 725892425 725458324 725144327 724907696
2771.8 724907696 724745333 724602699 724367082 724066436 723813653 723653316 723525047 723294437 722881019 722371578
2792.2 722371578 721894801 721482933 721114576 720737278 720320821 719907522 719645023 719682097 719923973 720216513
2812.6 720216513 720580220 721005917 721349001 721543670 721708596 721880615 721899807 721739531 721592307 721527398
2833 721527398 721438587 721308053 721122265 720765054 720232308 719694436 719266772 718825221 718280911 717795670
$$ packed form
2690.3G33026385l71635l78489k50995k64168m15683m32074l03686k59757k57671m6670
2710.7G30045557K45929K51114M7922j7106K920r9718k02835k25544k62916k94030
2731.1G29491293k57015j43409r9420k31683l24369k03550p7724j80483l76225l95774
2751.4G27201641k45989j36971r2030k9206o6876k78354m59790m34101l13997k36631
2771.8G24907696j62363j42634k35617l00646k52783j60337j28269k30610m13418n09441
2792.2G22371578m76777m11868l68357l77298m16457m13299k62499L7074K41876K92540
2812.6G20216513L63707M25697L43084J94669J64926J72019J9192j60276j47224o4909
2833G21527398q8811j30534j85788l57211n32746n37872m27664m41551n44310m85241
$$ plain form
2853.4 717795670 717511594 717374861 717212081 716955900 716741204 716589034 716335356 716040790 715893567 715711176
2873.8 715711176 715244412 714691460 714310586 714048862 713800550 713571429 713410437 713293374 713142931 712962091
2894.2 712962091 712725520 712279379 711613536 710979223 710526407 710113406 709650159 709324360 709156513 708751261
2914.6 708751261 707943141 707059085 706374288 705915689 705654323 705639362 705794871 705812514 705725372 705905616
2935 705905616 706342280 706753254 707173645 707722962 708140969 708122909 707846522 707685232 707504451 707012355
2955.4 707012355 706423342 706032753 705755174 705380321 704928756 704525650 704121113 703710735 703479528 703465283
2975.8 703465283 703498840 703416169 703130007 702644527 701963544 701110244 700209200 699093878 697242081 694547653
2996.2 694547653 691646755 689713657 689736903 691285074 692855000 693399608 692618310 690532029 687528074
$$ packed form
2853.4G17795670k84076j36733j62780k56181k14696j52170k53678k94566j47223j82391
2873.8G15711176m66764n52952l80874k61724k48312k29121j60992j17063j50443j80840
2894.2G12962091k36571m46141o65843o34313m52816m13001m63247l25799j67847m05252
2914.6G08751261q08120q84056o84797m58599k61366j4961J55509J7643q7142J80244
2935G05905616M36664M10974M20391N49317M18007j8060k76387j61290j80781m92096
2955.4G07012355n89013l90589k77579l74853m51565m03106m04537m10378k31207j4245
2975.8G03465283L3557q2671k86162m85480o80983q53300r01044j115322j851797k694428
2996.2F94547653k900898j933098K3246J548171J569926N44608p81298k086281l003955
$$ plain form
3014.5 687528074 684394717 681774735 679780722 678388298 677652419 677496970 677574456 677615881 677704811
3032.9 677704811 677599251 677008629 676517963 676798940 677564204 677686274 676069379 672457755 667266726
3051.3 667266726 661138892 655067503 650366962 648503184 651149333 658882022 669435561 679157019
3067.6 679157019 686046660 690242410 692599535 693737090 694035172 693918765 693958819 694650471 696003258
3085.9 696003258 697560430 698791444 699405789 699439406 698971808 698013008 696813464 696029544 696352184
3104.3 696352184 697816610 699732661 701354086 702436149 703082740 703425407 703570604 703453779 703055203
3122.6 703055203 702673495 702487409 702331305 702045560 701699555 701449335 701272249 701033235 700699329 700287104
3143 700287104 699715495 698941052 698194683 697757721 697643578 697737455 697951496 698069096 697804928 697183907
$$ packed form
3014.5F87528074l133357k619982j994013j392424p35879j55449P7486M1425Q8930
3032.9F77704811j05560n90622m90666K80977P65264J22070j616895l611624n191029
3051.3F67266726o127834o071389m700541j863778K646149P732689J0553539R721458
3067.6F79157019O889641M195750K357125J137555K98082j16407M0054O91652J352787
3085.9F96003258J557172J231014O14345L3617m67598r58800j199544p83920L22640
3104.3F96352184J464426J916051J621425J082063O46591L42667J45197j16825l98576
3122.6G03055203l81708j86086j56104k85745l46005k50220j77086k39014l33906m12225
3143G00287104n71609p74443p46369m36962j14143R3877K14041J17600k64168o21021
$$ plain form
3163.4 697183907 696488678 695842683 695225179 694752514 694548845 694480598 694327891 694067895 693767011 693341315
3183.8 693341315 692676961 691904247 691250324 690743446 690320551 690065801 690057576 690133750 690114081 690016747
3204.2 690016747 689877152 689584076 689061224 688466668 687909067 687236786 686364651 685440183 684542775 683535159
3224.6 683535159 682348132 681200027 680389225 679899037 679466307 679054618 678757727 678450704 678019583
3243 678019583 677471936 676663876 675607085 674789429 674501300 674392700 674023509 673492968 673193038 673161507
3263.4 673161507 673238158 673438013 673720896 673753440 673349023 672755957 672218263 671766162 671338320 670912564
3283.8 670912564 670501113 670030117 669505358 669008493 668456435 667697310 666725159 665744960 664904177 664015770
3304.2 664015770 662810087 661282361 659612238 658006847 656790197 656229675 656212151 656334519 656277537
$$ packed form
3163.4F97183907o95229o45995o17504m72665k03669o8247j52707k59996l00884m25696
3183.8F93341315o64354p72714o53923n06878m22895k54750q225P6174j9669r7334
3204.2F90016747j39595k93076n22852n94556n57601o72281q72135r24468q97408j007616
3224.6F83535159j187027j148105q10802m90188m32730m11689k96891l07023m31121
3243F78019583n47647q08060j056791q17656k88129j08600l69191n30541k99930l1531
3263.4F73161507P6651J99855K82883L2544m04417n93066n37694m52101m27842m25756
3283.8F70912564m11451m70996n24759m96865n52058p59125r72151r80199q40783q88407
3304.2F64015770j205683j527726j670123j605391j216650n60522j7524J22368n6982
$$ plain form
3322.5 656277537 655936480 655262172 654280901 653134286 651925027 650639892 649264395 647807837 646293938
3340.9 646293938 644731343 643069267 641490042 640195131 638810515 636983216 635021865 633270085
3357.2 633270085 631659508 629981875 628295898 626842439 625460148 623710990 621537447 619370759
3373.5 619370759 617542803 615967631 614497125 613005042 611434400 609955072 608825147 608079553
3389.8 608079553 607230842 605938435 604656279 603836894 603187680 602094829 600623667 599427879 598684132
3408.2 598684132 598069787 597349286 596432269 595431328 594642699 594094098 593601704 593201399 593052864
3426.5 593052864 593090892 593018770 592861652 592873812 592822433 592413902 592002869 592023313 592354298 592642248
3446.9 592642248 592796862 593002021 593380094 593906462 594600856 595425606 596092522 596609354 597412646 598458707
$$ packed form
3322.5F56277537l41057o74308r81271j146615j209259j285135j375497j456558j513899
3340.9F46293938j562595j662076j579225j294911j384616j827299j961351j751780
3357.2F33270085j610577j677633j685977j453459j382291j749158k173543k166688
3373.5F19370759j827956j575172j470506j492083j570642j479328j129925p45594
3389.8F08079553q48711j292407j282156q19385o49214j092851j471162j195788p43747
3408.2E98684132o14345p20501r17017j000941p88629n48601m92394m00305j48535
3426.5E93052864L8028p2122j57118J2160n1379m08531m11033K0444L30985K87950
3446.9E92642248J54614K05159L78073N26368O94394Q24750O66916N16832Q03292J046061
$$ plain form
3467.3 598458707 599144280 599321425 599554300 600193799 601074576 601857603 602361679 602891564 603679061 604454339
3487.7 604454339 605132937 605926156 606778085 607545435 608277857 609114707 610014677 610696912 611240923 611983001
3508.1 611983001 612942994 614013314 615039885 615895987 616677880 617601454 618758440 619827211 620543659
3526.5 620543659 621198833 622087240 623175502 624374270 625547826 626603127 627691388 628856421 629875362
3544.8 629875362 630625486 631318986 632146418 633101881 634156227 635241985 636306524 637321770 638201773
3563.2 638201773 638980627 639976799 641284227 642525017 643554509 644537449 645645916 646992743 648510933
3581.5 648510933 649998903 651291609 652384460 653550863 654819489 656064987 657409251 658897579
3597.9 658897579 660350740 661728024 663032055 664097965 664997220 666018605 667144716 668278575
$$ packed form
3467.3E98458707O85573J77145K32875O39499Q80777P83027N04076N29885P87497P75278
3487.7F04454339O78598P93219Q51929P67350P32422Q36850Q99970O82235N44011P42078
3508.1F11983001R59993J070320J026571Q56102P81893R23574J156986J068771P16448
3526.5F20543659O55174Q88407J088262J198768J173556J055301J088261J165033J018941
3544.8F29875362P50124O93500Q27432R55463J054346J085758J064539J015246Q80003
3563.2F38201773P78854R96172J307428J240790J029492R82940J108467J346827J518190
3581.5F48510933J487970J292706J092851J166403J268626J245498J344264J488328
3597.9F58897579J453161J377284J304031J065910Q99255J021385J126111J133859
$$ plain form
3614.2 668278575 669345260 670366108 671553433 672714531 673646867 674343467 674886346 675688744 676602900
3632.5 676602900 677309036 677812755 678131640 678379774 678740263 679101229 679241776 679537773 680463374 681432009
3652.9 681432009 682102740 682877183 683750927 684198737 684297025 684482396 684646010 684480608 684367537 684344709
3673.3 684344709 684049249 683995783 684322476 684739232 685205758 685605407 685807824 685772181 685731649 685882032
3693.7 685882032 686091900 686228275 686224997 686161458 686297715 686535656 686590254 686386347 686205745 686302662
3714.1 686302662 686362565 686229646 686096668 686065853 686029732 686068177 686340868 686664045 686802924 686733127
3734.5 686733127 686734259 686941385 686995208 686597228 686229765 686456382 686470866 686018765 685904622 686153710
3754.9 686153710 686289966 686268330 686368823 686489522 686412215 686260104 686099529 686046720 686181426 686382651
$$ packed form
3614.2F68278575J066685J020848J187325J161098R32336O96600N42879Q02398R14156
3632.5F76602900P06136N03719L18885K48134L60489L60966J40547K95997R25601R68635
3652.9F81432009O70731P74443Q73744M47810R8288J85371J63614j65402j13071k2828
3673.3F84344709k95460n3466L26693M16756M66526L99649K02417l5643m0532J50383
3693.7F85882032K09868J36375l278o3539J36257K37941N4598k03907j80602R6917
3714.1F86302662N9903j32919j32978l0815l6121L8445K72691L23177J38879o9797
3734.5F86733127J132K07126N3823l97980l67463K26617J4484m52101j14143K49088
3754.9F86153710J36256k1636J00493J20699p7307j52111j60575n2809J34706K01225
$$ plain form
3775.3 686382651 686525166 686425626 686085701 685735404 685559571 685575962 685662091 685741246 685712099 685558259
3795.7 685558259 685435176 685194254 684885144 684835672 684719563 684594750 684734821 684852898 684672058 684398413
3816.1 684398413 684353769 684131563 683878541 683988512 684081316 684010327 683851838 683758736 683785796 683591187
3836.5 683591187 683183968 683020175 682973027 682874262 682837486 682814538 682484627 681701243 681519568 682077706
3856.9 682077706 682404518 682330728 682040811 681861639 681828737 681691110 681616485 681613922 681568742 681548059 681419790
3879.3 681419790 681310713 681262374 681156933 681180954 681126833 680877626 680791020 680807590 680663586 680395067
3899.7 680395067 680154979 680020452 680009127 680033445 679999590 679978073 679970324 679875374 679795146 679789662 679689586
3922.1 679689586 679478407 679357231 679359198 679332852 679278970 679261625 679175496 678972781 678703964 678415179 678201973
$$ packed form
3775.3F86382651J42515r9540l39925l50297j75833J6391Q6129P9155k9147j53840
3795.7F85558259j23083k40922l09110m9472j16109j24813J40071J18077j80840k73645
3816.1F84398413m4644k22206k53022J09971R2804p0989j58489r3102K7060j94609
3836.5F83591187m07219j63793m7148r8765l6776k2948l29911p83384j81675N58138
3856.9F82077706L26812p3790k89917j79172l2902j37627p4625k563m5180k0683j28269
3879.3F81419790j09077m8339j05441K4021n4121k49207q6606J6570j44004k68519
3899.7F80395067k40088j34527j1325K4318l3855k1517p749r4950q0228n484j00076
3922.1F79689586k11179j21176J967k6346n3882j7345q6129k02715k68817k88785k13206
$$ plain form
3944.6 678201973 678076029 677981555 677878618 677725255 677545309 677428007 677434623 677538991 677684188 677814662
3965 677814662 677878737 677881420 677875221 677842557 677749753 677620232 677470863 677375019 677363276 677292824 677090228 676834464
3989.5 676834464 676600814 676414847 676270187 676210999
3997.6 676210999
$$ packed form
3944.6F78201973j25944r4474j02937j53363j79946j17302O616J04368J45197J30474
3965F77814662O4075K683o199l2664r2804j29521j49369r5844j1743p0452k02596k55764
3989.5F76834464k33650j85967j44660n9188
3997.6F76210999
##END=$$ End of the data block
