##TITLE=B8M - Joseane 2 $$ Begin of the data block
##JCAMP-DX=5.00 $$ ACD/SpecManager v 10.08
##SPECTROMETER/DATA SYSTEM=Alpha
##DATE=23 Jun 2015 08:35:04
##DATA TYPE=INFRARED SPECTRUM
##DATA CLASS=XYDATA
##ORIGIN=
##OWNER=
##NPOINTS=1765
##FIRSTX=399.76428223
##LASTX=3997.64306641
##MAXX=3997.64306641
##MINX=399.76428223
##MAXY=0.86245626
##MINY=0.62452376
##XFACTOR=1.0000000000
##YFACTOR=1.000000000000000e-9
##FIRSTY=0.84456688
##DELTAX=2.03961372
##XUNITS=1/CM
##YUNITS=ARBITRARY UNITS
##XYDATA=(X++(Y..Y))
399.8H44566882N90682M395783J340210k639234K15650J961767l314733o019116k24888
418.1H40873003L984153M89652Q53658M321218K047181k729953j411974K335787J47581
436.5H50910306l007770J57714K876759j004219l506839K31623J888097j714767k264201
454.8H44566703J993179K316833k148569k089560J590729M22358l648400k900362j314521
473.2H38788390m852712n029023K687335O492734O17624m810810m799605p302701j1539102
491.5H10252130l238916J3817548J7536045O988644J13547J263916R45330k402663
507.9H45275581k090752R26673k24113m464746o129741n663336n129397j508414N442857
526.2H26434612P988990L334522n50568Q76963K300918l05653k454936j862645k885938
$$ plain form
399.8 844566882 845157564 849553347 850893557 848254323 848469973 850431740 847117007 841097891 840873003
418.1 840873003 844857156 845346808 846200466 850521684 852568865 849838912 848426938 850762725 850910306
436.5 850910306 847902536 848060250 850937009 849932790 846425951 846657574 848545671 846830904 844566703
454.8 844566703 846559882 848876715 846728146 844638586 846229315 846651673 843003273 840102911 838788390
473.2 838788390 833935678 828906655 831593990 838086724 838704348 833893538 829093933 821791232 810252130
491.5 810252130 807013214 820830762 838366807 845355451 845468998 846732914 847678244 845275581
507.9 845275581 843184829 844111502 843887389 839422643 833292902 827629566 822500169 820991755 826434612
526.2 826434612 834423602 837758124 837207556 838084519 840385437 840079784 837624848 835762203 832876265
544.6H32876265l916979M2379M396021L177405j091659k907813k800643l876686j949251
562.9H23949039M321396O757856K687931j618743j552105N36501K2531j871050j031756
581.3H32201600R24528M4226j652479m88758J168609n4360j471877r0301J019001p68125
601.7H30832064k179861q45909r6977j949549l109455k146959k753735o277978r822130
620H01649511j4947117k5794088k8272450r75371L1920076L1553447J4565110J0623455
636.4H20322573J2376964P337749p49588n293131n728185k327204M653931R455264
652.7H40048373P506668J721084k413570k491892j170456j389563l322184n164266
669H33324194m546583n770683q768261j2169480j6698479j7463089p832884Q458137
$$ plain form
544.6 832876265 828959286 829001665 833397686 836575091 835483432 832575619 829774976 825898290 823949039
562.9 823949039 828270435 835028291 837716222 836097479 834545374 835081875 835104406 833233356 832201600
581.3 832201600 833126128 833170354 831517875 831029117 832197726 832143366 830671489 830581188 831600189 830832064
601.7 830832064 828652203 827806294 827709317 825759768 822650313 820503354 817749619 811471641 801649511
620 801649511 786702394 760908306 732635856 731660485 763580561 795134008 809699118 820322573
636.4 820322573 832699537 840037286 839287698 833994567 828266382 825939178 830593109 840048373
652.7 840048373 847555041 849276125 846862555 844370663 843200207 841810644 838488460 833324194
669 833324194 828777611 823006928 814238667 802069187 785370708 767907619 760074735 768532872
685.3G68532872J9657791J8932223J0651827K947211k206862n777120q009732r123206
701.6G95605004o770075o268978j7069161k2711038n552709J7468989K7443707K4904489
717.9H07050228J6325891P800579L496528K552509J273036j026213k039969j534760
734.3H33897829j572490k539992l004909j879096L00050J664758K011001J906157M64022
752.6H31247330j414597j527608q41558j662373l164470l274501l070295m654646p050156
771H04587126q392334j0163963j3882101j4778912p817864M90725K19643p049382j1960029
789.3G31252909o918669O022155J6829312K0419240K1131873K1729350J7726243R367823
805.6H37560236J937986l368914o391287p088006q104801j1039793j3576985j3085246
$$ plain form
685.3 768532872 788190663 807122886 817774713 820721924 818515062 812737942 804728210 795605004
701.6 795605004 788834929 782565951 765496790 742785752 737233043 754702032 782145739 807050228
717.9 807050228 823376119 831176698 834673226 837225735 838498771 837472558 835432589 833897829
734.3 833897829 832325339 829785347 826780438 824901342 825201392 826866150 828877151 830783308 831247330
752.6 831247330 829832733 828305125 827463567 825801194 822636724 819362223 816291928 811637282 804587126
771 804587126 796194792 786030829 772148728 757369816 749551952 750042677 750262320 743212938 731252909
789.3 731252909 724334240 730356395 747185707 767604947 788736820 810466170 828192413 837560236
805.6 837560236 839498222 836129308 829738021 822650015 814545214 803505421 789928436 776843190
822G76843190r076834j625478Q070111J5253604J5118420R261489L952742K108395
838.3H19905639J339733o6280n05388N40733P80046m01139q15034j1921j99437j539349
858.7H19027603j575291k58446k36035j735568k385735l072500p411957j2504280j0138035
877G79709756n06222R399891J5465558J5729129J1554003O581306L109276K408326
893.4H43451023L087819K469420J221717J575112K383709J395404J8954N33045J425981
911.7H57562184N16415n45323K58923J115441O9678r07839L5942Q19266k39790r63747
932.1H57721150J22964P13706n30123j229585j10328M24862p29620j140714J25110
950.5H55367422N76317o66260j139641j63913k12252j625061j562238K38061O26326
$$ plain form
822 776843190 767766356 766140878 774210989 789464593 804583013 813844502 817797244 819905639
838.3 819905639 821245372 821179092 820673704 821214437 821994483 821593344 820778310 820766389 820566952 819027603
858.7 819027603 817452312 817193866 816957831 815222263 812836528 809764028 802352071 789847791 779709756
877 779709756 779203534 788603425 804068983 819798112 831352115 837933421 841042697 843451023
893.4 843451023 846538842 849008262 850229979 851805091 854188800 855584204 855603158 856136203 857562184
911.7 857562184 858078599 857533276 857792199 858907640 858977318 858069479 858105421 858924687 858684897 857721150
932.1 857721150 857844114 858557820 858027697 856798112 856687784 857112646 856383026 855242312 855367422
950.5 855367422 855943739 855277479 854137838 853973925 853761673 852136612 850574374 850812435 851438761
968.8H51438761q59738j121401O80267J633048N11706j76489L81649n5135j344204
987.2H51088464j108169J08719j91808j433373j226186k10822m84467j268327p48396
1005.5H44525635k4259q56399j896203j236081n71787k715528o261886m875123L163993
1023.9H29252362P882536M450082P02858k45988j340091k122462j216471l17693r74893
1042.2H36070240j622260j010597p70330k053917l148794k954781l255606n093574
1058.6H16160381o301820n124867k912343j427889j016617k182603n684018j0806620
1074.9G80703604j5469491j6548991q202255J1534214K8963446K8811455J5813649
1089.2H25605631L817201j906217l993272m882932l386855O98209L700733K675354
$$ plain form
968.8 851438761 850579023 849457622 850137889 851770937 852282643 852106154 852487803 852432668 851088464
987.2 851088464 849980295 850089014 849897206 848463833 847237647 847026825 846542358 845274031 844525635
1005.5 844525635 844501376 843644977 841748774 840512693 839940906 837225378 830963492 826088369 829252362
1023.9 829252362 837134898 841584980 842287838 842041850 840701759 838579297 837362826 837045133 836070240
1042.2 836070240 834447980 833437383 832667053 830613136 827464342 824509561 821253955 816160381
1058.6 816160381 809858561 804733694 801821351 800393462 799376845 797194242 791510224 780703604
1074.9 780703604 765234113 748685122 740482867 752017081 780980527 809791982 825605631
1089.2 825605631 829422832 827516615 823523343 818640411 815253556 815951765 819652498 822327852
1105.5H22327852k02179o72102J067996J359880j84297j057446j164794k163053l362953
1123.8H15948904k722085o09517P78079R56118J519501K717614K847851J776874J025021
1142.2H24238360Q10862N52654M25696N98967K07782j418173k944351k898037j723409
1160.5H17850351l74972M31835K33472k14279J71661J427651K722561K777040J358569
1178.9H26383889K11477K50697q2016j360833j833797j020789p60377j628637j965403
1197.3H18194211j388371j475573k407312k642572k205313k718985m290580n572498
1213.6G95493007o608904p658124n434274K830267J1345565J1704504N549610M07577
1229.9H07629228j506865k299250k725303k315700j866281k391457l145397l047049
$$ plain form
1105.5 822327852 822125673 821453571 822521567 823881447 823697150 822639704 821474910 819311857 815948904
1123.8 815948904 813226819 812617302 813395381 814351499 815871000 818588614 821436465 823213339 824238360
1142.2 824238360 825049222 825601876 826027572 826626539 826834321 825416148 822471797 819573760 817850351
1160.5 817850351 817475379 817907214 818140686 817926407 818098068 819525719 822248280 825025320 826383889
1178.9 826383889 826595366 826846063 826764047 825403214 823569417 822548628 821788251 820159614 818194211
1197.3 818194211 816805840 815330267 812922955 810280383 808075070 805356085 801065505 795493007
1213.6 795493007 788884103 781225979 775791705 778621972 789967537 801672041 807221651 807629228
1229.9 807629228 806122363 803823113 801097810 798782110 796915829 794524372 791378975 788331926
1246.2G88331926k746344l383755m753232o227971q524835j2295961j3599694m077136
1262.5G32722998J4474094K3407638J3472616j940429j1875808j8644095k5058567
1276.8G26558447k9376567k7697742j7448484j798094J1240185J6066193J4341772
1291.1F91885710J1163473R105325P570088M925191J623332L45827K322137O324112
1307.4G35265195J0881663J4499366J4409661Q928776N64456p098257j2781740j6412794
1323.7G48256326j7009735j2665928k637863R507775J6627431J5072823P013023l938556
1340G60225296j3788640j9725323j9696593j0301531O756783K1215379K4078548J7241061
1356.4G66004980Q910596L803253J421869M05371l62098k206802n458236q811593r483040
$$ plain form
1246.2 788331926 785585582 782201827 777448595 771220624 762695789 750399828 736800134 732722998
1262.5 732722998 747197092 770604730 784077346 782136917 770261109 751617014 726558447
1276.8 726558447 697181880 669484138 652035654 650237560 661477745 677543938 691885710
1291.1 691885710 703049183 712154508 719724596 724649787 726273119 726618946 728941083 735265195
1307.4 735265195 746146858 760646224 775055885 783984661 784549117 777450860 764669120 748256326
1323.7 748256326 731246591 718580663 715942800 725450575 742078006 757150829 764163852 760225296
1340 760225296 746436656 726711333 707014740 696713209 703469992 724685371 748763919 766004980
1356.4 766004980 774915576 778718829 780140698 780546069 780183971 777977169 772518933 763707340 754224300
1374.7G54224300m216373N536676J4897048J8934131J6820252J1952877O977737L774583
1391H28901231K192796O93380o20603j088143j309335j878619k269149j783550j506209
1409.4H21331799k144575k468944j889407j584947k140403k032459j489997j718163
1425.7H05862904k515674l118455k895296k809405m284919n472541m015386j896023
1442G78855205Q17537L631890L770947O1035m030525n910397o934106m676581J818180
1460.4G67403185M810095K92242r843350j3022601o148577K171636J384198m091561
1476.7G42955267o386458p463336r380699j1469721j3367534j4223576j1274039m413665
1493F64976239L363610J1776626J7860889J9186795J8779099K1788418K6964009K0673275
$$ plain form
1374.7 754224300 750007927 755544603 770441651 789375782 806196034 818148911 825126648 828901231
1391 828901231 831094027 831787407 831166804 830078661 828769326 826890707 824621558 822838008 821331799
1409.4 821331799 819187224 816718280 814828873 813243926 811103523 809071064 807581067 805862904
1425.7 805862904 803347230 800228775 797333479 794524074 790239155 784766614 780751228 778855205
1442 778855205 779672742 783304632 787075579 787136614 783106089 777195692 770261586 765585005 767403185
1460.4 767403185 772213280 772505522 762662172 749639571 743490994 745662630 747046828 742955267
1476.7 742955267 736568809 729105473 719724774 708255053 694887519 680663943 669389904 664976239
1493 664976239 668339849 680116475 697977364 717164159 735943258 757731676 784695685 805368960
1509.3H05368960J3686895J0824085P644355M703104K571524R15765q06689j923203
1525.6H42984796k233983k107739k518892l288031k643406k082527l613591m848659
1542H19647968m544199n177140o568670p944644p458090n109013j893878K366186N495846
1560.3G88814366L966749K350509J395762K88546j229644k297342l201187m688084
1576.6G85399675m891872m577577m919827n209923n733371o498336o925941p040381
1593G39602447p448853p695317o248355k480566J970887M290342L720403J616776k00868
1611.3G27126896p50601l68237K57313Q23378J364232J759111R97603j367807m191279
1629.7G25650609n775333p269978j0803760j1792302j0209620r707391q871734q020699
$$ plain form
1509.3 805368960 819055855 829879940 837524295 842227399 844798923 845714688 844907999 842984796
1525.6 842984796 840750813 838643074 836124182 832836151 830192745 828110218 824496627 819647968
1542 819647968 815103769 809926629 803357959 795413315 787955225 782846212 780952334 783318520 788814366
1560.3 788814366 792781115 795131624 796527386 796815932 795586288 793288946 790087759 785399675
1576.6 785399675 780507803 775930226 771010399 765800476 760067105 753568769 746642828 739602447
1593 739602447 732153594 724458277 718209922 715729356 717700243 721990585 725710988 727327764 727126896
1611.3 727126896 726376295 726008058 726265371 727088749 728452981 730212092 731209695 729841888 725650609
1629.7 725650609 719875276 712605298 701801538 690009236 679799616 670092225 661220491 653199792
1646F53199792o180465l649235m422665p042050m729152k312600l39866L337026P608771
1664.3F35469556J0575771J4479578J8331468J7606973J7674149J7725288J4253080
1678.6G46115863J1675597J1245727J1630535Q960128O672740O180465N035341L981352
1694.9H11497748L030300J508594j76669j226365k188504l444552m332900m687965
1711.3G99979687m630745m721641n526483n446554m566609m718721n164564n474925
1727.6G59729445o246686q750618j6745626k2761405j9992769j8268168j4065087o575286
1743.9F46323800j508713J256228M609883R319067J3360440J7514706K0275891K0607054
1760.2G31758356K1899641K0587980J6895652J3263583Q763969M639507J372397j280547
$$ plain form
1646 653199792 647019327 643370092 638947427 631905377 627176225 624863625 624523759 627860785 635469556
1664.3 635469556 646045327 660524905 678856373 696463346 714137495 731862783 746115863
1678.6 746115863 757791460 769037187 780667722 789627850 796300590 802481055 807516396 811497748
1694.9 811497748 814528048 816036642 815859973 814633608 812445104 809000552 804667652 799979687
1711.3 799979687 795348942 790627301 785100818 779654264 775087655 770368934 765204370 759729445
1727.6 759729445 753482759 744732141 727986515 705225110 685232341 666964173 652899086 646323800
1743.9 646323800 644815087 646071315 650681198 660000265 673360705 690875411 711151302 731758356
1760.2 731758356 753657997 774245977 791141629 804405212 813169181 817808688 819181085 817900538
1776.5H17900538m477560q158922p953644p06732Q850515J3463437J3040960J0333121
1792.8H42291713O355822L338516J493990K16901l49581n04076k68102O77764J943708
1811.2H55196655K260268J709878J256824J082599P27892K08079M18J3649k48790o79016
1831.6H61528456p86125r92299j515090j824141j530885j002014m26173J85311P95602
1850H54432642J226366J092613P21454N75364N53846L29197J05381J78754L35396K87890
1870.3H59838903J87337K31803J71482j48773m37081l91245k69293l38018m37737k65658
1890.7H58141720j2576o4254j14918J21236K87056P9274j64449j90377k26915m37081
1911.1H57418716n30601l36229k18869l83258n61952n44608n32448p28309q40008n89967
$$ plain form
1776.5 817900538 813422978 805264056 797310412 796603680 805454195 818917632 831958592 842291713
1792.8 842291713 848647535 851986051 853480041 853696942 853347361 852843285 852575183 853252947 855196655
1811.2 855196655 857456923 859166801 860423625 861506224 862234116 862442195 862442613 862456262 862207472 861528456
1831.6 861528456 860742331 859750032 858234942 856410801 854879916 853877902 853451729 853637040 854432642
1850 854432642 855659008 856751621 857473075 858048439 858602285 858931482 859036863 859215617 859551013 859838903
1870.3 859838903 860026240 860258043 860429525 860280752 859843671 859452426 859183133 858845115 858407378 858141720
1890.7 858141720 858129144 858064890 857949972 858071208 858358264 858437538 858273089 858082712 857855797 857418716
1911.1 857418716 856888115 856551886 856333017 855949759 855387807 854843199 854310751 853582442 852742434 852152467
1931.5H52152467k52009p1764J23203L40283K44021j37269l10242j99557j53005k54452
1951.9H51481676k22444m4764o6101l31819m96507m43458m58897n65111m92633k75373
1972.3H48084569j87337k48373j84894J8657L5286j56761k17139j41502k79724n78702
1992.7H46144080o18577n02884o17385q33035p24554k83301N9963J76310L12567M77374
2013.1H43590558M21702J98544Q9585N0545j91987l64303J7762L69430R3221l21209
2033.5H43953848m12524l32415l71218m40657l20673j47819j57774k21848j35959l6299
2053.9H41376662r9718j88470r5070r536j87993m10438l79384k65359k88487l00705
2074.3H39151502j54496l4511j30117k82704k48313j33992j67191j90913l9339P1346
$$ plain form
1931.5 852152467 851900458 851828694 851951897 852292180 852536201 852398932 852088690 851889133 851736128 851481676
1951.9 851481676 851259232 851214468 851148367 850816548 850320041 849876583 849417686 848852575 848359942 848084569
1972.3 848084569 847897232 847648859 847463965 847482622 847517908 847361147 847144008 847002506 846722782 846144080
1992.7 846144080 845525503 845022619 844405234 843572199 842847645 842564344 842624307 842800617 843113184 843590558
2013.1 843590558 844012260 844210804 844300389 844350934 844158947 843794644 843812406 844181836 844275057 843953848
2033.5 843953848 843541324 843208909 842837691 842397034 842076361 841928542 841770768 841548920 841412961 841376662
2053.9 841376662 841276944 841088474 840993404 840983868 840795875 840385437 840006053 839740694 839452207 839151502
2074.3 839151502 838997006 838962495 838832378 838549674 838301361 838167369 838000178 837809265 837769926 837841272
2094.7H37841272l9875j76490j45554j18375k43902l09110k01463j86086l61145m65274
2115.1H35593998l25501j66416j90496k15113q4102J7702p4983j51157n1796K265j06573
2137.5H34247828j29879O557K1338j49906k41339k05219k44081l63707l62873k01524
2157.9H32377195j40488k41041k52664j78039k30730k55286p3851N0009p9274k80560
2178.3H30695271k97665k02537k10762k62022j60694o556o5744k25425k28226j72436
2198.7H28863204k44141l25680k40743j31071k08437l40521l08454k17557k72572l66033
2219.1H26207995k91347j75536k21729l09289k75313k51353l46124l89457k84195k13563
2239.5H23450089k76387l02255k19822j82748k32876k04622o1512Q464q3328j93774
$$ plain form
2094.7 837841272 837801397 837624907 837479353 837360978 837117076 836807966 836606503 836420417 836059272 835593998
2115.1 835593998 835268497 835102081 834911585 834696472 834612370 834630072 834555089 834403932 834352136 834354401 834247828
2137.5 834247828 834117949 834124506 834145844 833995938 833754599 833549380 833305299 832941592 832578719 832377195
2157.9 832377195 832236707 831995666 831743002 831564963 831334233 831078947 831005096 831055105 830975831 830695271
2178.3 830695271 830397606 830195069 829984307 829722285 829561591 829555035 829489291 829263866 829035640 828863204
2198.7 828863204 828619063 828293383 828052640 827921569 827713132 827372611 827064157 826846600 826574028 826207995
2219.1 826207995 825916648 825741112 825519383 825210094 824934781 824683428 824337304 823947847 823663652 823450089
2239.5 823450089 823173702 822871447 822651625 822468877 822236001 822031379 821969867 821978331 821895003 821701229
2259.9H21701229k14100k22981k67267k64287j97590j86205k68876l30746l22819l32535
2280.3H19093823l47614k52485j23680j28686k32816k85387k74003k79128k86818k23815
2300.7H16659391j36972j51634k25961k42412k33471k46585k20835j38819r2149j53542
2321.1H14817011k88248l79324l87728l77357l98695l82960k97249k60472k75135k84910
2341.5H11484933l17574l44991j50562J74702L29792K25127j2934k65599m92930o06179
2361.9H10023785n95928n60402n81384o48022p17223p23302o58572n62608m19736k55763
2382.3H04300845j32084o2764l5107m6313o8545q7321j57058k66254l33965l68416
2402.7H02743018m02689m08173l52979k42591j75714k01404k50042l12030m12166m82917
$$ plain form
2259.9 821701229 821487129 821264148 820996881 820732594 820535004 820348799 820079923 819749177 819426358 819093823
2280.3 819093823 818746209 818493724 818370044 818241358 818008542 817723155 817449152 817170024 816883206 816659391
2300.7 816659391 816522419 816370785 816144824 815902412 815668941 815422356 815201521 815062702 814970553 814817011
2321.1 814817011 814528763 814149439 813761711 813384354 812985659 812602699 812305450 812044978 811769843 811484933
2341.5 811484933 811167359 810822368 810671806 810846508 811176300 811401427 811388493 811122894 810629964 810023785
2361.9 810023785 809427857 808867455 808286071 807638049 806920826 806197524 805538952 804976344 804556608 804300845
2382.3 804300845 804168761 804105997 804070890 804024577 803956032 803868711 803711653 803445399 803111434 802743018
2402.7 802743018 802340329 801932156 801579177 801336586 801160872 800959468 800709426 800397396 799985230 799502313
2423.1G99502313m43697l30210k51114k37703k40147k65301l41057m19915m44472m32909
2443.5G96095788m23848m09663l76761l59773l95179m19915l78191l06488k74956k72274
2463.9G92478740k55525k73943l19481l21209l07203l28481l51786l38078l21150l61383
2484.3G89300501m61995n34892n21362m73499m52161m19379l55839l62397m60743n15640
2504.7G84742594m71890m24803m17292l84271l22044k75016k08258p9930N9724J19209
2525.1G82338023O8784p1228k41756m00901n18322n05149l89219l25381l52800l67403
2545.5G79234648l30925l11077k86221j66953J2279J12593J02401Q7499Q4162j2338
2565.8G78526068j94192l37780m29749n27501n69344m72128k93434j06037J35601M25279
$$ plain form
2423.1 799502313 799058616 798728406 798477292 798239589 797999442 797734141 797393084 796973169 796528697 796095788
2443.5 796095788 795671940 795262277 794885516 794525743 794130564 793710649 793332458 793025970 792751014 792478740
2463.9 792478740 792223215 791949272 791629791 791308582 791001379 790672898 790321112 789983034 789661884 789300501
2484.3 789300501 788838506 788303614 787782252 787308753 786856592 786437213 786081374 785718977 785258234 784742594
2504.7 784742594 784270704 783845901 783428609 783044338 782722294 782447278 782239020 782159090 782218814 782338023
2525.1 782338023 782406807 782335579 782093823 781692922 781174600 780669451 780280232 779954851 779602051 779234648
2545.5 779234648 778903723 778592646 778306425 778139472 778151751 778264344 778366745 778454244 778538406 778526068
2565.8 778526068 778331876 777994096 777564347 777036846 776467502 775995374 775701940 775595903 775731504 776156783
2586.2G76156783N98550N54323M39763M20213M25994L77834L43502L37541K52724K5153
2606.6G79932380k39849m06444n28098o91235q14736p78317o34551n16713l87609k05278
2627G74729550p3016l2902j6629K1219P987j19984k38300k13980j34885j11044o1989
2649.5G73756027L9637K7836j37210l20673m72665o44445p92444p75516n91338l67939
2669.9G69721270j63556J8538J20937O4075q1956j47343j02401p1942q9109n9307k6464
2692.3G69182742r2864j88411k29954k89321m59075o55771p33256p44641p75456p24554
2712.7G64289439n23210k85446j29045m7445l5286j31964l49284n22613m21882k05874
2733.1G61637390j23382j14679r5070j06036j76251k13147j92284k38538l51786m16875
$$ plain form
2586.2 776156783 776755333 777309656 777749419 778169632 778595626 778973460 779316962 779654503 779907227 779932380
2606.6 779932380 779692531 779286087 778757989 778066754 777252018 776473701 775839150 775322437 774934828 774729550
2627 774729550 774656534 774623632 774607003 774628222 774636209 774516225 774277925 774063945 773929060 773818016 773756027
2649.5 773756027 773795664 773823500 773686290 773365617 772892952 772248507 771456063 770680547 770089209 769721270
2669.9 769721270 769557714 769576252 769697189 769761264 769679308 769531965 769429564 769357622 769268513 769209206 769182742
2692.3 769182742 769089878 768901467 768671513 768382192 767923117 767267346 766534090 765789449 765013993 764289439
2712.7 764289439 763766229 763480783 763351738 763304293 763269007 763137043 762787759 762265146 761843264 761637390
2733.1 761637390 761514008 761399329 761304259 761198223 761021972 760808825 760616541 760378003 760026217 759609342
2753.5G59609342m16577m24445m93944n54859n00560m38988n01693n85317o00815o55293
2773.9G54436851q14975q85010p40885n67436m72963l63171k58565l51787n95331o98149
2794.3G48688579o54698p09653q81672r60528r31681r62078j070738j195431j263082
2812.6G40059018j236975j189232j127839j055360j039207j061082j048028r79662
2828.9G31321633q99732q82626r05990r51529j240313j709223j909792j844108j833797
2847.3G19144523j917600j897395j752734j634896j511276j391828j394570j418412
2863.6G06225812j366198j298189j179993j045287j135468j338780j294672j116336
2879.9F96450889j054704j053155j057684j091003j069844q43287m33087r1076J44124
$$ plain form
2753.5 759609342 759192765 758768320 758274376 757719517 757218957 756779969 756278276 755692959 755092144 754436851
2773.9 754436851 753621876 752736866 751995981 751428545 750955582 750592411 750333846 749982059 749386728 748688579
2794.3 748688579 748033881 747324228 746442556 745482028 744550347 743588269 742517531 741322100 740059018
2812.6 740059018 738822043 737632811 736504972 735449612 734410405 733349323 732301295 731321633
2828.9 731321633 730421901 729539275 728633285 727681756 726441443 724732220 722822428 720978320 719144523
2847.3 719144523 717226923 715329528 713576794 711941898 710430622 709038794 707644224 706225812
2863.6 706225812 704859614 703561425 702381432 701336145 700200677 698861897 697567225 696450889
2879.9 696450889 695396185 694343030 693285346 692194343 691124499 690281212 689848125 689757049 689901173
2898.3F89901173N11527Q97169R97603R39548R57906R72510Q04543M99726L55541M91143
2918.7F97328389P67171J176238J691580K188444K497017K452910K277673K177238
2935G12556660J952112J561463J224398R05455M09662j44422m94003o67632q83996
2953.4G16419697j076698j011313p52627m98295k65837o735K05517L24487M46618N57423
2973.8G14342237N19335M11272L58760K64108J05024m5061j73569k43485l55423o55472
2994.2G14527726r47237j089394j221001j304090j239658j061081q25525n98132m46797
3012.5G05794811l97622l88623k98738m9830L27945O26266P46846Q97706J103401J201987
3032.9G09564149J125574J110435J406252J604855J443387J335322J540363J864076
$$ plain form
2898.3 689901173 690412700 691309869 692307472 693247020 694204926 695177436 695981979 696481705 696837246 697328389
2918.7 697328389 698095560 699271798 700963378 703151822 705648839 708101749 710379422 712556660
2935 712556660 714508772 716070235 717294633 718200088 718609750 718465328 717971325 717303693 716419697
2953.4 716419697 715342999 714331686 713579059 713080764 712814927 712808192 713013709 713338196 713784814 714342237
2973.8 714342237 714861572 715272844 715631604 715895712 716000736 715955675 715782106 715538621 715183198 714527726
2994.2 714527726 713580489 712491095 711270094 709966004 708726346 707665265 706839740 706241608 705794811
3012.5 705794811 705397189 705008566 704709828 704659998 704987943 705614209 706361055 707258761 708362162 709564149
3032.9 709564149 710689723 711800158 713206410 714811265 716254652 717589974 719130337 720994413
3049.2G20994413J950145J780450J580298J247823Q36790O64234O11246M58181K58862
3067.6G30382442K55347O29961J148522J555562J767636J668095J421213J269043J149177
3085.9G41246998J025498Q24094N23806L80695M67598O20127P14838P75576Q61406
3104.3G47440636Q66831O61194L05772N3823k6644j57415l73602o00517p50184n78881
3124.7G46841013j25646K32994L45707M35233O43194Q02815O66797K47896j03533k95162
3145.1G49691308n33402p06792p43807r76920j331031j377225j187146r77933p39694
3163.4G41117358m05848M1008M82619Q64625J248121J582742J802742J933516K011656
3181.8G50678539K061010K008259J850188J728117J646519J474261J218796J047969
$$ plain form
3049.2 720994413 722944558 724725008 726305306 727553129 728389919 729054153 729665399 730123580 730382442
3067.6 730382442 730637789 731267750 732416272 733971834 735739470 737407565 738828778 740097821 741246998
3085.9 741246998 742272496 743096590 743620396 744001091 744468689 745088816 745803654 746579230 747440636
3104.3 747440636 748307467 748968661 749274433 749328256 749301612 749144197 748770595 748170078 747419894 746841013
3124.7 746841013 746715367 746948361 747294068 747729301 748372495 749175310 749842107 750090003 749986470 749691308
3145.1 749691308 749157906 748451114 747707307 746730387 745399356 744022131 742834985 741857052 741117358
3163.4 741117358 740711510 740752518 741235137 742099762 743347883 744930625 746733367 748666883 750678539
3181.8 750678539 752739549 754747808 756597996 758326113 759972632 761446893 762665689 763713658
3198.1G63713658R68516P93516N60105M84705N03183M41134L48150L06070K58207J58668
3218.5G68535912Q3804J14799J73092J57058J45554K63214L58165J43230j60575k32339
3238.9G69581914k59519l67880m21941m48167n67198o84202o74724o20306o58929p24733
3259.3G64154315o65903m83513k65300q4102K1040k205j03355j63018j09137M6015
3279.7G62344837J46747J33395J02162J22011J44601J6212k23279l87191n52357p57336
3300.1G61089802q22842p99895r32753j201033j346112j319050j272798j232564j096011
3318.4G51066744r27686q52526q20875p92682p68006p91847q92401r52125r72330j141668
3338.8G42154598j428127j630783j752317j843393j872241j955629k181709k378285
$$ plain form
3198.1 763713658 764682174 765475690 766035795 766520500 767023683 767464817 767812967 768119037 768377244 768535912
3218.5 768535912 768619716 768734515 768907607 769064665 769210219 769473433 769831598 769974828 769814253 769581914
3238.9 769581914 769322395 768954515 768532574 768084407 767517209 766833007 766158283 765537977 764879048 764154315
3259.3 764154315 763488412 763004899 762739599 762655497 762676537 762674332 762570977 762407959 762298822 762344837
3279.7 762344837 762491584 762624979 762727141 762849152 762993753 763009965 762786686 762399495 761847138 761089802
3300.1 761089802 760266960 759467065 758534312 757333279 755987167 754668117 753395319 752162755 751066744
3318.4 751066744 750139058 749286532 748465657 747672975 746904969 746113122 745220721 744268596 743296266 742154598
3338.8 742154598 740726471 739095688 737343371 735499978 733627737 731672108 729490399 727112114
3355.2G27112114k402663k352118k401471k440572k295554k217173k455771k793849
3371.5G07752943k807677k465844k175569k134681k188742k125442j945198j721024
3387.8F90188766j454771j479387j796127j753270j308620j120210j491606j861274
3404.1F77923501j652778j239538j083433j121700j241446j251817j065433r42468
3420.4F68324888q96931o91414m18842l01897l29316k67088q8990j15156k92421j96993
3440.8F64725840J28388L49522M12941M26471M59493N26487O17803P39157Q63015Q72732
3461.2F70121849Q68499J007676J082361Q98182O81222P16209Q92580J003861R91941
3479.6F78264380R18984R08315R88960J070083J092910J116157J148105J169979J177132
$$ plain form
3355.2 727112114 724709451 722357333 719955862 717515290 715219736 713002563 710546792 707752943
3371.5 707752943 704945266 702479422 700303853 698169172 695980430 693854988 691909790 690188766
3387.8 690188766 688733995 687254608 685458481 683705211 682396591 681276381 679784775 677923501
3404.1 677923501 676270723 675031185 673947752 672826052 671584606 670332789 669267356 668324888
3420.4 668324888 667427957 666736543 666317701 666015804 665686488 665419400 665330410 665215254 664922833 664725840
3440.8 664725840 664854228 665203750 665616691 666043162 666502655 667029142 667646945 668386102 669249117 670121849
3461.2 670121849 670990348 671998024 673080385 673978567 674659789 675375998 676268578 677272439 678264380
3479.6 678264380 679183364 680091679 681080639 682150722 683243632 684359789 685507894 686677873 687855005
3497.9F87855005J161516J131654J063227R90034J007437J059234J077712J044750
3514.2F96390569J004875J061559J217067J406431J452923J394689J440704J528680
3530.6G06897497J552463J558602J504600J413941J527071J708210J591682J261771
3546.9G19015837J191258J404822J562119J598835J670658J792073J793206J665533
3563.2G31694341J615286J797258J964093J875579J771867J810491J905919K023279
3579.5G46458113K128780K109468J942813J865089K041638K114594K062321K132654
3595.8G62855470K228558K142370K020299J984954J893997J857698J903892J870275
3612.1G78757513J832008J739621J690745J846135J784206J480937J230835J167059
$$ plain form
3497.9 687855005 689016521 690148175 691211402 692201436 693208873 694268107 695345819 696390569
3514.2 696390569 697395444 698457003 699674070 701080501 702533424 703928113 705368817 706897497
3530.6 706897497 708449960 710008562 711513162 712927103 714454174 716162384 717754066 719015837
3546.9 719015837 720207095 721611917 723174036 724772871 726443529 728235602 730028808 731694341
3563.2 731694341 733309627 735106885 737070978 738946557 740718424 742528915 744434834 746458113
3579.5 746458113 748586893 750696361 752639174 754504263 756545901 758660495 760722816 762855470
3595.8 762855470 765084028 767226398 769246697 771231651 773125648 774983346 776887238 778757513
3612.1 778757513 780589521 782329142 784019887 785866022 787650228 789131165 790362000 791529059
3628.5G91529059J306713J271427J134395J050949R75907R38237R19223Q54015P45416
3646.8H00725341P26878P73967O54757N26309N90205O18100L68178J35601J73270J94490
3667.2H05487096P3433J43290J75357n1022n2929J52171K97665M26352N45502N85675
3687.6H07782590L37541P1168J38879K44141K14398J32143J10567J74999K04027J03474
3708H09513927j44184k65777l2306J41680J29104N2750o4611j47820r2983N3465Q2791
3730.4H09226036j3113n6088M2200Q1718j15275m54009m80234n5314m7922k51770p5876
3752.9H07800353O1988k9206q7201k5869q643p6413j29461j79231j73867p3314J7703
3775.3H07096839L1292p3194j99139k23756j65284r1254q3030j13129r3639k7240P928
$$ plain form
3628.5 791529059 792835772 794107199 795241594 796292543 797268450 798206687 799125910 799979925 800725341
3646.8 800725341 801452219 802226186 802880943 803407252 803997457 804615557 804983735 805119336 805292606 805487096
3667.2 805487096 805560529 805703819 805879176 805828154 805775225 805927396 806225061 806651413 807196915 807782590
3687.6 807782590 808120131 808191299 808330178 808574319 808788717 808920860 809031427 809206426 809410453 809513927
3708 809513927 809369743 809103966 809071660 809213340 809342444 809395194 809330583 809182763 809089780 809143245 809226036
3730.4 809226036 809212923 809156835 809199035 809280753 809165478 808711469 808231235 808175921 808127999 807876229 807800353
3752.9 807800353 807862341 807833135 807745934 807720065 807711422 807635009 807505548 807326317 807152450 807079136 807096839
3775.3 807096839 807128131 807054937 806855798 806632042 806466758 806375504 806292474 806179345 806085706 806058466 806066394
3797.7H06066394j23739k06829j6629l7611j82032r4951l8921j23561j25348m113j69993
3820.2H04942667l72350k24888j34587j23680m9293K2709j6808j89841k45452j06454
3840.6H03502023n5432k7418N6207M7862j92046o15716m67717K4378L7134o7413q8394
3863H02153468n5253o8665j44482q1598l696l1233o9201j13547m9114j2934j39475
3885.4H01384270j82211j86026j95146m3511O2108m5598k00689k26617j23560O139
3905.8H00249159K8432k3067l1770q0049j76966j41442m0352n0545q5115n2035m3988
3928.3G99552262j15216j34766o2585o7651j37568j67668j25289l0279o0796j73986
3948.7G98476458j22190k2709o6340q2851o079j3233r1552j16051r4890q3864r5427
$$ plain form
3797.7 806066394 805942655 805735826 805719197 805681586 805499554 805404603 805365682 805242121 805116773 805112660 804942667
3820.2 804942667 804570317 804345429 804210842 804087162 804037869 804060578 804043770 803853929 803608477 803502023
3840.6 803502023 803446591 803419173 803475380 803523242 803331196 802715480 802247763 802272141 802309275 802241862 802153468
3863 802153468 802098215 802029550 801885068 801803470 801799774 801768541 801699340 801585793 801536679 801523745 801384270
3885.4 801384270 801202059 801016033 800820887 800777376 800839484 800793886 800593197 800366580 800243020 800249159
3905.8 800249159 800277591 800254524 800222754 800142705 799965739 799824297 799783945 799733400 799648285 799596250 799552262
3928.3 799552262 799437046 799302280 799239695 799172044 799034476 798866808 798741519 798711240 798650444 798476458
3948.7 798476458 798354268 798331559 798265219 798182368 798176289 798163056 798071504 797955453 797860563 797776699 797681272
3971.1G97681272p6473k3663l2723o3479l57K8789o4612j61230j95742j37329m9174
3993.5G96905279l5286p3015
3997.6G96796978
$$ plain form
3971.1 797681272 797604799 797581136 797548413 797484934 797484577 797513366 797448754 797287524 797091782 796954453 796905279
3993.5 796905279 796869993 796796978
3997.6 796796978
##END=$$ End of the data block
