##TITLE=B8M - Joseane 1 $$ Begin of the data block
##JCAMP-DX=5.00 $$ ACD/SpecManager v 10.08
##SPECTROMETER/DATA SYSTEM=Alpha
##DATE=23 Jun 2015 08:35:04
##DATA TYPE=INFRARED SPECTRUM
##DATA CLASS=XYDATA
##ORIGIN=
##OWNER=
##NPOINTS=1765
##FIRSTX=399.76428223
##LASTX=3997.64306641
##MAXX=3997.64306641
##MINX=399.76428223
##MAXY=0.82296449
##MINY=0.05900657
##XFACTOR=1.0000000000
##YFACTOR=1.000000000000000e-9
##FIRSTY=0.78043759
##DELTAX=2.03961372
##XUNITS=1/CM
##YUNITS=ARBITRARY UNITS
##XYDATA=(X++(Y..Y))
$$ plain form
399.8 780437589 775857329 769549131 760811150 751283348 740186989 725214958 708287120 693481266
416.1 693481266 677944958 654812098 626563430 603127480 601440549 630403399 677904546 723211706
432.4 723211706 755346596 776298523 789669931 797741592 803748190 809218884 812842131 814679623
448.7 814679623 816726506 818869650 819602430 819761693 820701599 821294069 821176291 821601212 822169721
467.1 822169721 821829259 821665108 822586298 822911084 822350264 822537720 822964489 822435856 822061181 822282016
487.5 822282016 821625113 820514977 820459068 820447028 819304943 818398774 818297446 817584991 816419303 815990627
507.9 815990627 815591455 814386189 813427329 813107550 812299669 810969055 810070693 809107780 807418287
526.2 807418287 805882573 804687798 802731335 799788475 796505511 792392969 786258757 778047502
$$ packed form
399.8G80437589m580260o308198q737981r527802j1096359j4972031j6927838j4805854
416.1F93481266j5536308k3132860k8248668k3435950j686931K8962850M7501147M5307160
432.4G23211706L2134890K0951927J3371408Q071661O006598N470694L623247J837492
448.7H14679623K046883K143144P32780J59263R39906N92470j17778M24921N68509
467.1H22169721l40462j64151R21190L24786n60820J87456M26769n28633l74675K20835
487.5H22282016o56903j110136n5909j2040j142085r06169j01328p12455j165688m28676
507.9H15990627l99172j205266r58860l19779q07881j330614q98362r62913j689493
526.2H07418287j535714j194775j956463k942860l282964m112542o134212q211255
$$ plain form
542.5 778047502 767876148 754374623 736224830 712464154 681290686 645454407 619489193
556.8 619489193 621298552 651787758 692888916 726867795 747865617 757623315 760360062 760210574
573.1 760210574 758844018 756740630 755185783 755081773 755927503 758071363 762995958 770580590 779209554
591.5 779209554 787650168 794808686 799512386 802132368 804057002 805532396 806081057 806386471 806924820
609.8 806924820 806970000 806303203 805627346 805095851 804266453 803364873 802454352 800820827 797892690 793798089
630.2 793798089 787772954 777445138 759654343 737191796 725844622 736794591 757556260 770924628
646.6 770924628 774259150 771889150 767277539 761337340 753262281 742135286 727193594 707622349
662.9 707622349 683184445 638004720 549528301 455928415 391616464 397629112 491562665 612671196
$$ packed form
542.5G78047502j0171354j3501525j8149793k3760676l1173468l5836279k5965214
556.8F19489193J809359L0489206M1101158L3978879K0997822R757698K736747j49488
573.1G60210574j366556k103388j554847j04010Q45730K143860M924595P584632Q628964
591.5G79209554Q440614P158518M703700K619982J924634J475394N48661L05414N38349
609.8H06924820M5180o66797o75857n31495q29398r01580r10521j633525k928137m094601
630.2G93798089o025135j0327816j7790795k2462547j1347174J0949969K0761669J3368368
646.6G70924628L334522k370000m611611n940199q075059j1126995j4941692j9571245
662.9G07622349k4437904m5179725q8476419r3599886o4311951O012648R3933553J21108531
$$ plain form
679.2 612671196 699945867 743712604 759638846 760477662 751581192 735532761 720104814 719419777
695.5 719419777 737116456 759727120 775370300 783393323 786348343 785837829 783288121 779254079
711.8 779254079 773523390 766315877 758036911 747529566 732776165 711725473 680895507 634414732
728.1 634414732 565552592 471387535 364090532 278614312 250689030 289684087 383757234
742.4 383757234 503959417 609222770 676332295 711298287 728558660 737035453 740776181
756.7 740776181 741465926 739893079 736711502 732195199 726361334 719456851 711767137 702903867 692157507
775.1 692157507 678956747 662497759 642036378 618229568 593430102 569407403 544023454
789.3 544023454 508425951 451965541 384725749 340273321 330657840 337836564 363503158 430614173
$$ packed form
679.2F12671196Q7274671M3766737J5926242Q38816q896470j6048431j5427947o85037
695.5G19419777J7696679K2610664J5643180Q023023K955020n10514k549708m034042
711.8G79254079n730689p207513q278966j0507345j4753401k1050692l0829966m6480775
728.1F34414732o8862140r4165057j07297003q5476220k7925282L8995057R4073147
742.4C83757234J20202183J05263353O7109525L4965992J7260373Q476793L740728
756.7G40776181O89745j572847l181577m516303n833865o904483p689714q863270j0746360
775.1F92157507j3200760j6458988k0461381k3806810k4799466k4022699k5383949
789.3E44023454l5597503n6460410o7239792m4452428r615481P178724K5666594O7111015
$$ plain form
805.6 430614173 533968031 633945048 700390995 733995855 747098923 748068392 741081715 726812482
822 726812482 702094913 664898753 624871850 603412628 613971889 648724437 689114273 721145630
838.3 721145630 740514219 749514401 751997352 750612438 746934950 742097497 736606836 730432928
854.6 730432928 723684609 716642976 709334195 701772988 693966210 685393393 675279677 663389981
870.9 663389981 649711728 633977592 615975380 595761180 573486149 549482167 524522245
885.2 524522245 499540120 475281298 452311069 431139618 412118286 395567566 381984949
899.5 381984949 371967554 366014749 364340216 366713256 372355968 380259931 389538914 399658889
915.8 399658889 410639048 423108310 437691897 454400212 472557843 491200209 509753525
$$ packed form
805.6D30614173J03353858R9977017O6445947L3604860J3103068R69469o986677j4269233
822G26812482k4717569l7196160m0026903k1459222J0559261L4752548M0389836L2031357
838.3G21145630J9368589R000182K482951j384914l677488m837453n490661o173908
854.6G30432928o748319p041633p308781p561207p806778q572817j0113716j1889696
870.9F63389981j3678253j5734136j8002212k0214200k2275031k4003982k4959922
885.2E24522245k4982125k4258822k2970229k1171451j9021332j6550720j3582617
899.5C81984949j0017395n952805j674533K373040N642712P903963R278983J0119975
915.8C99658889J0980159J2469262J4583587J6708315J8157631J8642366J8553316
$$ plain form
930.1 509753525 528138757 546621382 565646946 585412979 605437040 624866068 642936468
944.3 642936468 659084499 672940791 684502661 694095552 701973736 708414197 713842332 718568444
960.7 718568444 722316086 724000275 720367968 703345239 667049170 628234506 618384898 641701400
977 641701400 673424125 696371555 710183382 718737304 724482238 728575408 731452286 733157396
993.3 733157396 733285725 730419815 720970631 699004769 666024327 643821776 653119624 682714820
1009.6 682714820 708658755 723457813 731028080 735248923 737947762 739810050 741159916 742214799
1025.9 742214799 742971241 743273079 743062913 742247999 740717769 738560498 736060023 733413458 730605185
1044.3 730605185 727245986 722651660 716111898 707145214 695547044 680891693 661843002 635137677
$$ packed form
930.1E09753525J8385232J8482625J9025564J9766033K0024061J9429028J8070400
944.3F42936468J6148031J3856292J1561870R592891P878184O440461N428135M726112
960.7G18568444L747642J684189l632307j7022729l6296069l8814664r849608K3316502
977F41701400L1722725K2947430J3811827Q553922N744934M093170K876878J705110
993.3G33157396J28329k865910r449184k1965862l2980442k2202551R297848K9595196
1009.6F82714820K5943935J4799058P570267M220843K698839J862288J349866J054883
1025.9G42214799P56442L01838k10166q14914j530230k157271k500475k646565k808273
1044.3G30605185l359199m594326o539762q966684j1598170j4655351j9048691k6705325
$$ plain form
1060.6 635137677 594258308 530408263 441562563 345880121 294390798 342371523 472700357
1074.9 472700357 604870975 691321254 739723027 767789423 783083558 789452314 790887058
1089.2 790887058 789959848 787819445 784863889 781264722 777037501 772178113 766741097 761168122
1105.5 761168122 755980551 751505136 747965872 745277047 742944777 740374386 737530410 734453797
1121.8 734453797 730835974 726355255 721199632 715128779 706282675 691457272 668566942 642190576
1138.1 642190576 626551449 632580638 650436163 660002470 651203871 622440934 584393442 574983656
1154.4 574983656 618728101 679243326 712702870 719992459 717743635 713292956 708297610 703054070
1170.7 703054070 697884977 693474054 690278411 687911928 685346425 681772172 677204132 672055006
$$ packed form
1060.6F35137677m0879369o3850045q8845700r5682442n1489323M7980725J30328834
1074.9D72700357J32170618Q6450279M8401773K8066396J5294135O368756J434744
1089.2G90887058r27210k140403k955556l599167m227221m859388n437016n572975
1105.5G61168122n187571m475415l539264k688825k332270k570391k843976l076613
1121.8G34453797l617823m480719n155623o070853q846104j4825403k2890330k6376366
1138.1F42190576j5639127O029189J7855525R566307q798599k8762937l8047492r409786
1154.4E74983656M3744445O0515225L3459544P289589k248824m450679m995346n243540
1170.7G03054070n169093m410923l195643k366483k565503l574253m568040n149126
$$ plain form
1187.1 672055006 666600883 660848200 654726982 648134649 640936792 632952392 623977840 613764644
1203.4 613764644 602254689 590090036 578821778 570215642 564798176 561335862 557901978 553181231
1219.7 553181231 546691775 538357079 528170824 516190767 502561212 487550259 471598685 455235183
1236 455235183 438814670 422165155 404635668 385587245 364779085 342246681 318091393 292435884
1252.3 292435884 265538782 237960383 210623085 184585422 160733998 139649570 122288249
1266.6 122288249 110760406 107675709 111389130 112231143 103714384 93694754 93181714 104354478
1282.9 104354478 124815114 152497903 185406759 220850810 255810410 287613541 314490229
1297.2 314490229 335698783 350925446 360016137 363913655 366077125 371966451 386741906 412555128
$$ packed form
1187.1F72055006n454123n752683o121218o592333p197857p984400q974552j0213196
1203.4F13764644j1509955j2164653j1268258q606136n417466l462314l433884m720747
1219.7E53181231o489456q334696j0186255j1980057j3629555j5010953j5951574j6363502
1236D55235183j6420513j6649515j7529487j9048423k0808160k2532404k4155288k5655509
1252.3B92435884k6897102k7578399k7337298k6037663k3851424k1084428j7361321
1266.6A22288249j1527843l084697L713421Q42013q516759j0019630n13040J1172764
1282.9A04354478K0460636K7682789L2908856L5444051L4959600L1803131K6876688
1297.2C14490229K1208554J5226663R090691L897518K163470N889326J4775455K5813222
$$ plain form
1313.5 412555128 446901858 484599590 520545900 551224530 575990498 595903397 612050891
1327.8 612050891 625317335 636369646 645669222 653505981 659928262 664776325 667721689 668753088
1344.1 668753088 668190122 666705787 665134192 664007723 663294554 662524879 661077261 658256292 653706014
1362.5 653706014 647740781 640724182 632359326 622719169 611394644 597874463 583023548 566679299
1378.8 566679299 547430694 525392771 501440346 473390818 439722449 402297199 359076351
1393.1 359076351 308807433 258863002 214750350 182618901 168511435 174735516 201210782
1407.3 201210782 243969485 298416764 357680619 414998204 470081925 523286402 564465642
1421.6 564465642 593663394 615823984 631557584 643995583 656139612 669072747 685140252
$$ packed form
1313.5D12555128L4346730L7697732L5946310L0678630K4765968J9912899J6147494
1327.8F12050891J3266444J1052311R299576P836759O422281M848063K945364J031399
1344.1F68753088n62966j484335j571595j126469p13169p69675j447618k820969m550278
1362.5F53706014n965233p016599q364856r640157j1324525j3520181j4850915j6344249
1378.8E66679299j9248605k2037923k3952425k8049528l3668369l7425250m3220848
1393.1C59076351n0268918m9944431m4112652l2131449j4107466O224081K6475266
1407.3B01210782M2758703N4447279N9263855N7317585N5083721N3204477M1179240
1421.6E64465642K9197752K2160590J5733600J2437999J2144029J2933135J6067505
$$ plain form
1435.9 685140252 703062057 717280149 727864861 735447586 738901198 736237884 728392065 721199811
1452.2 721199811 718672037 725704789 745059371 761857867 770310044 773917377 775035501 775117517
1468.5 775117517 774480879 772790313 769994915 766408026 761662126 754918277 745201051 731704354
1484.9 731704354 713288784 690582991 669294119 654814303 644179165 637323797 646081209 671724856
1501.2 671724856 699982584 722805858 739118934 746656477 749116123 749698162 748985827 747436106
1517.5 747436106 745360076 742469072 738698602 733723104 726691961 718090117 708230913 698802352
1533.8 698802352 694047689 694015682 696790099 699793279 700932562 700402379 698565423 695504606 691563666
1552.2 691563666 686979830 682048321 675765991 668797374 663569868 657544136 649105191 636916995
$$ packed form
1435.9F85140252J7921805J4218092J0584712P582725L453612k663314p845819p192254
1452.2G21199811k527774P032752J9354582J6798496Q452177L607333J118124Q2016
1468.5G75117517o36638j690566k795398l586889m745900o743849r717226j3496697
1484.9G31704354j8415570k2705793k1288872j4479816j0635138o855368Q757412K5643647
1501.2F71724856K8257728K2823274J6313076P537543K459646N82039p12335j549721
1517.5G47436106k076030k891004l770470m975498p031143q601844r859204r428561
1533.8F98802352m754663l2007K774417L003180J139283n30183j836956l060817l940940
1552.2F91563666m583836m931509o282330o968617n227506o025732q438945j2188196
$$ plain form
1568.5 636916995 619929910 601166308 576858342 538435280 494424760 451102704 404661298
1582.8 404661298 363922626 350267917 368117124 397098124 430710435 478412569 532823443
1597 532823443 575948954 601688206 613977969 617920876 616883099 612779975 606919646 599921882
1613.4 599921882 590966582 579629242 569157302 559153795 547558010 535533190 523146510
1627.6 523146510 509878933 497096270 483679742 466540217 449152350 433581889 417375922
1641.9 417375922 399643570 377707094 353328913 333119333 308458924 273334473 245498568
1656.2 245498568 221848831 195606679 166344821 138239354 115919955 97023875 81361495
1670.5 81361495 71881808 66531599 63362069 61981190 61393984 61188191 61170701 61179005 60803302 60175318
$$ packed form
1568.5F36916995j6987085j8763602k4307966l8423062m4010520m3322056m6441406
1582.8D04661298m0738672j3654709J7849207K8981000L3612311M7702134N4410874
1597E32823443M3125511K5739252J2289763L942907j037777m103124n860329o997764
1613.4E99921882q955300j1337340j0471940j0003507j1595785j2024820j2386680
1627.6E23146510j3267577j2782663j3416528j7139525j7387867j5570461j6205967
1641.9D17375922j7732352k1936476k4378181k0209580k4660409l5124451k7835905
1656.2B45498568k3649737k6242152k9261858k8105467k2319399j8896080j5662380
1670.5H1361495r479687n350209l169530j380879n87206k05793j7490Q304l75703o27984
$$ plain form
1690.9 60175318 59467040 59006568 59219871 60959864 65256879 71232393 79791121 92297323 107996523
1709.2 107996523 126891822 149918348 179272488 218958676 261622816 298587829 334729701
1723.5 334729701 371164232 405253857 436594784 464869082 494275272 521630824 541451454
1737.8 541451454 559391975 576561511 591528356 605822802 619582891 632981241 645488739
1752 645488739 655755639 664398909 671727955 677270770 681373119 684055030 685392082 686173499 687515736
1770.4 687515736 690926015 695779204 700154305 703980923 707925498 712315321 716995299 721490562
1786.7 721490562 725166678 728299320 731311858 733842671 735619903 736932993 738189459 739659548
1803 739659548 741308808 742905021 744382977 745788038 747165024 748486876 749915659 751505136 753035307
$$ packed form
1690.9F0175318p08278m60472K13303J739993M297015N975514Q558728J2506202J5699200
1709.2A07996523J8895299K3026526K9354140L9686188M2664140L6965013L6141872
1723.5C34729701L6434531L4089625L1340927K8274298K9406190K7355552J9820630
1737.8E41451454J7940521J7169536J4966845J4294446J3760089J3398350J2507498
1752F45488739J0266900Q643270P329046N542815M102349K681911J337052P81417J342237
1770.4F87515736L410279M853189M375101L826618L944575M389823M679978M495263
1786.7G21490562L676116L132642L012538K530813J777232J313090J256466J470089
1803G39659548J649260J596213J477956J405061J376986J321852J428783J589477J530171
$$ plain form
1821.4 753035307 754399061 755711913 756857812 757767975 758651614 759372771 759744585 759792268 759671986
1839.8 759671986 759313166 758670151 758081853 757635534 757009447 755993068 754551768 752652764 750497580
1858.1 750497580 748843133 748761773 750561833 753577054 757116377 760503292 763095319 765002370 766637862
1876.5 766637862 768113017 769405186 770541489 771525860 772178710 772451937 772493184 772315323 771898389
1894.8 771898389 771485031 771314204 771319330 771351278 771300018 771053433 770501614 769705772 768749595 767608047
1915.2 767608047 766316354 765097797 764027476 763044477 762243330 761616528 761095345 760606647 760157704
1933.6 760157704 759984493 760418415 761542857 763170302 764935732 766467869 767729819 768814087 769711733
1951.9 769711733 770340562 770624578 770369768 769271851 767113924 763834596 759682894 755881906 754371464
$$ packed form
1821.4G53035307J363754J312852J145899R10163Q83639P21157L71814M7683j20282
1839.8G59671986l58820o43015n88298m46319o26087j016379j441300j899004k155184
1858.1G50497580j654447q1360J800060L015221L539323L386915K592027J907051J635492
1876.5G66637862J475155J292169J136303R84371O52850K73227M1247j77861m16934
1894.8G71898389m13358j70827N126L1948n1260k46585n51819p95842r56177j141548
1915.2G67608047j291693j218557j070321r82999q01147o26802n21183m88698m48943
1933.6G60157704j73211M33922J124442J627445J765430J532137J261950J084268Q97646
1951.9G69711733O28829K84016k54810j097917k157927l279328m151702l800988j510442
$$ plain form
1970.3 754371464 756024182 759879291 764230371 767971635 770735860 772558451 773622274 774128854
1986.6 774128854 774172306 773750126 772893488 771597505 769759238 767398059 764875352 762847722 762050211
2005 762050211 762716472 764237463 765674591 766513824 766729712 766435623 765690744 764514863 762920737
2023.3 762920737 761079252 759325624 757565141 755482376 753170073 750893354 748757005 746769130
2039.6 746769130 744966805 743386567 742040455 740993440 740343809 740098774 740207016 740652740 741414011
2058 741414011 742389977 743470669 744595230 745708704 746735454 747603714 748258352 748631299 748716116
2076.4 748716116 748554349 748132944 747462094 746630847 745722234 744836390 744086444 743518233 743087471 742743969
2096.8 742743969 742547512 742585838 742894530 743526042 744546175 745878577 747322917 748723626 749987543
$$ packed form
1970.3G54371464J652718L855109M351080L741264K764225J822591J063823N06580
1986.6G74128854M3452m22180q56638j295983j838267k361179k522707k027630p97511
2005G62050211O66261J520991J437128Q39233K15888k94089p44879j175881j594126
2023.3G62920737j841485j753628j760483k082765k312303k276719k136349j987875
2039.6G46769130j802325j580238j346112j047015o49631k45035J08242M45724P61271
2058G41414011R75966J080692J124561J113474J026750Q68260O54638L72947Q4817
2076.4G48716116j61767m21405o70850q31247r08613q85844p49946n68211m30762l43502
2096.8G42743969j96457L8326L08692O31512J020133J332402J444340J400709J263917
$$ plain form
2115.1 749987543 751001835 751698732 752140045 752397537 752462149 752337456 752110779 751834095 751506209 751201808
2135.5 751201808 751007497 750873387 750703990 750438213 750007629 749422550 748820066 748278558 747687876 746959209
2155.9 746959209 746142626 745264053 744307220 743321002 742301404 741196156 740122437 739182651 738278925
2174.3 738278925 737336695 736411214 735520065 734597564 733618021 732603312 731530428 730343819 729028225
2192.6 729028225 727636039 726207316 724732757 723256528 721829712 720429659 719019651 717640519
2208.9 717640519 716384768 715375483 714762211 714524865 714431286 714347601 714360714 714533806 714792132 715064168
2229.3 715064168 715350688 715618968 715753376 715668142 715354741 714810848 714051604 713124573 712111890 711157620
2249.7 711157620 710350931 709700763 709210038 708826900 708446383 708024204 707547069 706973016 706317723 705651641
$$ packed form
2115.1G49987543J014292O96897M41313K57492O4612j24693k26677k76684l27886l04401
2135.5G51201808j94311j34110j69397k65777m30584n85079o02484n41508n90682p28667
2155.9G46959209q16583q78573r56833r86218j019598j105248j073719r39786r03726
2174.3G38278925r42230r25481q91149r22501r79543j014709j072884j186609j315594
2192.6G29028225j392186j428723j474559j476229j426816j400053j410008j379132
2208.9G17640519j255751j009285o13272k37346r3579q3685J3113J73092K58326K72036
2229.3G15064168K86520K68280J34408q5234l13401n43893p59244r27031j012683r54270
2249.7G11157620q06689o50168m90725l83138l80517m22179m77135n74053o55293o66082
$$ plain form
2270.1 705651641 704963326 704162180 703241050 702247798 701182246 700036466 698818982 697532415 696219802
2288.5 696219802 694965124 693805039 692692518 691556215 690373361 689123213 687810123 686525881
2304.8 686525881 685295403 683966100 682431698 680785894 679134607 677457273 675726891 674052060
2321.1 674052060 672513008 671071172 669760048 668709219 667903423 667101920 666132927 665026307 663863778
2339.5 663863778 662731826 661678612 660625875 659436822 657969058 656178176 654376090 653156936
2355.8 653156936 652716219 652665496 652543306 652228653 651705265 650934756 649999976 648970425 647853255
2374.1 647853255 646624863 645281196 643831789 642267823 640610695 638861299 636981905 634967089
2390.4 634967089 632850051 630680919 628490329 626290858 624131978 622072160 620099425 618169248
$$ packed form
2270.1G05651641o88315q01146r21130r93252j065552j145780j217484j286567j312613
2288.5F96219802j254678j160085j112521j136303j182854j250148j313090j284242
2304.8F86525881j230478j329303j534402j645804j651287j677334j730382j674831
2321.1F74052060j539052j441836j311124j050829q05796q01503r68993j106620j162529
2339.5F63863778j131952j053214j052737j189053j467764j790882j802086j219154
2355.8F53156936m40717n0723j22190l14653n23388p70509r34780j029551j117170
2374.1F47853255j228392j343667j449407j563966j657128j749396j879394k014816
2390.4F34967089k117038k169132k190590k199471k158880k059818j972735j930177
$$ plain form
2406.8 618169248 616258621 614311934 612285376 610286772 608469784 606833279 605321586 603929877
2423.1 603929877 602621496 601325572 600008845 598662615 597227037 595646858 593953311 592166185
2439.4 592166185 590224743 588118136 585916579 583652139 581342518 579054177 576798439 574471712
2455.7 574471712 572000682 569388449 566605508 563592255 560349226 556931853 553381860 549736321
2472 549736321 546070218 542479634 539000154 535597146 532203913 528692603 524925590 520849943 516447425
2490.4 516447425 511707604 506707013 501602113 496487021 491270125 485785723 479978442 473868728
2506.7 473868728 467477292 460890830 454290032 447868645 441843688 436482221 432066888 428919464
2523 428919464 427347034 427504748 429325402 432544500 436758876 441459447 446175098 450628102 454712272
$$ packed form
2406.8F18169248j910627j946687k026558j998604j816988j636505j511693j391709
2423.1F03929877j308381j295924j316727j346230j435578j580179j693547j787126
2439.4E92166185j941442k106607k201557k264440k309621k288341k255738k326727
2455.7E74471712k471030k612233k782941l013253l243029l417373l549993l645539
2472E49736321l666103l590584l479480l403008l393233l511310l767013m075647m402518
2490.4E16447425m739821n000591n104900n115092n216896n484402n807281o109714
2506.7D73868728o391436o586462o600798o421387o024957n361467m415333l147424
2523D28919464j572430J57714J820654L219098M214376M700571M715651M453004M084170
$$ plain form
2541.4 454712272 458442688 461909831 465201318 468383640 471511990 474609852 477627486 480427951
2557.7 480427951 482878953 484945863 486631274 487915486 488822997 489404976 489661872 489556968 489035189
2576 489035189 488062143 486649930 484864861 482810050 480555326 478177637 475800812 473506123 471307516
2594.4 471307516 469197839 467151672 465114504 463040560 460921466 458736092 456428677 453929931
2610.7 453929931 451179773 448137641 444757938 441039592 437049419 432842672 428440958 423851699
2627 423851699 419083565 414183050 409256637 404440969 399807572 395337015 391050696 387068003 383530617
2645.4 383530617 380616903 378569335 377611786 377907693 379617035 382867932 387576401 393385142 399795622
2663.7 399795622 406318069 412551552 418273538 423439115 428059429 432216853 436051875 439621508
$$ packed form
2541.4D54712272L730416L467143L291487L182322L128350L097862L017634K800465
2557.7D80427951K451002K066910J685411J284212R07511N81979K56896j04904n21779
2576D89035189r73046j412213j785069k054811k254724k377689k376825k294689k198607
2594.4D71307516k109677k046167k037168k073944k119094k185374k307415k498746
2610.7D53929931k750158l042132l379703l718346l990173m206747m401714m589259
2627D23851699m768134m900515m926413m815668m633397m470557m286319l982693l537386
2645.4C83530617k913714k047568r57549K95907J709342L250897M708469N808741O410480
2663.7C99795622O522447O233483N721986N165577M620314M157424L835022L569633
$$ plain form
2680.1 439621508 442898005 445888460 448607296 451012254 453097910 454912305 456478566 457821757
2696.4 457821757 459008873 460084677 461026728 461791813 462353736 462671638 462718427 462541163 462173134
2714.7 462173134 461566478 460664421 459441453 457927525 456228822 454443753 452686459 451106906 449750513
2733.1 449750513 448559612 447459131 446379989 445281774 444129437 442863733 441446483 439858139
2749.4 439858139 438100427 436227888 434287518 432285279 430226475 428125471 425992638 423826069
2765.7 423826069 421608865 419350863 417054534 414664924 412131071 409432501 406566292 403540701
2782 403540701 400345236 396968365 393429935 389780074 386103481 382448494 378865659 375482172 372398198
2800.4 372398198 369660169 367320329 365438044 364077330 363304138 363128632 363459557 364109576 364820480
$$ packed form
2680.1D39621508L276497K990455K718836K404958K085656J814395J566261J343191
2696.4D57821757J187116J075804R42051P65085N61923L17902M6789j77264l68029
2714.7D62173134o06656r02057j222968j513928j698703j785069j757294j579553j356393
2733.1D49750513j190901j100481j079142j098215j152337j265704j417250j588344
2749.4D39858139j757712j872539j940370k002239k058804k101004k132833k166569
2765.7D23826069k217204k258002k296329k389610k533853k698570k866209l025591
2782D03540701l195465l376871l538430l649861l676593l654987l582835l383487l083974
2800.4C72398198k738029k339840j882285j360714p73192j75506L30925O50019P10904
$$ plain form
2818.8 364820480 365338475 365465045 365022331 363915116 362203717 359988540 357356429 354427069 351301461
2837.1 351301461 347967803 344415933 340792358 337229311 333721071 330276996 326988399 323932648
2853.4 323932648 321104437 318447441 315872312 313310206 310819864 308505118 306405365 304554552
2869.7 304554552 302967399 301449627 299828857 298311085 297072470 296020985 295079738 294246018 293570518
2888.1 293570518 293134362 292987257 293122858 293465346 294029921 295024872 296545684 298430264 300524026
2906.5 300524026 302843332 305437148 308161259 310751557 313116699 315326929 317419052 319406182
2922.8 319406182 321238518 322836399 324080259 324694067 324605048 324031532 323095053 321846038 320406944
2941.1 320406944 318811148 316942215 314704329 312266290 309931457 307649314 305340707 303254664
$$ packed form
2818.8C64820480N17995J26570m42714j107215j711399k215177k632111k929360l125608
2837.1C51301461l333658l551870l623575l563047l508240l444075l288597l055751
2853.4C23932648k828211k656996k575129k562106k490342k314746k099753j850813
2869.7C04554552j587153j517772j620770j517772j238615j051485r41247q33720o75500
2888.1B93570518m36156j47105J35601L42488N64575R94951J520812J884580K093762
2906.5C00524026K319306K593816K724111K590298K365142K210230K092123J987130
2922.8C19406182J832336J597881J243860O13808q9019n73516r36479j249015j439094
2941.1C20406944j595796j868933k237886k438039k334833k282143k308607k086043
$$ plain form
2957.4 303254664 301508039 300032884 298795015 297780544 296989739 296423584 296066672 295817375 295519650
2975.8 295519650 295173407 294795394 294206917 293351650 292365074 291295558 290156424 288918614 287533879
2994.2 287533879 286148816 284866393 283661723 282627821 281843960 281332850 281204075 281488419 281949371
3012.5 281949371 282327533 282655358 283126056 283870459 284945220 286228687 287555814 288979083 290582508
3030.9 290582508 292368859 294218689 296042114 298010916 300080061 301845849 303073883 303821534
3047.2 303821534 304212540 304145485 303512424 302597970 301704407 300842941 299928784 298883379 297557682
3065.5 297557682 295694470 293286920 290880889 289161593 288458169 288564503 288861364 288964689 289070129
3083.9 289070129 289555669 290539235 291671306 292706281 294207752 296797544 300287694 304078579 307790339
$$ packed form
2957.4C03254664j746625j475155j237869j014471p90805n66155l56912k49297k97725
2975.8B95519650l46243l78013n88477q55267r86576j069516j139134j237810j384735
2994.2B87533879j385063j282423j204670j033902p83861n11110j28775K84344M60952
3012.5B81949371L78162L27825M70698P44403J074761J283467J327127J423269J603425
3030.9B90582508J786351J849830J823425J968802K069145J765788J228034P47651
3047.2C03821534L91006o7055o33061r14454q93563q61466r14157j045405j325697
3065.5B97557682j863212k407550k406031j719296p03424J06334K96861J03325J05440
3083.9B89070129M85540R83566J132071J034975J501471K589792L490150L790885L711760
$$ plain form
3102.2 307790339 311413765 315058231 318679184 322178245 325746804 329567105 333363086 336862683
3118.6 336862683 340029746 342911422 345749795 348727047 351727515 354589850 357297987 359946728
3134.9 359946728 362599015 365189314 367664427 370125860 372728258 375554204 378632128 381945699
3151.2 381945699 385358006 388753980 392175674 395676285 399233729 402762741 406186193 409467101
3167.5 409467101 412586898 415602803 418654084 421802610 425016910 428316832 431739241 435264021
3183.8 435264021 438804746 442278177 445664227 448984176 452308238 455683827 459047943 462391883
3200.1 462391883 465802997 469281793 472766042 476230472 479688704 483122200 486530632 489920080
3216.5 489920080 493231714 496464491 499698609 502940476 506131709 509297192 512505352 515741408
$$ packed form
3102.2C07790339L623426L644466L620953L499061L568559L820301L795981L499597
3118.6C36862683L167063K881676K838373K977252L000468K862335K708137K648741
3134.9C59946728K652287K590299K475113K461433K602398K825946L077924L313571
3151.2C81945699L412307L395974L421694L500611L557444L529012L423452L280908
3167.5D09467101L119797L015905L051281L148526L214300L299922L422409L524780
3183.8D35264021L540725L473431L386050L319949L324062L375589L364116L343940
3200.1D62391883L411114L478796L484249L464430L458232L433496L408432L389448
3216.5D89920080L311634L232777L234118L241867L191233L165483L208160L236056
$$ plain form
3232.8 515741408 518919885 522068083 525272727 528496444 531745017 535084903 538455486 541785538
3249.1 541785538 545091689 548384070 551693738 555010557 558282793 561539769 564815879 568094254
3265.4 568094254 571314991 574425995 577465832 580480933 583451748 586346924 589145601 591837287
3281.7 591837287 594426036 596908092 599256516 601472199 603597105 605633795 607571006 609401166
3298 609401166 611089230 612600863 613909543 615081668 616250694 617461741 618602276 619565070 620428503
3316.4 620428503 621258676 622031033 622743249 623436391 624191999 625004232 625759244 626410961 626965523 627428055
3336.8 627428055 627922356 628517985 629074097 629487813 629730463 629814684 629917562 630115509 630216181 630110979
3357.2 630110979 629865646 629525661 629067361 628477097 627819180 627220929 626774013 626367748 625822902 625173509
$$ packed form
3232.8E15741408L178477L148198L204644L223717L248573L339886L370583L330052
3249.1E41785538L306151L292381L309668L316819L272236L256976L276110L278375
3265.4E68094254L220737L111004L039837L015101K970815K895176K798677K691686
3281.7E91837287K588749K482056K348424K215683K124906K036690J937211J830160
3298F09401166J688064J511633J308680J172125J169026J211047J140535R62794Q63433
3316.4F20428503Q30173P72357P12216O93142P55608Q12233P55012O51717N54562M62532
3336.8F27428055M94301N95629N56112M13716K42650Q4221J02878J97947J00672j05202
3357.2F30110979k45333l39985m58300n90264o57917n98251m46916m06265n44846o49393
$$ plain form
3377.6 625173509 624534070 623951375 623391747 622779787 622116625 621407568 620763361 620344818 619990826 619442761
3398 619442761 618822813 618436992 618236542 617950201 617544651 617128611 616752326 616479158 616288483 616042197
3418.4 616042197 615747333 615539789 615423799 615307689 615189850 615182757 615342736 615559816 615822136 616246343
3438.8 616246343 616800487 617348969 617869973 618489444 619229198 619980931 620754838 621608138 622488797 623372078
3459.2 623372078 624301910 625258386 626204312 627182364 628159821 629007220 629785836 630664229 631649137 632613719
3479.6 632613719 633494616 634365082 635271609 636162937 637022078 637911379 638863981 639839113 640769362 641655684
3500 641655684 642563581 643503964 644437313 645387769 646459401 647675753 648858488 649926066 651024759
3518.3 651024759 652201235 653391421 654541314 655641258 656769753 657962441 659170508 660397410
$$ packed form
3377.6F25173509o39439n82695n59628o11960o63162p09057o44207m18543l53992n48065
3398F19442761o19948l85821k00450k86341m05550m16040l76285k73168j90675k46286
3418.4F16042197k94864k07544j15990j16110j17839p093J59979K17080K62320M24207
3438.8F16246343N54144N48482N21004O19471P39754P51733P73907Q53300Q80659Q83281
3459.2F23372078R29832R56476R45926R78052R77457Q47399P78616Q78393R84908R64582
3479.6F32613719Q80897Q70466R06527Q91328Q59141Q89301R52602R75132R30249Q86322
3500F41655684R07897R40383R33349R50456J071632J216352J182735J067578J098693
3518.3F51024759J176476J190186J149893J099944J128495J192688J208067J226902
$$ plain form
3534.6 660397410 661581457 662652969 663796365 665114164 666426063 667582870 668646336 669744670
3551 669744670 670907676 672101796 673307538 674482644 675604165 676664591 677723348 679062009 680657208
3569.3 680657208 682118118 683435261 684825957 686310112 687834859 689380288 690836310 692181826
3585.6 692181826 693638265 695276201 696849763 698334038 699889123 701515079 703110814 704672098
3601.9 704672098 706155479 707464814 708745480 710121632 711485922 712782919 713965237 715161085
3618.3 715161085 716559410 717883587 718835950 719467461 720185697 721251428 722270846 723134577 723919392
3636.6 723919392 724601746 725178421 725639939 725894988 725924790 726167262 726907909 727588594 727981687 728392601
3657 728392601 728879452 729150534 729144394 728976309 728640079 728223801 727968931 727747440 727487624 727478921 727635860
$$ packed form
3534.6F60397410J184047J071512J143396J317799J311899J156807J063466J098334
3551F69744670J163006J194120J205742J175106J121521J060426J058757J338661J595199
3569.3F80657208J460910J317143J390696J484155J524747J545429J456022J345516
3585.6F92181826J456439J637936J573562J484275J555085J625956J595735J561284
3601.9G04672098J483381J309335J280666J376152J364290J296997J182318J195848
3618.3G15161085J398325J324177R52363O31511P18236J065731J019418Q63731P84815
3636.6G23919392O82354N76675M61518K55049K9802K42472P40647O80685L93093M10914
3657G28392601M86851K71082o140j68085l36230m16278k54870k21491k59816q703J56939
$$ plain form
3679.4 727635860 727725208 727696896 727588713 727462709 727369726 727436244 727682650 727939665 728131354 728257716
3699.8 728257716 728345811 728441477 728387177 728044152 727578521 727349877 727391958 727375090 727158308 726796269
3720.2 726796269 726347983 725927472 725631297 725344718 724858105 724144280 723474383 723108470 722838759 722235620
3740.6 722235620 721195936 720189035 719753146 719608009 719698787 720257759 720823586 720991015 720978379 721086919
3761 721086919 721181571 721105158 720904887 720703304 720554173 720367849 720153034 719966590 719751716 719476104
3781.4 719476104 719188333 718921602 718693495 718508244 718263328 717812955 717222512 716668546 716124535 715652585
3801.8 715652585 715416014 715235770 715044975 714860857 714519322 713976979 713411331 712958574 712549806 712281108
3822.2 712281108 712168097 711993992 711745799 711452723 711083591 710747659 710433602 710082412 709937394 709995806
$$ packed form
3679.4G27635860Q9348k8312j08183j26004r2983O6518K46406K57015J91689J26362
3699.8G28257716Q8095R5666n4300l43025m65631k28644M2081j6868k16782l62039
3720.2G26796269m48286m20511k96175k86579m86613p13825o69897l65913k69711o03139
3740.6G22235620j039684j006901m35889j45137R0778N58972N65827J67429j2636J08540
3761G21086919R4652p6413k00271k01583j49131j86324k14815j86444k14874k75612
3781.4G19476104k87771k66731k28107j85251k44916m50373n90443n53966n44011m71950
3801.8G15652585k36571j80244j90795j84118l41535n42343n65648m52757m08768k68698
3822.2G12281108j13011j74105k48193k93076l69132l35932l14057l51190j45018N8412
$$ plain form
3842.6 709995806 710010827 709842026 709423184 708696544 707874835 707678795 707908869 707911909 707612991 707196295
3863 707196295 706889510 706602156 706170082 705789447 705535948 705321550 705063403 704628468 704155087 703773975
3883.4 703773975 703439891 703149617 702792048 702380896 702066779 701695502 701041102 700170040 699217558 698359072
3903.8 698359072 697859466 697679460 697675049 697883427 698263645 698663712 699000597 699240088 699378669 699441016
3924.2 699441016 699465454 699411690 699258327 699121416 699044466 698921800 698675931 698363066 698108077 697930396
3944.6 697930396 697726548 697453201 697182715 696955085 696714044 696449399 696222603 696033001 695825696 695549428
3965 695549428 695205510 694862723 694556057 694268823 694022775 693823993 693598747 693341017 693142712 692989051
3985.4 692989051 692750573 692421317 692140520 691942155 691773713 691618383
$$ packed form
3842.6G09995806J5021j68801m18842p26640q21709j96040K30074L040k98918m16696
3863G07196295l06785k87354m32074l80635k53499k14398k58147m34935m73381l81112
3883.4G03773975l34084k90274l57569m11152l14117l71277o54400q71062r52482q58486
3903.8F98359072m99606j80006m411K08378L80218M00067L36885K39491J38581O2347
3924.2F99441016K4438n3764j53363j36911p6950j22666k45869l12865k54989j77681
3944.6F97930396k03848k73347k70486k27630k41041k64645k26796j89602k07305k76268
3965F95549428l43918l42787l06666k87234k46048j98782k25246k57730j98305j53661
3985.4F92989051k38478l29256k80797j98365j68442j55330
$$ plain form
3997.6 691618383
$$ packed form
3997.6F91618383
##END=$$ End of the data block
