##TITLE=B8M - Joseane - Chalcona $$ Begin of the data block
##JCAMP-DX=5.00 $$ ACD/SpecManager v 10.08
##SPECTROMETER/DATA SYSTEM=Alpha
##DATE=13 Apr 2015 08:10:36
##DATA TYPE=INFRARED SPECTRUM
##DATA CLASS=XYDATA
##ORIGIN=
##OWNER=
##NPOINTS=1765
##FIRSTX=399.76428223
##LASTX=3997.64306641
##MAXX=3997.64306641
##MINX=399.76428223
##MAXY=0.87357152
##MINY=0.48706621
##XFACTOR=1.0000000000
##YFACTOR=1.000000000000000e-9
##FIRSTY=0.85149163
##DELTAX=2.03961372
##XUNITS=1/CM
##YUNITS=ARBITRARY UNITS
##XYDATA=(X++(Y..Y))
399.8H51491630P718563L223896L362298L384590l06844l490091j887202J410484J630843
418.1H66538167j769125l208459O7055M058361K921939j769304l096044P76172M155695
436.5H68674457J704812l342271m143595K9146K358735j360357o557465o665408j885295
454.8H48812759K115130J986325J30713J252830M470766M892409J164674k235770r44018
473.2H61645818K431094J925409k180159m774272l211022j489818n957007j8024445
489.5H30365598l2947004l7731051j8424749J5548586L5262585L1862438K0389616
503.8H44326019J1753559N101920m69685k231360l42786Q09252j909554o257414p884622
522.1H42895329n872667j796663J923681L399312M082918N437434N567372K679169
$$ y = [851491630, 859210193, 862434089, 865796387, 869180977, 868874133, 865384042, 863496840, 864907324, 866538167, 864769042, 861560583, 861627638, 865685999, 868607938, 866838634, 863742590, 864518762, 868674457, 870379269, 867036998, 862893403, 862922549, 865281284, 863920927, 857363462, 850698054, 848812759, 850927889, 852914214, 853044927, 854297757, 858768523, 863660932, 864825606, 862589836, 861645818, 864076912, 866002321, 863822162, 859047890, 855836868, 854347050, 848390043, 830365598, 797418594, 759687543, 741262794, 756811380, 792073965, 823936403, 844326019, 856079578, 861181498, 860711813, 858480453, 858137667, 858946919, 857037365, 850779951, 842895329, 837022662, 835225999, 837149680, 840548992, 844631910, 850069344, 855636716, 858315885]
538.5H58315885n55694m80235J921535K643049L42846j965464j406073J034438J866579
556.8H61716866j17123k155482j326025J198113J901686p0274j965105j160622J048267
575.2H59070301J645505j61707j830339j044453J050532J442075l64542j686394p41661
593.5H57379317J105964J374066j49667j502037q45253P58946R10758q23080l007412
611.9H55201602l630936r99749K277017J244545j928449l626764o439686j1751711
628.2H30345869j3285637j3293445r009540J3545454L0813574K0445586M951059J51098
644.5H64664018O22749P32780q47876k254188j898468p33554p89762k708137m647195
662.9H52140367m528522n535067r620785p790268m644036n498409r591818j8052817
$$ y = [858315885, 857760191, 857279956, 859201491, 861844540, 862187386, 860221922, 858815849, 859850287, 861716866, 861599743, 859444261, 858118236, 859316349, 861218035, 861147761, 859182656, 858022034, 859070301, 860715806, 860554099, 858723760, 857679307, 858729839, 860171914, 859807372, 858120978, 857379317, 858485281, 859859347, 859709680, 858207643, 857362390, 858121336, 859032094, 858209014, 855201602, 851570666, 850570917, 852847934, 854092479, 852164030, 848537266, 842097580, 830345869, 817060232, 803766787, 794757247, 808302701, 839116275, 859561861, 864512920, 864664018, 865286767, 866019547, 865171671, 862917483, 861019015, 860285461, 859495699, 856787562, 852140367, 847611845, 842076778, 832455993, 824665725, 820021689, 814523280, 804931462, 786878645]
679.2G86878645l2783746m5657277l9364875j3889372J5916049M1610241N1742852
693.5G64452517M1195989K5225937J4450669P363677J950562m861056j8755258l2929539
709.8G98093498k0125270J4818966K9321313K0458043J2757063Q355677M012406K064824
726.1H69756520K166509J648486k11000j641572j216829J20402K91943j071632k286911
744.5H67555916j848519o31630n38111j885473l009677k672673k007067k977967n966008
762.8H46018791j0209083j7030418l1233967n4207623o7781686m1221083K2047699
777.1F46382630P1168959P0567012M0548265J5083492J820802p851362k0811021l0810237
793.4G86098540j6368210J9980967L8135767K5379478Q121849R7751k668261m727245
$$ y = [786878645, 754094899, 708437622, 669072747, 655183375, 671099424, 712709665, 764452517, 805648506, 830874443, 845325112, 852688789, 854639351, 849778295, 831023037, 798093498, 777968228, 792787194, 822108507, 842566550, 855323613, 863679290, 867691696, 869756520, 871923029, 873571515, 873360515, 871718943, 870502114, 870622516, 870914459, 869842827, 867555916, 865707397, 865075767, 864537656, 862652183, 859642506, 856969833, 854962766, 851984799, 846018791, 835809708, 818779290, 787545323, 733337700, 665556014, 624334931, 646382630, 717551589, 788118601, 828666866, 843750358, 845571160, 837719798, 816908777, 786098540, 769730330, 789711297, 827847064, 853226542, 861348391, 861446142, 858777881, 854050636]
809.7H54050636q802652j7031312l2407105n0538540n3969502k7311802K1105110N4003716
826G39098549M9937844L1617403J9617021J2145937O409406L063858J850009J549840
842.4H65289867J271307M92871j82748j44124N2393k65241p87675j247347k064228
860.7H62415075l809690o148160n617141L25203O497323O521285K011120k396166l588379
879.1H56210470n95748L326535M176676K388239P47502K11954K91169J51574m23431
897.4H66484940p94232m49240P8797l5822o16074r58979o31630p8321r8526q12173
917.8H62088740j473427j544237j367152j545250j653075r03190N8115L39031l43084
936.2H53656471j791656l310204m712522n806863l727675J753688M289508K075613
$$ y = [854050636, 845247984, 828216672, 795809567, 745271027, 691301525, 663989723, 685094833, 739098549, 789036393, 820653796, 840270817, 852416754, 858826160, 861890018, 863740027, 865289867, 866561174, 867054045, 866871297, 866727173, 866779566, 866514325, 865726650, 864479303, 862415075, 858605385, 852457225, 846840084, 847165287, 853662610, 860183895, 862195015, 859798849, 856210470, 855614722, 858941257, 863117933, 865506172, 866253674, 866465628, 866756797, 866908371, 866484940, 865690708, 865241468, 865320265, 865284443, 864668369, 863709390, 863077760, 862999439, 862900913, 862088740, 860615313, 859071076, 857703924, 856158674, 854505599, 853602409, 853660524, 853999555, 853656471, 851864815, 848554611, 843842089, 838035226, 834307551, 836061239, 840350747, 842426360]
952.5H42426360k64585j194418k041757k878129l028632k819240l520429n762339q967518
970.9H11949313j2786389j7453313k1164774k2800863k4544060j9593478M95494K2007048
987.2G16108978K7374863K1307826J4854968Q375585k59042p718324j0708809j3532579
1003.5G55803466k2732079l8368583m7180891l4006774p592738J9829631M7497809
1017.8F73249841O2224447N3434253L2243669J1617601o970107k0046711j5127957
1032G90625036N342960J9352019J7777085J0198951M455566J799286J049340O12914
1048.4H51213157l91304j455844j648962j127422j060128k164960l654957m387677
1064.7H35321903m594028n650759p842004j0543287j3325035j4182866r555578m31061
$$ y = [842426360, 842161775, 840967357, 838925600, 836047471, 833018839, 830199599, 826679170, 820916831, 811949313, 799162924, 781709611, 760544837, 737743974, 713199914, 693606436, 694101930, 716108978, 743483841, 764791667, 779646635, 788022220, 787763178, 780044854, 769336045, 755803466, 733071387, 694702804, 647521913, 613515139, 605922401, 625752032, 673249841, 735474288, 788908541, 821152210, 832769811, 825799704, 805752993, 790625036, 795967996, 815320015, 833097100, 843296051, 847751617, 849550903, 850600243, 851213157, 850821853, 849366009, 847717047, 846589625, 845529497, 843364537, 839709580, 835321903, 830727875, 825077116, 817235112, 806691825, 793366790, 779183924, 769628346, 769197285]
1081G69197285N653024L887474k733588r157181j1327564n123854Q730352K0773530
1097.3G79899478K1590114J2209773Q16226m187107J891255J1795938J3080001O729364
1113.6H43825042J634658K04324J79530j52112p10368o87658n6923L09050k62439j255691
1134H43027413j667976j284481r51349j287878j865208j865923j276195j009107j876712
1152.4H29942584l627419m758537l652454r84132J29163j665294m772961q160830j2077271
1170.7G90372849j2340546m278958L084540p1048l239394M992724J4101922J1666358
1187.1H04288447L545701j304984l233194n376637q886457j3219118j5500307j1734843
1203.4G48578608o873190j1441231k4104118l6334992m1849852l2694578n387127K8376937
$$ y = [769197285, 774850309, 778737783, 776004195, 766847014, 755519450, 750395596, 759125948, 779899478, 801489592, 813699365, 814515591, 810328484, 812219739, 824015677, 837095678, 843825042, 845459700, 845664024, 845843554, 845691442, 844981074, 844293416, 844236493, 844545543, 844283104, 843027413, 841359437, 840074956, 839123607, 837835729, 835970521, 834104598, 832828403, 831819296, 829942584, 826315165, 821556628, 817904174, 816920042, 817049205, 815383911, 810610950, 802450120, 790372849, 778032303, 773753345, 776837885, 776766837, 773527443, 778520167, 792622089, 804288447, 807834148, 806529164, 803295970, 797919333, 789032876, 775813758, 760313451, 748578608, 741705418, 730264187, 706160069, 669825077, 627975225, 595280647, 589893520, 618270457]
1219.7F18270457M9811482N1820576M1936934L0230701K1209956J4852404J0282517
1234H38415027O606936L333807J091957J58608l28779r97067j587629j704991j631856
1252.3H43356013k012491k972722l871560m181385m198790m315555m362047m716277
1268.6H12725186o522178j0244072j4975726j6292990p486045P909596J4580071P595360
1285G87289202l116429j1532366j7892420j5615761l85762J0959149P421076J232088
1301.3G58358777l875435j3528526k3965239k7498603j9874454k141594J7532825K9155970
1317.6G14163721K9022514J9958675P638514n312860j8120229k8144061l0332387j9287109
1333.9F69586778K305031J8364012J8074393J6360879K5168240L0692518K2985935
$$ y = [618270457, 668081939, 719902515, 761839449, 792070150, 813280106, 828132510, 838415027, 845021963, 848355770, 849447727, 849606335, 849277556, 848280489, 846692860, 844987869, 843356013, 841343522, 838370800, 834499240, 830317855, 826119065, 821803510, 817441463, 812725186, 806203008, 795958936, 780983210, 764690220, 757204175, 765113771, 779693842, 787289202, 784172773, 772640407, 754747987, 739132226, 738746464, 749705613, 757126689, 758358777, 754483342, 740954816, 716989577, 689490974, 669616520, 667474926, 685007751, 714163721, 743186235, 763144910, 770783424, 765470564, 747350335, 719206274, 688873887, 669586778, 671891809, 690255821, 708330214, 724691093, 749859333, 780551851, 803537786]
1348.2H03537786J1273742N882919O393492P088721N255997K452016P24613L20435
1364.5H42929721o3479j015484k027154k618254k641975k231360k520323l562510m226744
1382.9H22022438l952444l951251n217433p152915j0599911j5866816k1806836l2997072
1399.2G20477760l8909435j4072657L2812893N3584874L6815703J5712559M225910
1413.5H10647607K44438j542568l806054n307257o216825o704509o463289o504953
1429.8G74346590o174684n992949p655918q996606q345723j1793196k0762504k1787762
1446.1F82837248K678752L0935168K8295279J1353671K170324J129926J364708O48260
1462.4G61413336j14083k34426k90274j233816l034473m748702o591201r754300j5392840
$$ y = [803537786, 814811528, 820694447, 827087939, 834176660, 839432657, 841884673, 842609286, 842929721, 842866242, 841850758, 839823604, 837205350, 834563375, 832332015, 829811692, 826249182, 822022438, 818069994, 814118743, 808901310, 801748395, 791148484, 775281668, 753474832, 720477760, 681568325, 667495668, 700308561, 753893435, 790709138, 806421697, 810647607, 810892045, 809349477, 805543423, 800236166, 794019341, 787314832, 780851543, 774346590, 768171906, 762178957, 754523039, 745526433, 737180710, 725387514, 704625010, 682837248, 685516000, 716451168, 744746447, 756100118, 758270442, 759400368, 760765076, 761413336, 761299253, 761064827, 760774553, 759540737, 756506264, 751757562, 745166361, 735412061, 720019221]
1480.8G20019221k3098170k8296769k4377525k675056K5416374L3184349L2552898
1495G32725322L3097387K4678945J3128996O159365K393723R39250J178980P42793
1511.4H15044761k21968j209915j592040j581728j905561j910090j901746k093673
1527.7H02628040j977145k354980l058970k593994k484202l604353l504097l111124
1544G79939175l899217n156875o955146q246243q935452r593248j5863538k4393618
1560.3F96895838k2120536k0488977o935775J9024729K1770895p195354l0998408k6310683
1576.6F23641729J1224032K5200724K312482l0981183m7900796l9723098j2224496
1590.9E31549394J3801575J7786681k611577k8763235l5087525r609104L1316877N9447288
$$ y = [720019221, 696921051, 668624282, 644246757, 641571701, 666988075, 700172424, 732725322, 765822709, 790501654, 803630650, 809790015, 812183738, 813122988, 814301968, 815044761, 814822793, 813612878, 812020838, 810439110, 808533549, 806623459, 804721713, 802628040, 800650895, 798295915, 795236945, 792642951, 790158749, 786554396, 783050299, 779939175, 776039958, 770883083, 763927937, 755681694, 746746242, 737152994, 721289456, 696895838, 674775302, 654286325, 647350550, 666375279, 688146174, 680950820, 649952412, 623641729, 634865761, 660066485, 662378967, 631397784, 583496988, 543773890, 531549394, 545350969, 563137650, 560526073, 531762838, 496675313, 487066209, 518383086, 577830374]
1607.2E77830374O4472854N2583099L5450339K3823142J9789040J4982581R090543
1621.5G98021972M264593k03788l736556n372047m944801n167067p622481q425891
1637.8G66813934q022428q961796r780586j2570620j5424132j5188635l0288279o1792433
1654.1F04785025n1377118k8320312J037717M4742763O7806244N5456340M4127762
1668.4G38258421L8591028K6123404J7240882J2751401P810294M556298K631844J564860
1684.7H49528432J073182Q36432J095652J063943M46796l20732q30174p55310J8120
1703.1H52156341P9334P5698K41160K13266j20m52160p46191l32057M6133n6266j34528
1725.5H51090610l81052o78480p64191n09441K43783K88665j81913k67744j25110l15190
$$ y = [577830374, 642303228, 694886327, 730336666, 754159808, 773948848, 788931429, 798021972, 802286565, 802082777, 798346221, 792974174, 788029373, 782862306, 775239825, 766813934, 758791506, 749829710, 740049124, 727478504, 712054372, 696865737, 666577458, 604785025, 553407907, 525087595, 526125312, 570868075, 638674319, 694130659, 738258421, 776849449, 802972853, 820213735, 832965136, 840775430, 845331728, 847963572, 849528432, 850601614, 851438046, 852533698, 853597641, 854044437, 853723705, 852893531, 852138221, 852156341, 852235675, 852311373, 852552533, 852765799, 852765679, 852313519, 851567328, 851235271, 851281404, 851225138, 851090610, 850709558, 850031078, 849266887, 848757446, 849001229, 849289894, 849107981, 848840237, 848715127, 848399937]
1745.9H48399937p06851r39668n37097j79887l98099p30336j011252j093686p55191
1764.3H42047870p54356j231075j606762j482546l84867M75466M96566K89023L13044
1782.6H38162363N39898O42062L19957k63691l41355Q2969J00851k76386m97759l74019
1803H38094890k83301m73022p72596p59363l00586K20597M65214L41594l7014k99096
1823.4H36197317j95682k8372p8142l8445M8339M3095N4836j18256n58853q33034l91424
1845.9H34101379L0696r7871k81512j98365R4772K54094R3520j92523l49283m11749
1866.3H33043158l79264k15054k34961m17114m07993l10660m68910p76827q66115p40647
1886.7H28225613p95901j111388j631737k323747k822935k667249j444339N33223K059877
$$ y = [848399937, 847693086, 846753418, 846216321, 846036434, 845638335, 844907999, 843896747, 842803061, 842047870, 841293514, 840062439, 838455677, 836973131, 836588264, 837063730, 837560296, 837849319, 838162363, 838702261, 839344323, 839664280, 839400589, 839059234, 839142203, 839243054, 838966668, 838468909, 838094890, 837811589, 837338567, 836565971, 835806608, 835506022, 835726619, 836191833, 836533427, 836496413, 836197317, 836001635, 835973263, 835895121, 835856676, 835905015, 835948110, 836002946, 835884690, 835325837, 834492803, 834101379, 834132075, 834034204, 833752692, 833554327, 833649099, 833903193, 833996713, 833804190, 833454907, 833043158, 832663894, 832448840, 832213879, 831796765, 831388772, 831078112, 830609202, 829832375, 828966260, 828225613, 827429712, 826318324, 824686587, 822362840, 819539905, 816872656, 815428317, 815961540, 818021417]
1905H18021417K483666K077818J227855L60608q5294L8743M15385M12404J51456J35660
1925.4H25239718K80440K90811O2525k54929l51965j90378j28388l87728o30617n54145
1945.8H23375344l57151l03924n06699p87914q41677p21872p91192j073003j039981
1964.2H16951931k70963Q04484J160502N83172j76072m74811k60710Q3267J69754J1087
1984.6H18581641m8936J00494J70409L040k44796l57926k35915r2387k29776n03540
2005H17142308n54979l23415r7036j62781m31418n50866m18067l08037m46081n29408
2025.4H13320220j07468M54426N89967L26574p1585l06786k81631j89782k24590l19123
2045.8H13190222k63214m0651R8169m2319l07977l98100k42233n2154n7995k16842
$$ y = [818021417, 820505083, 822582901, 823810756, 824171364, 824086070, 824124813, 824540198, 824952602, 825104058, 825239718, 825520158, 825810969, 825873494, 825618565, 825266600, 825076222, 824947834, 824560106, 823929489, 823375344, 823018193, 822714269, 822207570, 821419656, 820577979, 819856107, 819064915, 817991912, 816951931, 816680968, 817485452, 818645954, 819229126, 819053054, 818578243, 818317533, 818400800, 818570554, 818581641, 818532705, 818633199, 818803608, 818806648, 818561852, 818203926, 817968011, 817875624, 817645848, 817142308, 816587329, 816263914, 816166878, 816004097, 815572679, 815021813, 814603746, 814295709, 813849628, 813320220, 813212752, 813667178, 814257145, 814583719, 814512134, 814205348, 813923717, 813733935, 813509345, 813190222, 812927008, 812886357, 812984526, 812942207, 812634230, 812236130, 811993897, 811941743, 811883748, 811666906]
2066.2H11666906k78115j57178j6510m7863j88649k22683j24275n7280j42634l06487
2086.6H10125232l72350k59996j19269j18255k12908k25067j18614l8147r2744k15590
2106.9H08352292k43307j40428J430L2068j01567k24292j95563r5606o7770j45793
2127.3H07171464k21193j83046p1227K145k8669j04249j22487p0394l0517r0778j89722
2149.8H06061327j78992q0288o0379j49429k34068k36570j74225j40130k12491k80738
2170.2H04314017k30252j40667r1076j42873k50339k64287j66774n7042n9068j95026
2190.6H02716613k75314j80662o2883q2850k28763l23951k36273q4877n8710j67966
2211H01014364k46644j88053j00493j48177l07799l77357k64585j26421j27793k36451
$$ y = [811666906, 811388791, 811231613, 811215103, 811167240, 810978591, 810755908, 810631633, 810574353, 810431719, 810125232, 809752882, 809492886, 809373617, 809255362, 809042454, 808817387, 808698773, 808660626, 808567882, 808352292, 808108985, 807968557, 807969987, 808002055, 807900488, 807676196, 807480633, 807385027, 807317257, 807171464, 806950271, 806767225, 806695998, 806698143, 806669474, 806565225, 806442738, 806372344, 806341827, 806251049, 806061327, 805882335, 805802047, 805741668, 805592239, 805358171, 805121601, 804947376, 804807246, 804594755, 804314017, 804083765, 803943098, 803852022, 803709149, 803458810, 803194523, 803027749, 802970707, 802911639, 802716613, 802441299, 802260637, 802197754, 802114904, 801886141, 801562190, 801325917, 801241040, 801182330, 801014364, 800767720, 800579667, 800479174, 800330997, 800023198, 799645841, 799381256, 799254835, 799127042, 798890591]
2231.4G98890591k78652j35362N7220N3048j48177k75135j69694j7226m8459k29120
2251.8G97699034l45170k54274p1823n6625k25961l36528k54512j15633j20163k92778
2272.2G95625567m50611m18186l22997l58642m29332l44515p3433K08676K67804J10626
2292.5G93814957j6928M2797J75774J57654J728l9458J02103K39551K10762q404j57476
2315G94523060O0499M15385M68373J92762l3737K5153J55807Q1122j15573j57953j1623
2337.4G95603275J25945M1187l59416q23796n80072L17513J085878J208722P94650
2355.8G97413886M23789K03311j46091o62863j066804j206696j172900j175166j237452
2374.1G91373014j209199j055419q52049o76691n59748m35113k50280j07170j21057
$$ y = [798890591, 798611939, 798476577, 798533797, 798586845, 798438668, 798163533, 797993839, 797976613, 797928154, 797699034, 797353864, 797099590, 797027767, 796971142, 796745181, 796408653, 796154141, 796038508, 795918345, 795625567, 795174956, 794756770, 794433773, 794075131, 793645799, 793301284, 793227851, 793436527, 793704331, 793814957, 793798029, 793840826, 794016600, 794174254, 794175982, 794136524, 794238627, 794478178, 794688940, 794680536, 794523060, 794583559, 794998944, 795467317, 795660079, 795626342, 795651495, 795807302, 795888424, 795772851, 795614898, 795603275, 795729220, 795770407, 795410991, 794587195, 794007123, 794324636, 795410514, 796619236, 797413886, 797837675, 798040986, 797894895, 797232032, 796165228, 794958532, 793785632, 792610466, 791373014, 790163815, 789108396, 788256347, 787579656, 787019908, 786584795, 786334515, 786227345, 786106288]
2392.5G86106288k16126k33591j45256n7161r2626k20179k64287j97947j71304k49505
2412.9G84258306l35813l27229j97709l7789q166p8738o1631N4777J16825P2241k0862
2435.3G83434212r0837r4354q3924j45972k48134k78353k35618k32279k90990l24607
2455.7G81409144k99394k43783k14159k71559l30269k75672j87337j72734k26915k90096
2476.1G78897226l07262k76864k54333k83837l20315l15130k55764j79588j56939j23501
2496.5G76423693j7703L9339l8385j65880k28345j87517j13546j02222j34528j36852
2516.9G75338054r5249o7234r3698j25349j27136j12832j00672j20700j70171k20239
2537.3G74104774k49982k63810k85804l07679l09170k82705k13980j40250j12832j05679
$$ y = [786106288, 785890162, 785656571, 785511315, 785454154, 785361528, 785141349, 784877062, 784679115, 784507811, 784258306, 783922493, 783595264, 783397555, 783359766, 783351600, 783272862, 783211231, 783266008, 783382833, 783455074, 783434212, 783343375, 783249021, 783165097, 783019125, 782770991, 782492638, 782257020, 782024741, 781733751, 781409144, 781109750, 780865967, 780651808, 780380249, 780049980, 779774308, 779586971, 779414237, 779187322, 778897226, 778589964, 778313100, 778058767, 777774930, 777454615, 777139485, 776883721, 776704133, 776547194, 776423693, 776405990, 776445329, 776406944, 776241064, 776012719, 775825202, 775711656, 775609434, 775474906, 775338054, 775242805, 775175571, 775081873, 774956524, 774829388, 774716556, 774615884, 774495184, 774325013, 774104774, 773854792, 773590982, 773305178, 772997499, 772688329, 772405624, 772191644, 772051394, 771938562, 771832883]
2557.7G71832883q2314n2869o1870j48713k68996l42369l55721l45289l22879k58088
2578.1G69593775j55806q5175p7844j11818j73331k32756k67565k96116k94089k01047
2598.5G67698228q2790m5777n1439m9948p1109j17004j19626k4080J37865K66254K66552
2620.9G67807126J65463P2658J1921n4002j21415j39058r3221o6817j36733k47419
2641.3G67198503k89142k41757j68860j31845j44839j59085j46568j58191j82032j52767
2661.7G65423417q7857m3571n9009j31190j96814j89245j09911m0471p6116j98602
2682.1G64290631k82586k77877k70664l04342l34859l02910k14160j82092k29776k56598
2702.5G61634767k02000p4446P391n4419j54615j51455r0420n7757r6262j97053k20537
$$ y = [771832883, 771750569, 771697700, 771635830, 771487117, 771218121, 770875752, 770520031, 770174742, 769851863, 769593775, 769437969, 769352794, 769274950, 769163132, 768989801, 768757045, 768489480, 768193364, 767899275, 767698228, 767615438, 767569661, 767518222, 767468274, 767397165, 767280161, 767160535, 767136455, 767274320, 767540574, 767807126, 767972589, 768045247, 768057168, 768003166, 767881751, 767742693, 767649472, 767582655, 767445922, 767198503, 766909361, 766667604, 766498744, 766366899, 766222060, 766062975, 765916407, 765758216, 765576184, 765423417, 765335560, 765291989, 765232980, 765101790, 764904976, 764715731, 764605820, 764565349, 764489233, 764290631, 764008045, 763730168, 763459504, 763155162, 762820303, 762517393, 762303233, 762121141, 761891365, 761634767, 761432767, 761358321, 761365712, 761311293, 761156678, 761005223, 760914803, 760857046, 760760784, 760563731, 760343194]
2724.9G60343194j87874k25246k78473k99811k64645k09748k42532k93374k51651j22130
2745.3G57967710j8000j01388k98977l93033l46243k63572k43663k97130l19898k30431
2765.7G55455375q1003o199o1273j71066k76148k95222k20656k03967k41995j84000
2786.1G53713846p8380j26779k84374l23295k18034j59860k40743l07918k30371j9849
2806.5G51724243J84000J61647m6074j78277j59979q7381n5611j16646k27869k57313
2826.9G50940740j72853j25826k09689k62678j77145k09689m47035n98490n76854n11944
2847.3G47648537m64916m27425m02808l69430k33888q0943j08719k55168l50296l16322
2867.7G44638622j42932k3127j66058l69251l17574j42514j04845j79171k57135k58267
$$ y = [760343194, 760155320, 759930074, 759651601, 759351790, 759087145, 758877397, 758634865, 758341491, 758089840, 757967710, 757949710, 757848322, 757549345, 757156312, 756810069, 756546497, 756302834, 756005704, 755685806, 755455375, 755374372, 755368173, 755306900, 755135834, 754859686, 754564464, 754343808, 754139841, 753897846, 753713846, 753635466, 753508687, 753224313, 752901018, 752682984, 752523124, 752282381, 751974463, 751744092, 751724243, 751908243, 752069890, 752023816, 751845539, 751685560, 751598179, 751542568, 751425922, 751198053, 750940740, 750767887, 750642061, 750432372, 750169694, 749992549, 749782860, 749335825, 748737335, 748160481, 747648537, 747183621, 746756196, 746353388, 745983958, 745750070, 745669127, 745560408, 745305240, 744954944, 744638622, 744495690, 744472563, 744306505, 743937254, 743619680, 743477166, 743372321, 743193150, 742936015, 742677748]
2888.1G42677748j78277j32263j70588k82467m22954m36128l09825k41696k83897k72870
2908.5G39946783j50085j08719l06844n80252o73949o02901m82798l44753j88172n8294
2928.9G36450016m3570n2274K3306P6830R0718J87099K52903Q1718k16544l47257k56061
2951.3G36246884k36094l63231l86894k69174j58191j25825j23203p9870P689J00255
2971.7G34612346J42157J12176K5809q5354j84059k56002l16143l54529l03805k99811
2992.1G33092785m81427o27458o19352m44948j34647O675j07765k53618l98039p09415
3012.5G29322791j128733j281500j017511o70790n00262l68476j27435M9651j31250
3030.9G24146485n13971n83410p4506N77987N59806j28746q46862j344145j809954
$$ y = [742677748, 742499471, 742367208, 742196620, 741914153, 741491199, 741055071, 740745246, 740503550, 740219653, 739946783, 739796698, 739687979, 739381135, 738800883, 738126934, 737524033, 737041235, 736696482, 736508310, 736450016, 736406446, 736354172, 736377478, 736454308, 736545026, 736732125, 736985028, 737066746, 736850202, 736502945, 736246884, 736010790, 735647559, 735260665, 734991491, 734833300, 734707475, 734584272, 734504402, 734512091, 734612346, 734754503, 734866679, 734892488, 734807134, 734623075, 734367073, 734050930, 733696401, 733392596, 733092785, 732611358, 731983900, 731364548, 730919600, 730784953, 730791628, 730683863, 730430245, 730032206, 729322791, 728194058, 726912558, 725895047, 725224257, 724723995, 724355519, 724228084, 724277735, 724146485, 723632514, 723049104, 722974598, 723552585, 724112391, 723983645, 723136783, 721792638, 719982684]
3049.2G19982684k562940l420115l381550j707852Q29100K492726K643466K472520
3065.5G17348039K921105L100693K140283P55489j84238q38875j488686j653671q63672
3083.9G21236467M04835J312196J428366Q98421L37541J50681J37329K2590m2439J64628
3104.3G26050615M09305L27945l636j79946j06633q3685k37643m67539o24001n58079
3124.7G24526703l42786k22087k77817l83377m19319l72350l49283m70221o04332n94795
3145.1G20490336m99904l82840k70844j86801j51992j96576l09825m30226n20229n65172
3165.5G16975927n14865l87311l53872m49956m76479l96729l61800m35352n74351o66856
3185.9G12358356o23107m68672l49760l46005l53515l19898l27945m06921n18679o32108
$$ y = [719982684, 717419744, 713999629, 710618079, 708910227, 709739327, 712232053, 714875519, 717348039, 720269144, 723369837, 725510120, 726265609, 726081371, 725242496, 723753810, 722100139, 721236467, 721641302, 722953498, 724381864, 725280285, 725617826, 725768507, 725905836, 725928426, 725885987, 726050615, 726459920, 726787865, 726784229, 726604283, 726497650, 726413965, 726176322, 725708783, 725084782, 724526703, 724183917, 723961830, 723684013, 723300636, 722881317, 722508967, 722159684, 721689463, 721085131, 720490336, 719990432, 719607592, 719336748, 719149947, 718997955, 718801379, 718491554, 718061328, 717541099, 716975927, 716461062, 716073751, 715719879, 715269923, 714793444, 714396715, 714034915, 713599563, 713025212, 712358356, 711735249, 711266577, 710916817, 710570812, 710217297, 709897399, 709569454, 709162533, 708643854, 708011746]
3206.3G08011746o91950p15732q06630r26197r49919r00507q83222r07242r35912r62675
3226.7F99331760q68737n53549l49998n48959p67827p01785n98431n87463n33700n38051
3247.1F93283260o63579o23583m24982m00662n50687n49436l71873k89500k79546j51217
3267.5F88978195j4543j81496n13196o67572o72579o02901n27501n18263n51402n68867
3287.8F84159875m76718m11272n94854r15885j117587j042605p93815o84857q64744
3306.2F77257538j129925j166046r54092p09176n81562n76914o67810q28505j041770
3324.6F69601738j289606j445770j472592j450539j357973j271367j408815j632571
3340.9F58272505j712263j757860j679242j440823j525283j925170k050698j844942
$$ y = [708011746, 707319796, 706604064, 705797434, 704871237, 703921318, 703020811, 702137589, 701230347, 700294435, 699331760, 698463023, 697909474, 697559476, 697010517, 696242690, 695540905, 694942474, 694355011, 693821311, 693283260, 692619681, 691996098, 691571116, 691170454, 690619767, 690070331, 689698458, 689408958, 689129412, 688978195, 688963652, 688782156, 688268960, 687601388, 686928809, 686325908, 685798407, 685280144, 684728742, 684159875, 683683157, 683271885, 682677031, 681761146, 680643559, 679600954, 678807139, 678122282, 677257538, 676127613, 674961567, 674007475, 673298299, 672716737, 672139823, 671472013, 670643508, 669601738, 668312132, 666866362, 665393770, 663943231, 662585258, 661313891, 659905076, 658272505, 656560242, 654802382, 653123140, 651682317, 650157034, 648231864, 646181166, 644336224]
3357.2F44336224j689911j773060j832723j585067j426339j740515k180994k200841
3373.5F29906774j845181j642049j683295j734733j680136j475811j145184q36253
3389.8F17864132r36806j368583j403629r07660o44266j102746j574337j314462q38220
3408.2F07773423p05421p62343r25482j014351q18551o19233n58197m19319j84178
3426.5F01766348n6863j13785q0586P2122p1943m14669m10319n5015K32756K94864
3446.9F01162910K90633L45051M16219M87805O15775P06911N97000N88954R21428J077891
3467.3F07210577O74665K07841K56479O08444Q85129Q55088N42402N02706P29501P29799
3487.7F13202631O78003P86364Q68559Q87037Q44299Q13842P95484O26802N23210O39081
$$ y = [644336224, 642646313, 640873253, 639040530, 637455463, 636029124, 634288609, 632107615, 629906774, 628061593, 626419544, 624736249, 623001516, 621321380, 619845569, 618700385, 617864132, 616927326, 615558743, 614155114, 613247454, 612603188, 611500442, 609926105, 608611643, 607773423, 607068002, 606305659, 605380177, 604365826, 603547275, 602928042, 602369845, 601950526, 601766348, 601709485, 601595700, 601515114, 601587236, 601515293, 601100624, 600690305, 600635290, 600868046, 601162910, 601453543, 601798594, 602214813, 602702618, 603318393, 604025304, 604622304, 605211258, 606132686, 607210577, 607885242, 608093083, 608349562, 608958006, 609843135, 610698223, 611240625, 611743331, 612472832, 613202631, 613880634, 614666998, 615535557, 616422594, 617266893, 618080735, 618876219, 619503021, 620026231, 620665312]
3508.1F20665312Q94189J174628J114309Q14617P33316Q90970J083970J009822P39634
3526.5F29120767P48813J004517J175642J225412J129091R93848J101732J213908J010061
3544.8F38723791P56800Q05139R52900R66191R95159J083017J141131J092135Q22843
3563.2F47339106N77747R30965J574636J589239J270115J155972J253844J441002J556456
3581.5F58689082J417100J031995R27985J417756J598358J340389J323700J511693
3597.9F69258058J479745J398504J307010R76623P93576J018166J197696J244426J136124
3616.2F79809928J017392J365065J521230J021087L11375L1531Q06152J267255R68694
3634.6F88119709O61135M95911M78923M87209J87516l72291l27170O98745J078368
$$ y = [620665312, 621559501, 622734129, 623848438, 624663055, 625396371, 626287341, 627371311, 628381133, 629120767, 629869580, 630874097, 632049739, 633275151, 634404242, 635398090, 636499822, 637713730, 638723791, 639480591, 640285730, 641238630, 642204821, 643199980, 644282997, 645424128, 646516263, 647339106, 647916853, 648847818, 650422454, 652011693, 653281808, 654437780, 655691624, 657132626, 658689082, 660106182, 661138177, 662066162, 663483918, 665082276, 666422665, 667746365, 669258058, 670737803, 672136307, 673443317, 674419940, 675213516, 676231682, 677429378, 678673804, 679809928, 680827320, 682192385, 683713615, 684734702, 685046077, 685077608, 685883760, 687151015, 688119709, 688780844, 689276755, 689755678, 690242887, 690430403, 690058112, 689730942, 690429687, 691508055]
3652.9F91508055O71625O35028Q57711N11229N3465p9334l08752n74887j97887j5795
3673.3F93060458l36469K10226P75039O74248M74632K07901j37687k51234K33412O48558
3693.7F95559084M80116P0095j93834j13488J81556J10269l70145p62165m53770L12090
3714.1F94819808M60267J41621n5373k3782J8418O9558J30594j32084n36382n11348
3734.5F94381297L2663M31538J11103p32184j023769k36333j49726l06368M35292O95169
3754.9F93638682J74940j80125N2452K16067j4067k47180l09647R358L35634J48833
3775.3F93824947j91629k90036j13070J3411J669k265n4539j20341k41340l94880l62218
3797.7F92069709n01513n15759R5308J59382J4782K61009J75119l16203o15716m03762
$$ y = [691508055, 692179680, 692814708, 693672419, 694183648, 694237113, 694157779, 693849027, 693274140, 693076253, 693060458, 692723989, 692934215, 693709254, 694383502, 694858134, 695066035, 694928348, 694677114, 694910526, 695559084, 696039200, 696109295, 695915461, 695801973, 695983529, 696093798, 695723653, 694961488, 694507718, 694819808, 695280075, 695421696, 695366323, 695342541, 695360959, 695430517, 695561111, 695429027, 694892645, 694381297, 694413960, 694845498, 694956601, 694224417, 693200648, 692964315, 692814589, 692508221, 692943513, 693638682, 693813622, 693633497, 693685949, 693902016, 693887949, 693640769, 693331122, 693340480, 693676114, 693824947, 693633318, 693343282, 693230212, 693243623, 693245292, 693243027, 693188488, 693068147, 692826807, 692431927, 692069709, 691568196, 691052437, 691147745, 691307127, 691321909, 691582918, 691758037, 691441834, 690826118, 690422356]
3818.1F90422356m35054k27213L51250K36511o6459k09212k33412j06454l69966o97255
3838.5F88665092k12610L19123M34816K74301k31624j014590j486838j91808J006127
3856.9F87561989O03676j16051m56392k35558p2777l81172l13282J53065L37958J54793
3877.3F87236249l85701m35412K7776P5400L3557j13130l24428k5153J51992k67267
3897.7F85973883o60062n30720k5451M45545M33981R3222p4506r9123k03967k47955
3918.1F85104847j62780q5175n1022Q106o2763k85089k39313P5757J34767j10329l83675
3940.5F83943331m17232j10507M3690p8201n4181K6524j1265o9499j31011j58489o8426
3962.9F82914734O5207P0572n4896j66058j88112j31548m9114o1095j30892j04010
$$ y = [690422356, 689987302, 689760089, 690111339, 690347850, 690281391, 690072179, 689838767, 689732313, 689362347, 688665092, 688452482, 688771605, 689206421, 689480722, 689249098, 688234508, 686747670, 686555862, 687561989, 688165665, 688049614, 687593222, 687357664, 687284887, 686903715, 686590433, 686743498, 687081456, 687236249, 686850548, 686415136, 686442912, 686518312, 686551869, 686438739, 686114311, 686089158, 686241150, 685973883, 685313821, 684783101, 684757650, 685203195, 685637176, 685730398, 685655892, 685556769, 685352802, 685104847, 684942067, 684856892, 684805870, 684813976, 684751213, 684466124, 684226811, 684302568, 684437335, 684327006, 683943331, 683526099, 683415592, 683459282, 683381081, 683326900, 683353424, 683342159, 683272660, 683141649, 682983160, 682914734, 682979941, 683050513, 682995617, 682829559, 682641447, 682509899, 682460785, 682399690, 682268798, 682164788]
3983.3F82164788o4730j24157j96993j93238j36436p6353k9266
3997.6F81343615
$$ y = [682164788, 682100058, 681975901, 681778908, 681585670, 681449234, 681372881, 681343615]
##END=$$ End of the data block
