##TITLE=B8M - Igor - Chalcona $$ Begin of the data block
##JCAMP-DX=5.00 $$ ACD/SpecManager v 10.08
##SPECTROMETER/DATA SYSTEM=Alpha
##DATE=13 Apr 2015 08:10:36
##DATA TYPE=INFRARED SPECTRUM
##DATA CLASS=XYDATA
##ORIGIN=
##OWNER=
##NPOINTS=1765
##FIRSTX=399.76428223
##LASTX=3997.64306641
##MAXX=3997.64306641
##MINX=399.76428223
##MAXY=0.78217322
##MINY=0.15891439
##XFACTOR=1.0000000000
##YFACTOR=1.000000000000000e-9
##FIRSTY=0.66916102
##DELTAX=2.03961372
##XUNITS=1/CM
##YUNITS=ARBITRARY UNITS
##XYDATA=(X++(Y..Y))
$$ plain form
399.8 669161022 673801839 681459963 690063477 698312521 703775287 705874026 706191838 705167115 702167988
418.1 702167988 699259877 698372602 697270632 694933116 692619920 690788329 687861800 682149529 673242092
436.5 673242092 661179423 649972677 650774062 665873528 680957496 687336743 687624335 686315536
452.8 686315536 685516059 684338748 681869507 679391861 677726746 675680339 671973467 667632937 663950264
471.2 663950264 659858525 654038429 646873415 638721466 627723277 610307217 582761109 540494442
487.5 540494442 482869059 437638015 458806485 546774149 632117331 669857621 670421839 652631760
503.8 652631760 622649789 590909123 586836457 622375011 667097509 691594124 696824312 694589078
520.1 694589078 690677285 684926748 676664531 667166829 655941308 639363408 613383114 576436579
$$ packed form
399.8F69161022M640817P658124Q603514Q249044N462766K098739L17812j024723k999127
418.1G02167988k908111q87275j101970k337516k313196j831591k926529n712271q907437
436.5F73242092j2062669j1206746Q01385J5099466J5083968O379247K87592j308799
452.8F86315536p99477j177311k469241k477646j665115k046407l706872m340530l682673
471.2F63950264m091739n820096p165014q151949j0998189j7416060k7546108m2266667
487.5E40494442n7625383m5231044K1168470Q7967664Q5343182L7740290N64218j7790079
503.8F52631760k9981971l1740666m072666L5538554M4722498K4496615N230188k235234
520.1F94589078l911793n750537q262217r497702j1225521j6577900k5980294l6946535
$$ plain form
536.4 576436579 541709065 544191658 597654760 663250446 701791167 713484466 713255644 710145414
552.7 710145414 707561195 705155790 701860309 698446333 696170986 694274247 691519260 688582480
569.1 688582480 687051892 686305225 684803724 682996213 682226181 681915760 680508971 678439856 677173257
587.4 677173257 676544368 674964905 672647059 671131611 670339167 668756425 666301191 664408743 663149357
605.8 663149357 661022604 657455385 653095365 648528993 646586061 648109913 649416506 648665845 645987928
624.1 645987928 641912341 638220012 635533571 631863415 625828743 617593944 606127083 592700064
640.4 592700064 581516623 565349340 527689755 465935856 429852039 485392541 592166901
654.7 592166901 655652583 666978002 662758946 656212747 648572266 636943281 619504988 606893241
$$ packed form
536.4E76436579l4727514K482593N3463102O5595686L8540721J1693299k28822l110230
552.7G10145414k584219k405405l295481l413976k275347j896739k754987k936780
569.1F88582480j530588p46667j501501j807511p70032l10421j406789k069115j266599
587.4F77173257o28889j579463k317846j515448p92444j582742k455234j892448j259386
605.8F63149357k126753l567219m360020m566372j942932J523852J306593p50661k677917
624.1F45987928m075587l692329k686441l670156o034672q234799j1466861j3427019
640.4E92700064j1183441j6167283l7659585o1753899l6083817N5540502J06774360
654.7E92166901O3485682J1325419m219056o546199p640481j1628985j7438293j2611747
$$ plain form
671 606893241 598362386 589261115 578161299 563324273 543682218 519195795 488070130 444505423
687.3 444505423 383326739 319266587 290597111 322578728 409402013 518168628 605591536
701.6 605591536 654573858 672635734 666490674 637708366 583398938 503782272 436535686 454333335
717.9 454333335 563839197 674847662 727039635 737471223 733405113 726400375 718718827 709532559
734.3 709532559 699584901 689847052 678202689 660084546 630938113 591328025 566279113 588755369
750.6 588755369 639322877 669670403 671465456 661136091 647045135 630941749 611050069 582240224
766.9 582240224 538105071 475160897 402839869 356095493 380737543 481956720 601161718
781.2 601161718 676853478 702905774 704700351 699345350 691036344 680194378 668179691 655905366
$$ packed form
671F06893241q530855r101271j1099816j4837026j9642055k4486423l1125665m3564707
687.3D44505423o1178684o4060152k8669476L1981617Q6823285J08766615Q7422908
701.6F05591536M8982322J8061876o145060k8782308n4309428p9616666o7246586J7797649
717.9D54333335J09505862J11008465N2191973J0431588m066110p004738p681548r186268
734.3G09532559r947658r737849j1644363j8118143k9146433l9610088k5048912K2476256
750.6E88755369N0567508L0347526J795053j0329365j4090956j6103386j9891680k8809845
766.9E82240224m4135153o2944174p2321028m6744376K4642050J01219177J19204998
781.2F01161718P5691760K6052296J794577n355001q309006j0841966j2014687j2274325
$$ plain form
797.5 655905366 641897500 624253213 602685213 576960564 544799089 502201140 444564283
811.8 444564283 369973958 294910938 268441141 338128328 484733045 631507277 725867689
826 725867689 768878877 782173216 782002449 774997056 763621449 749176741 730241954 709300935
842.4 709300935 700286388 710411072 725555658 731502414 728940487 723749340 718633592 712914169
858.7 712914169 705537498 696369708 683840930 664224446 643469453 643493235 669984818 697519243
875 697519243 708580732 709039927 707193732 704839647 701068699 696106851 691068590 685709655 679937482
893.4 679937482 676472485 677283823 679645360 679908752 677889585 675535977 673646033 671371162 668331027
911.7 668331027 665429354 663058817 660183311 656123459 651581407 646892548 640422642 629399478
$$ packed form
797.5F55905366j4007866j7644287k1568000k5724649l2161475m2597949n7636857
811.8D44564283p4590325p5063020k6469797O9687187J46604717J46774232R4360412
826G25867689M3011188J3294339j70767p005393j1375607j4444708j8934787k0941019
842.4G09300935r014547J0124684J5144586N946756k561927n191147n115748n719423
858.7G12914169p376671r167790j2528778j9616484k0754993K3782K6491583K7534425
875F97519243J1061489M59195j846195k354085l770948m961848n038261n358935n772173
893.4F79937482l464997Q11338K361537K63392k019167k353608j889944k274871l040135
911.7F68331027k901673k370537k875506m059852m542052m688859o469906j1023164
$$ plain form
928 629399478 611742914 592890978 589301109 605768442 623748064 630148590 628515363 623083293
944.3 623083293 615116656 607698500 604867101 605253994 603685856 598886013 592182755 583492637 572323442
962.7 572323442 559610724 547183454 534230590 516919196 493192285 463457555 428869545
977 428869545 388694793 342155576 302930951 302069038 358146131 447934002 529948056 590220332
993.3 590220332 631112337 643269122 632923603 625181139 620583475 605005145 578817844 545519471
1009.6 545519471 502658427 448269337 393487453 371656984 408723533 491452068 579618156
1023.9 579618156 629051685 620688260 569495380 497940570 430900842 406385422 450953096
1038.2 450953096 541207671 625226796 676873922 701740623 712088525 715087414 713424087 709012389
$$ packed form
928F29399478j7656564j8851936l589869J6467333J7979622O400526j633227n432070
944.3F23083293p966637p418156k831399L86893j568138m799843o703258q690118j1169195
962.7E72323442j2712718j2427270j2952864j7311394k3726911k9734730l4588010
977D28869545m0174752m6539217l9224625q61913N6077093Q9787871Q2014054O0272276
993.3E90220332M0892005J2156785j0345519p742464m597664j5578330k6187301l3298373
1009.6E45519471m2861044n4389090n4781884k1830469L7066549Q2728535Q8166088
1023.9E79618156M9433529q363425n1192880p1554810o7039728k4515420M4567674
1038.2D50953096R0254575Q4019125N1647126K4866701J0347902K998889j663327m411698
$$ plain form
1054.5 709012389 705404043 704561710 704295933 701760173 697093964 691741645 685387850 676460087 664274395
1072.8 664274395 649522424 635958016 633109212 645362139 661494493 669473410 669118881 665160120
1089.2 665160120 661640346 660504401 660320640 659075499 657030523 654888749 651716828 646936595
1105.5 646936595 642235279 638677955 634138823 627022207 619984448 618784189 626314878 637132227
1121.8 637132227 643751264 645481229 645107806 643712819 641594708 639222801 636585176 633288741
1138.1 633288741 629592597 626162589 622868061 618914545 614328504 610051572 606176913 601517737
1154.4 601517737 595297039 587799847 578487813 568685055 564699531 566711485 564736009 552819312
1170.7 552819312 530516684 496715337 457209736 433938146 442996562 473349661 513581753
$$ packed form
1054.5G09012389l608346q42333k65777k535760m666209n352319o353795q927763j2185692
1072.8F64274395j4751971j3564408k848804J2252927J6132354P978917l54529l958761
1089.2F65160120l519774j135945j83761j245141k044976k141774l171921m780233
1105.5F46936595m701316l557324m539132p116616p037759j200259P530689J0817349
1121.8F37132227O619037J729965l73423j394987k118111k371907k637625l296435
1138.1F33288741l696144l430008l294528l953516m586041m276932l874659m659176
1154.4F01517737o220698p497192r312034r802758l985524K011954j975476j1916697
1170.7E52819312k2302628l3801347l9505601k3271590R058416L0353099M0232092
$$ plain form
1185 513581753 554639518 575495064 571829557 558789968 543721855 525094092 502006948 473929584
1201.3 473929584 438031793 393184394 348454982 330214888 359706968 406891197 417147189
1215.6 417147189 384291083 342022479 318067938 327816129 377203315 454778075 535220265
1229.9 535220265 598642349 641137838 667158782 680220783 683162212 679769993 673383951 665632308
1246.2 665632308 656975508 648582041 642820716 641206503 642382324 643695414 643629968 641666710 637281060
1264.6 637281060 630470514 621928871 612346411 602335453 591955304 579494417 561821997 536913335
1280.9 536913335 507125318 482261896 476020515 492195427 517337382 535047948 539204657 531728446
1297.2 531728446 516804338 495731741 468970031 445647746 435319752 429030031 415071577
$$ packed form
1185E13581753M1057765K0855546l665507j3039589j5068113j8627763k3087144k8077364
1201.3D73929584l5897791m4847399m4729412j8240094K9492080M7184229J0255992
1215.6D17147189l2856106m2268604k3954541R748191M9387186P7574760Q0442190
1229.9E35220265O3422084M2495489K6020944J3062001K941429l392219o386042p751643
1246.2F65632308q656800q393467n761325j614213J175821J313090o5446j963258m385650
1264.6F37281060o810546q541643r582460j0010958j0380149j2460887j7672420k4908662
1280.9E36913335k9788017k4863422o241381J6174912K5141955J7710566M156709p476211
1297.2E31728446j4924108k1072597k6761710k3322285j0327994o289721j3958454
$$ plain form
1311.5 415071577 406332105 426670194 472629547 508497238 510788441 489935577 456723154 411038637
1327.8 411038637 363150865 333848149 327584743 328883111 338252485 379002810 449829012 521131933
1344.1 521131933 576925516 619576395 651546061 669682145 674388587 670782328 664820254 661258340
1360.4 661258340 662076414 665025771 666287839 664547741 660063505 652091503 640034020 628841341
1376.7 628841341 625520289 630177140 635782242 637593269 635897100 631994486 626765728 619692981
1393.1 619692981 611014664 603461802 597130120 589302540 577240527 559268534 538014948 519335270
1409.4 519335270 513041198 526145875 550421894 573050499 587871015 594130814 595369399 594038486
1425.7 594038486 590974867 586555064 581636071 576572895 569981515 562114060 554645479 545787215
$$ packed form
1311.5D15071577q739472K0338089M5959353L5867691K291203k0852864l3212423m5684517
1327.8D11038637m7887772k9302716o263406J298368R369374M0750325P0826202P1302921
1344.1E21131933N5793583M2650879L1969666J8136084M706442l606259n962074l561914
1360.4F61258340Q18074K949357J262068j740098m484236p972002j2057483j1192679
1376.7F28841341l321052M656851N605102J811027j696169l902614n228758p072747
1393.1F19692981q678317p552862o331682p827580j2062013j7971993k1253586j8679678
1409.4E19335270o294072J3104677K4276019K2628605J4820516O259799J238585j330913
1425.7E94038486l063619m419803m918993n063176o591380p867455p468581q858264
$$ plain form
1442 545787215 532579124 511054635 488593340 497012466 540706754 582379460 599809885 601670623
1458.3 601670623 602004111 602542937 602388084 601513743 600136936 597780645 594293296 591145635 588834286
1476.7 588834286 586582780 583868206 580434799 576108634 570420504 564869761 562131047 560312748
1493 560312748 556105852 549247980 541958869 534492970 525171638 507996500 473212481 436445862
1509.3 436445862 418175638 430926144 474495798 521863222 547082484 553337097 551153958 545710325
1525.6 545710325 538969040 532402158 524988890 516165018 509475589 504428387 496576101 486997664
1542 486997664 478868395 471048743 462082118 450159281 436260730 422097951 408093840 387762398
1558.3 387762398 361632109 342946559 324306399 308464855 310249865 330689579 349457502
$$ packed form
1442E45787215j3208091k1524489k2461295Q419126M3694288M1672706J7430425J860738
1458.3F01670623L33488N38826j54853q74341j376807k356291l487349l147661k311349
1476.7E88834286k251506k714574l433407m326165n688130n550743k738714j818299
1493E60312748m206896o857872p289111p465899r321332j7175138l4784019l6766619
1509.3D36445862j8270224J2750506M3569654M7367424K5219262O254613k183139n443633
1525.6E45710325o741285o566882p413268q823872o689429n047202p852286r578437
1542D86997664q129269p819652q966625j1922837j3898551j4162779j4004111k0331442
1558.3C87762398k6130289j8685550j8640160j5841544J785010K0439714J8767923
$$ plain form
1572.6 349457502 358770460 361173362 360802680 362217009 359367967 339778543 300700366 250508308
1588.9 250508308 203437239 175281808 167079285 163285941 158914387 168307468 205344915 269477695
1605.2 269477695 346907228 420877635 480139583 520750463 545285583 562282979 578336000
1619.5 578336000 592206955 601725161 605467439 603601158 597183764 588014543 575435877 556610405
1635.8 556610405 535288334 511351824 481416017 450072348 420020521 393801183 371626794
1650.1 371626794 332384437 272907436 257790297 290693820 355673313 434705853 499650091
1664.3 499650091 539426446 571965873 612746418 655103743 694591045 726270497 742119014
1678.6 742119014 746634424 742982030 732765913 727073014 730591774 739804029 748212934 752308309
$$ packed form
1572.6C49457502R312958K402902l70682J414329k849042j9589424l9078177n0192058
1588.9B50508308m7071069k8155431q202523l793344m371554R393081L7037447O4132780
1605.2B69477695P7429533P3970407N9261948M0610880K4535120J6997396J6053021
1619.5E78336000J3870955R518206L742278j866281o417394r169221j2578666j8825472
1635.8E56610405k1322071k3936510k9935807l1343669l0051827k6219338k2174389
1650.1C71626794l9242357n9477001j5117139L2903523O4979493P9032540O4944238
1664.3D99650091L9776355L2539427M0780545M2357325L9487302L1679452J5848517
1678.6G42119014M515410l652394j0216117n692899L518760R212255Q408905M095375
$$ plain form
1694.9 752308309 752715111 751025319 748116493 745663047 742705345 738996148 735290825 731506348
1711.3 731506348 728043377 725535989 725053370 726559460 727692544 727245927 725858867 724125504 722237945
1729.6 722237945 720180273 717694461 715992093 715111375 713890433 712726057 711935282 710743010 708814919
1748 708814919 706534982 705010593 704072952 702622712 700620711 698347449 695978820 694449186 693528354
1766.3 693528354 692406774 690907717 688853323 686725318 684323967 681126237 678083420 676626503
1782.6 676626503 676455081 676630020 676698506 676278830 675843954 675902843 675540924 673614562 670055628 666441023
1803 666441023 664660275 664915860 665598094 665251017 663991988 662602663 661705494 661713123 662364125 663117945
1823.4 663117945 663772106 664190114 664335728 664729297 665283680 665304840 664708853 663687885 662106037
$$ packed form
1694.9G52308309M06802j689792k908826k453446k957702l709197l705323l784477
1711.3G31506348l462971k507388m82619J506090J133084m46617j387060j733363j887559
1729.6G22237945k057672k485812j702368q80718j220942j164376p90775j192272j928091
1748G08814919k279937j524389r37641j450240k002001k273262k368629j529634r20832
1766.3F93528354j121580j499057k054394k128005k401351l197730l042817j456917
1782.6F76626503j71422J74939O8486m19676m34876N8889l61919j926362l558934l614605
1803F66441023j780748K55585O82234l47077j259029j389325q97169P629O51002P53820
1823.4F63117945O54161M18008J45614L93569N54383K1160n95987j020968j581848
$$ plain form
1841.8 662106037 659962296 658349812 657659113 657078981 656333745 655896902 656353831 657459617 658383965
1860.2 658383965 658648908 658285975 657361388 656118691 655232966 654809415 654346347 653744757 653162360
1878.5 653162360 652611554 652010739 651258588 650313497 649228096 648320377 647557795 646515429 645220160
1896.9 645220160 643716872 641592681 638319969 633433163 626815736 620076299 616823375 619257450
1913.2 619257450 626146555 634405196 640308201 642064452 640829265 638711989 637326241 637052059
1929.5 637052059 637535751 638561726 640009463 641401350 642210305 642271757 641909778 641427696 640720546
1947.9 640720546 639643312 638168812 636438489 634792149 633407354 631864309 629411519 625575542
1964.2 625575542 621169329 619340420 622213304 627080083 630290508 631326079 631044269 629615426
$$ packed form
1841.8F62106037k143741j612484o90699n80132p45236m36843M56929J105786R24348
1860.2F58383965K64943l62933r24587j242697q85725m23551m63068o01590n82397
1878.5F53162360n50806o00815p52151r45091j085401r07719p62582j042366j295269
1896.9F45220160j503288k124191l272712m886806o617427o739437l252924K434075
1913.2F19257450O889105Q258641N903005J756251j235187k117276j385748k74182
1929.5F37052059M83692J025975J447737J391887Q08955O1452l61979m82082p07150
1947.9F40720546j077234j474500j730323j646340j384795j543045k452790l835977
1964.2F25575542m406213j828909K872884M866779L210425J035571k81810j428843
$$ plain form
1980.5 629615426 627132714 624731898 624092817 625376821 627037585 628185570 629086375 629723966 629947007
1998.8 629947007 629939795 629764676 629412651 628998995 628541768 628014982 627439916 626782060 625999749 625114918
2019.2 625114918 624137342 623048306 621930242 620943964 619947433 618756771 617743015 617485046 618073285
2037.6 618073285 619029880 619856954 620192766 619742870 618626475 617430627 616793394 617005467 617820084
2056 617820084 618630528 618919134 618536770 617662787 616533935 615335763 614473939 614481151 615235507 615931869
2076.4 615931869 616052866 615773261 615470648 615260661 615050197 614785373 614532769 614304602 613993049 613602936
2096.8 613602936 613265336 612996578 612696946 612344921 612036526 611803591 611529231 611157835 610806346 610597312
2117.1 610597312 610464692 610221922 609808326 609359324 609030604 608859777 608799398 608783364 608704388 608426511
$$ packed form
1980.5F29615426k482712k400816o39081J284004J660764J147985R00805O37591K23041
1998.8F29947007p212j75119l52025m13656m57227n26786n75066o57856p82311q84831
2019.2F25114918r77576j089036j118064r86278r96531j190662j013756k57969N88239
2037.6F18073285R56595Q27074L35812m49896j116395j195848o37233K12073Q14617
2056F17820084Q10444K88606l82364q73983j128852j198172q61824P212P54356O96362
2076.4F15931869J20997k79605l02613k09987k10464k64824k52604k28167l11553l90113
2096.8F13602936l37600k68758k99632l52025l08395k32935k74360l71396l51489k09034
2117.1F10597312j32620k42770m13596m49002l28720j70827o0379j6034p8976k77877
$$ plain form
2137.5 608426511 607991159 607616007 607367337 607089639 606751263 606519639 606427610 606316388 606120288 605931640
2157.9 605931640 605778337 605537474 605151653 604766428 604494929 604284525 604051650 603811443 603615761 603392839
2178.3 603392839 603051841 602662027 602330148 601994216 601514995 600926518 600389242 599944115 599552691 599259913
2198.7 599259913 599150300 599155188 599062622 598798335 598480523 598175943 597806454 597358406 596961379 596675873
2219.1 596675873 596368015 595920086 595435262 595087647 594861209 594613969 594322264 593984187 593477488 592775881
2239.5 592775881 592137992 591839552 591773570 591627538 591379106 591187477 590980828 590620220 590260684 590151012
2259.9 590151012 590229988 590227723 590045571 589808822 589586198 589296460 588935912 588637471 588402033 588046253
2280.3 588046253 587538421 587090850 586825728 586606264 586283803 585891902 585470021 584896088 584118843 583358645
$$ packed form
2137.5F08426511m35352l75152k48670k77698l38376k31624r2029j11222j96100j88648
2157.9F05931640j53303k40863l85821l85225k71499k10404k32875k40207j95682k22922
2178.3F03392839l40998l89814l31879l35932m79221n88477n37276m45127l91424k92778
2198.7E99259913j09613M888r2566k64287l17812l04580l69489m48048l97027k85506
2219.1E96675873l07858m47929m84824l47615k26438k47240k91705l38077n06699p01607
2239.5E92775881o37889k98440o5982j46032k48432j91629k06649l60608l59536j09672
2259.9E90151012P8976k265j82152k36749k22624k89738l60548k98441k35438l55780
2280.3E88046253n07832m47571k65122k19464l22461l91901m21881n73933p77245p60198
$$ plain form
2300.7 583358645 582910657 582865298 583063245 583282709 583394229 583302617 582934260 582412899 581918120 581371009
2321.1 581371009 580563664 579469383 578058958 576490343 575835228 576662004 577761114 578043103 577436388
2339.5 577436388 576323688 575488806 575538218 576277614 577221632 578161418 579019845 579628706 579818726 579658687
2359.9 579658687 579367816 578980803 578393459 577779889 577433407 577276647 577116787 577002585 577010691 576987326
2380.2 576987326 576744437 576361179 576022804 575733721 575394392 575028062 574796021 574715555 574554443 574220657
2400.6 574220657 573878884 573585868 573224425 572792530 572430551 572121501 571698010 571182072 570790291 570572257
2421 570572257 570300639 569866300 569536746 569546282 569750130 569897056 569948196 569980681 569937885 569748938 569561779
2443.5 569561779 569544137 569610715 569572508 569406033 569212317 568979383 568561971 567964435 567420483 567063749
$$ packed form
2300.7E83358645m47988m5359J97947K19464J11520r1612l68357n21361m94779n47111
2321.1E81371009q07345j094281j410425j568615o55115Q26776J099110K81989o06715
2339.5E77436388j112700q34882M9412P39396R44018R39786Q58427O08861J90020j60039
2359.9E79658687k90871l87013n87344o13570l46482j56760j59860j14202Q106k3365
2380.2E76987326k42889l83258l38375k89083l39329l66330k32041q0466j61112l33786
2400.6E74220657l41773k93016l61443m31895l61979l09050m23491n15938l91781k18034
2421E70572257k71618m34339l29554R536K03848J46926N1140L2485m2796j88947j87159
2443.5E69561779j7642O6578l8207j66475j93716k32934m17412n97536n43952l56734
$$ plain form
2463.9 567063749 566768944 566464961 566253901 566109955 565844119 565414071 564981103 564634502 564254582 563766241
2484.3 563766241 563325107 563022256 562723160 562365413 562051713 561818063 561535895 561081648 560573041 560267270
2504.7 560267270 560204089 560230076 560321748 560526490 560685456 560585737 560261786 559885442 559461951 558896005
2525.1 558896005 558267713 557769239 557448387 557196915 556964695 556846738 556890965 556962430 556943178 556891084
2545.5 556891084 556873500 556769431 556470811 556112766 555821955 555535376 555150092 554654837 554083228 553419173
2565.8 553419173 552650392 551882863 551287532 550905764 550639927 550403535 550131202 549693048 549044967 548437476
2586.2 548437476 548197150 548333704 548560798 548640072 548544943 548323870 547948539 547422469 546880305 546404362
2606.6 546404362 545994759 545769393 545796812 545882702 545902789 545934975 545977771 545943797 545895159 546090543 546664298
$$ packed form
2463.9E67063749k94805l03983k11060j43946k65836m30048m32968l46601l79920m88341
2484.3E63766241m41134l02851k99096l57747l13700k33650k82168m54247n08607l05771
2504.7E60267270o3181K5987R1672K04742J58966r9719l23951l76344m23491n65946
2525.1E58896005o28292m98474l20852k51472k32220j17957M4227P1465j9252n2094
2545.5E56891084j7584j04069k98620l58045k90811k86579l85284m95255n71609o64055
2565.8E53419173p68781p67529n95331l81768k65837k36392k72333m38154o48081o07491
2586.2E48437476k40326J36554K27094P9274r5129k21073l75331n26070n42164m75943
2606.6E46404362m09603k25366K7419Q5890K0087L2186M2796l3974m8638J95384N73755
$$ plain form
2629.1 546664298 547429144 548155308 548785329 549340069 549816430 550133586 550194800 550059497 549869239 549640775
2649.5 549640775 549352944 549079061 548883021 548734725 548560739 548305213 547985196 547662795 547337413 546988964
2669.9 546988964 546711564 546596169 546554029 546439409 546226084 545945644 545564115 545053601 544491291 543971479
2690.3 543971479 543503940 543036342 542587519 542272747 542099416 541911602 541581869 541140854 540676236 540229857
2710.7 540229857 539844334 539535344 539248765 538920522 538503706 537989616 537395298 536626041 535579622
2729 535579622 534465134 533764958 533859074 534636259 535536945 536107540 536280572 536205769 536064446 535913885
2749.4 535913885 535680294 535363555 535069764 534793735 534416378 533867121 533157229 532373607 531616271 530952692
2769.8 530952692 530460417 530188084 530069172 529996097 529914558 529797137 529644907 529490352 529286563 528893232
$$ packed form
2629.1E46664298P64846P26164O30021N54740M76361L17156O1214j35303j90258k28464
2649.5E49640775k87831k73883j96040j48296j73986k55526l20017l22401l25382l48449
2669.9E46988964k77400j15395m2140j14620k13325k80440l81529n10514n62310n19812
2690.3E43971479m67539m67598m48823l14772j73331j87814l29733m41015m64618m46379
2710.7E40229857l85523l08990k86579l28243m16816n14090n94318p69257j046419
2729E35579622j114488p00176R4116P77185R00686N70595J73032p4803j41323j50561
2749.4E35913885k33591l16739k93791k76029l77357n49257p09892p83622p57336o63579
2769.8E30952692m92275k72333j18912p3075q1539j17421j52230j54555k03789l93331
$$ plain form
2790.2 528893232 528262496 527424634 526373327 525196433 524230599 523834527 523927748 524038494 523834705
2808.6 523834705 523391843 523019075 522966921 523225784 523564756 523786128 523876846 523878515 523782313 523559391
2828.9 523559391 523173153 522616029 521920443 521093428 520036876 518700898 517232478 515726268 514140427
2847.3 514140427 512547255 511164308 510129988 509454966 509119511 509047031 509122849 509305954 509595275
2865.7 509595275 509952664 510331690 510655940 510792732 510687411 510417879 510008991 509433627 508755505 508058608
2886.1 508058608 507408798 506865919 506411016 505973756 505484700 504837871 503917873 502662301 501084685
2904.4 501084685 499215692 497014552 494418353 491445184 488303035 485641837 484486610 485504836
2920.7 485504836 488362104 491855264 494768947 496477216 496888310 496423066 495764166 495210111 494598538
$$ packed form
2790.2E28893232o30736q37862j051307j176894r65834l96072R3221J10746k03789
2808.6E23834705m42862l72768n2154K58863L38972K21372R0718J669r6202k22922
2828.9E23559391l86238n57124o95586q27015j056552j335978j468420j506210j585841
2847.3E14140427j593172j382947j034320o75022l35455p2480P5818J83105K89321
2865.7E09595275L57389L79026L24250J36792j05321k69532m08888n75364o78122o96897
2886.1E08058608o49810n42879m54903m37260m89056o46829r19998j255572j577616
2904.4E01084685j868993k201140k596199k973169l142149k661198j155227J018226
2920.7D85504836K857268L493160K913683J708269M11094m65244o58900n54055o11573
$$ plain form
2939.1 494598538 493903011 493371695 493178904 493356407 493914813 494832784 495874643 496712625 497217238
2957.4 497217238 497366905 497116923 496438235 495378822 494105130 492941201 492332250 492440164 492869347
2975.8 492869347 493186355 493258238 493013352 492450565 491638005 490525365 488948017 486671984 483651310
2994.2 483651310 480487764 478175759 477326512 477772087 478529751 478169054 476114511 473826319 473342389
3012.5 473342389 474190980 473284930 468527585 462072134 459541947 464121133 472458154 479166090 482242078
3030.9 482242078 482507646 481060535 478566885 475989282 473868489 471351475 467796654 464261293
3047.2 464261293 462428868 463013470 465982437 471473277 479001433 485867590 488702536 487352282
3063.5 487352282 485918194 489292264 497348368 504751742 507868409 507457793 505368829 502828658
$$ packed form
2939.1D94598538o95527n31316j92791J77503N58406R17971J041859Q37982N04613
2957.4D97217238J49667k49982o78688j059413j273692j163929o08951J07914M29183
2975.8D92869347L17008P1883k44886n62787q12560j112640j577348k276033l020674
2994.2D83651310l163546k312005q49247M45575P57664l60697k054543k288192m83930
3012.5D73342389Q48591r06050m757345o455451k530187M579186Q337021O707936L075988
3030.9D82242078K65568j447111k493650k577603k120793k517014l554821l535361
3047.2D64261293j832425N84602K968967N490840P528156O866157K834946j350254
3063.5D87352282j434088L374070Q056104P403374L116667m10616k088964k540171
$$ plain form
3079.8 502828658 500908613 500635505 502668202 506560922 510533631 512960315 513593614 513123095 512388766
3098.2 512388766 511969745 512033939 512371302 512643933 512669325 512430251 511978209 511366963 510622442 509818673
3118.6 509818673 509107471 508680820 508659542 508913457 509164393 509263396 509180605 508931816 508575141 508160949
3139 508160949 507731974 507290840 506820679 506323755 505785525 505217075 504653335 504056036 503391981 502766609
3159.4 502766609 502264142 501833260 501409411 501004457 500671387 500396013 500106335 499697119 499108851 498400331
3179.8 498400331 497581214 496616185 495575726 494650573 494086772 493957192 493985772 493780702 493261665 492731214
3200.1 492731214 492439598 492254198 491911143 491331726 490567207 489657253 488628954 487529844 486447722
3218.5 486447722 485503346 484724611 484045416 483450234 482941955 482502639 482101649 481615961 480951399 480190903
$$ packed form
3079.8E02828658j920045k73108K032697L892720L972709K426684O33299m70519p34329
3098.2E12388766m19021O4194L37363K72631K5392k39074m52042o11246p44521q03769
3118.6E09818673p11202m26651k1278K53915K50936R9003q2791k48789l56675m14192
3139E08160949m28975m41134m70161m96924n38230n68450n63740n97299o64055o25372
3159.4E02766609n02467m30882m23849m04954l33070k75374k89678m09216n88268p08520
3179.8D98400331q19117r65029j040459r25153n63801j29580K8580k05070n19037n30451
3200.1D92731214k91616j85400l43055n79417p64519r09954j028299j099110j082122
3218.5D86447722r44376p78735o79195n95182n08279m39316m00990m85688o64562p60496
$$ plain form
3238.9 480190903 479467541 478971362 478884488 479019940 478974104 478665978 478285402 477944821 477621466 477286100
3259.3 477286100 476966739 476658612 476333886 476076782 475907475 475598574 475054473 474439144 473824561 473169357
3279.7 473169357 472484589 471815675 471105188 470255136 469264328 468138635 466865987 465534657 464309186
3298 464309186 463319182 462599039 462125510 461870283 461810857 461895287 461915314 461618990 460942000 459983349
3318.4 459983349 458893508 457787544 456667900 455445468 454097867 452700824 451297879 449917227
3334.8 449917227 448580265 447202653 445702523 444108993 442442179 440781415 439241290 437627643
3351.1 437627643 435742557 433815330 432080299 430453479 428720415 426918328 425350755 423982501
3367.4 423982501 422373056 420358866 418329924 416617543 415073901 413506269 411895424 410299778
$$ packed form
3238.9D80190903p23362m96179q6874J35452m5836l08126l80576l40581l23355l35366
3259.3D77286100l19361l08127l24726k57104j69307l08901n44101o15329o14583o55204
3279.7D73169357o84768o68914p10487q50052r90808j125693j272648j331330j225471
3298D64309186r90004p20143m73529k55227n9426Q4430K0027k96324o76990r58651
3318.4D59983349j089841j105964j119644j222432j347601j397043j402945j380652
3334.8D49917227j336962j377612j500130j593530j666814j660764j540125j613647
3351.1D37627643j885086j927227j735031j626820j733064j802087j567573j368254
3367.4D23982501j609445k014190k028942j712381j543642j567632j610845j595646
$$ plain form
3383.7 410299778 408839464 407683760 406853825 405925393 404606193 403293401 402405977 401703179 400597215
3402.1 400597215 399128497 397915393 397111446 396415204 395632684 394685686 393691391 392908961 392303944
3420.4 392303944 391747266 391341478 391140848 390994757 390743077 390529215 390518188 390437573 390069574 389696240
3440.8 389696240 389601707 389730543 389951348 390211850 390501887 390836418 391244441 391767412 392390519 392962307
3461.2 392962307 393533200 394339383 395224899 395777047 395977378 396225423 396765411 397550076 398306429 398796588
3481.6 398796588 399268121 399941355 400591642 401144087 401795715 402570039 403351843 404067546 404749364 405416548
3502 405416548 405974776 406481475 407100171 407919019 408928186 409873128 410585880 411249578 412031561 412906945
3522.4 412906945 413708717 414378703 415101469 416008800 417069972 418201029 419223607 420078605 420976132
$$ packed form
3383.7D10299778j460314j155704q29935r28432j319200j312792q87424p02798j105964
3402.1D00597215j468718j213104q03947o96242p82520r46998r94295p82430o05017
3420.4C92303944n56678m05788k00630j46091k51680k13862j1027q0615l67999l73334
3440.8C89696240r4533J28836K20805K60502K90037L34531M08023N22971O23107N71788
3461.2C92962307N70893Q06183Q85516N52148K00331K48045N39988P84665P56353M90159
3481.6C98796588M71533O73234O50287N52445O51628P74324P81804P15703O81818O67184
3502D05416548N58228N06699O18696Q18848J009167R44942P12752O63698P81983Q75384
3522.4D12906945Q01772O69986P22766R07331J061172J131057J022578Q54998Q97527
$$ plain form
3540.8 420976132 421936363 422745377 423383296 424099267 424940497 425828904 426863074 427992135 429084927
3559.1 429084927 430124849 430978715 431541532 432290822 433701009 435241371 436467469 437577128 438802987
3577.5 438802987 440168321 441591740 442888379 443826914 444597781 445844471 447339952 448599100 449847102
3595.8 449847102 451268256 452622026 453897744 455172449 456174701 456874341 457695663 458704114 459790766
3614.2 459790766 460929394 461945444 463044167 464358509 465473354 465979785 465929866 466500431 467779666
3632.5 467779666 468803763 469457567 469926059 470251560 470485657 470525980 470148355 469788730 470499307 471860558
3652.9 471860558 472755045 473118633 473516196 473777682 473844498 474080771 474167377 473642677 473327607 473397076
3673.3 473397076 472895384 472816378 473710328 474611610 475230694 475579858 475392312 474717855 474573284 475105435
$$ packed form
3540.8D20976132R60231Q09014O37919P15971Q41230Q88407J034170J129061J092792
3559.1D29084927J039922Q53866N62817P49290J410187J540362J226098J109659J225859
3577.5D38802987J365334J423419J296639R38535P70867J246690J495481J259148J248002
3595.8D49847102J421154J353770J275718J274705J002252O99640Q21322J008451J086652
3614.2D59790766J138628J016050J098723J314342J114845N06431m9919N70565J279235
3632.5D67779666J024097O53804M68492L25501K34097M0323l77625l59625P10577J361251
3652.9D71860558Q94487L63588L97563K61486O6816K36273Q6606n24700l15070O9469
3673.3D73397076n01692p9006Q93950R01282O19084L49164j87546o74457j44571N32151
$$ plain form
3693.7 475105435 475600243 475772858 475620359 475329190 475416332 475727350 475566655 474777222 474155933 474551201
3714.1 474551201 475335181 475728840 475727350 475606918 475464672 475361884 475452214 475420088 474808246 473983645
3734.5 473983645 473821342 474330634 474764287 474252164 472939402 472583085 472693712 472229600 472275496 472978860
3754.9 472978860 473328978 473196447 473265499 473548740 473517448 473298520 473116487 473110199 473369807 473545820
3775.3 473545820 473365217 472929776 472675055 472583085 472412616 472380549 472468406 472447693 472253829 471875757
3795.7 471875757 471551448 471126229 470485479 470482737 470685005 470637530 470933795 471265882 470982105 470193326
3816.1 470193326 469728053 469361663 469075054 469435155 469745010 469724953 469512910 469106257 468732804 468251914
3836.5 468251914 467677951 467671692 468111932 468506664 468801856 468940943 468450248 466778159 465681374 466422021
$$ packed form
3693.7D75105435M94808J72615j52499k91169Q7142L11018j60695p89433o21289L95268
3714.1D74551201P83980L93659j490j20432j42246j02788R0330l2126o11842q24601
3734.5D73983645j62303N09292M33653n12123j312762l56317J10627m64112M5896P03364
3754.9D72978860L50118j32531O9052K83241l1292k18928j82033o288K59608J76013
3775.3D73545820j80603m35441k54721r1970j70469l2067Q7857k0713j93864l78072
3795.7D71875757l24309m25219o40750k742K02268m7475K96265L32087k83777p88779
3816.1D70193326m65273l66390k86609L60101L09855k0057k12043m06653l73453m80890
3836.5D68251914n73963o259M40240L94732K95192J39087m90695j672089j096785P40647
$$ plain form
3856.9 466422021 467236966 467280358 466807634 466440827 466349572 465974569 465514541 465540707 465790838 466004193
3877.3 466004193 465816289 465532184 465628684 465549856 465455770 465460241 465123117 464970797 465182453 465015709
3897.7 465015709 464298159 463572711 463225812 463439584 464006245 464380950 464425653 464291900 463996530 463680685
3918.1 463680685 463592052 463629961 463519663 463362068 463289052 463082373 462786198 462717265 462761164 462650865
3938.5 462650865 462373942 462034494 461839348 461801231 461810142 461930871 462123394 462232590 462230265 462208539 462155104
3960.9 462155104 462037623 461979479 462031335 462093711 462086082 461991429 461855769 461719245 461556464 461383045 461201876
3983.3 461201876 460931957 460576326 460262239 460053265 459886521 459720045 459614128
3997.6 459614128
$$ packed form
3856.9D66422021Q14945M3392m72724l66807r1255l75003m60028K6166K50131K13355
3877.3D66004193j87904k84105R6500p8828r4086M471l37124j52320K11656j66744
3897.7D65015709p17550p25448l46899K13772N66661L74705M4703j33753k95370l15845
3918.1D63680685q8633L7909j10298j57595p3016k06679k96175o8933M3899j10299
3938.5D62650865k76923l39448j95146l8117Q911J20729J92523J09196k325k1726n3435
3960.9D62155104j17481n8144N1856O2376p629r4653j35660j36524j62781j73419j81169
3983.3D61201876k69919l55631l14087k08974j66744j66476j05917
3997.6D59614128
##END=$$ End of the data block
