##TITLE=B8M - Elis 1 $$ Begin of the data block
##JCAMP-DX=5.00 $$ ACD/SpecManager v 10.08
##SPECTROMETER/DATA SYSTEM=Alpha
##DATE=22 Jun 2015 10:50:00
##DATA TYPE=INFRARED SPECTRUM
##DATA CLASS=XYDATA
##ORIGIN=
##OWNER=
##NPOINTS=1765
##FIRSTX=399.76428223
##LASTX=3997.64306641
##MAXX=3997.64306641
##MINX=399.76428223
##MAXY=0.80999982
##MINY=0.17667930
##XFACTOR=1.0000000000
##YFACTOR=1.000000000000000e-9
##FIRSTY=0.80991447
##DELTAX=2.03961372
##XUNITS=1/CM
##YUNITS=ARBITRARY UNITS
##XYDATA=(X++(Y..Y))
399.8H09914470l892601J061678J178801m836321k976775K095819k00153j359164M065930
$$ 809914470 806021869 807083547 808262348 803426027 800449252 802545071 802344918 800985754 805051684
418.1H05051684M202009k810836j855552K685606p99179l676891J173377J677930l701270
$$ 805051684 809253693 806442857 804587305 807272911 806473732 802796841 803970218 805648148 801946878
436.5H01946878j884639K712071p93695l622413Q82566J377583l385127j987338J991987
$$ 801946878 800062239 802774310 801980615 798358202 799240768 800618351 797233224 795245886 797237873
454.8G97237873j096606l880084M09603J205206l290534k466857J394689j195788m384876
$$ 797237873 796141267 792261183 792670786 793875992 790585458 788118601 789513290 788317502 783932626
473.2G83932626j003682M5299l837704l581882n79536l231227o496072l768981k511501
$$ 783932626 782928944 782974243 779136539 775554657 774975121 771743894 765247822 761478841 758967340
491.5G58967340o645024r414196j1947095k3009539m3933630n8171928m6890974l3754885
$$ 758967340 752322316 742908120 730961025 707951486 664017856 605845928 558954954 525200069
507.9E25200069j9578815L9853692R6021355Q1192612L7933529J2598812q12947q941234
$$ 525200069 505621254 545474946 641496301 722688913 760622442 773221254 772408307 763467073
524.2G63467073j4859199k9615641n6687474o5219939j3928532N6705475O9907665
$$ 763467073 748607874 718992233 662304759 597084820 583156288 639861763 709769428
538.5G09769428M0467858J6598106M915177J588166L356099L438771J941919K823890
$$ 709769428 750237286 766835392 771750569 773338735 776694834 780133605 782075524 784899414
554.8G84899414L188729M28676j198411K20478j11163k282261j735568j97232j461268
$$ 784899414 788088143 788516819 787318408 787538886 787427723 785145462 783409894 783212662 781751394
573.1G81751394k682090j157403p87675k652049k780974j357794k219915l835023l511488
$$ 781751394 779069304 777911901 777124226 774472177 771691203 770333409 768113494 764278471 760766983
591.5G60766983m024148p008910r920299j4515042k7536810m2976797l1025946J8077374
$$ 760766983 756742835 749733925 739813626 725298584 697761774 654784977 623759031 641836405
607.8F41836405N4323375M3719351J5244782k237618k065777O689488P559240J574278
$$ 641836405 696159780 739879131 755123913 752886295 750820518 757510006 765069246 766643524
624.1G66643524k101302j952469j365722k461016l113031k199412k165079l422677
$$ 766643524 764542222 762589753 761224031 758763015 755649984 753450572 751285493 747862816
640.4G47862816l589749k713264k986490l689647l490686l947258o197751q738875
$$ 747862816 744273067 741559803 738573313 734883666 731392980 727445722 721247971 712509096
656.8G12509096j1838854j6230046j4905155l911078Q852422J2663067M551768M08649
$$ 712509096 700670242 684440196 669535041 665623963 674476385 687139452 691691220 692099869
673.1F92099869k395987o904066j0627627j3593197j8898666k8414965m4350862o6724479
$$ 692099869 689703882 682799816 672172189 658578992 639680326 611265361 566914499 500190020
689.4E00190020p7007801m9632996J515537N1543981R0219975R0598106N3186894J7177939
$$ 500190020 423182219 373549223 375064760 426608741 516828716 607426822 660613716 677791655
705.7F77791655j074135p620573r499908j0827541j1604548j1418044j1751294j2705744
$$ 677791655 676717520 669096947 659597039 648769498 637164950 625746906 613995612 601289868
722F01289868j2871742j2960255j4112055j5834391j7072320j8511355k0989597k3716361
$$ 601289868 588418126 575457871 561345816 545511425 528439105 509927750 488938153 465221792
738.3D65221792k6319026k9578716l3835501l8819849m4126719m4618696l2809213
$$ 465221792 438902766 409324050 375488549 336668700 292541981 247923285 215114072
752.6B15114072j2491837K084106J0539100K9053136N5722237O7284822O0832888N5906177
$$ 215114072 202622235 204706341 215245441 244298577 300020814 367305636 428138524 484044701
768.9D84044701N3689867M2919755K8556407J9959569J5986502J2818396J0308862
$$ 484044701 537734568 580654323 609210730 629170299 645156801 657975197 668284059
783.2F68284059R313762Q440435O916701O213367O339849N714893M805863N096435
$$ 668284059 677597821 686038256 692954957 699168324 705508173 711223066 716028929 721125364
799.5G21125364N418420M392505L497779L709316L208101J592636Q26478Q58546M43816
$$ 721125364 726543784 730936289 734434068 738143384 741351485 742944121 743770599 744629145 745072961
817.9G45072961M22478J477956J872480Q63791p3910j232445m838586j0768831j4879286
$$ 745072961 745495439 746973395 748845875 749709666 749635756 748403311 743564725 732795894 717916608
836.2G17916608j0135770L281415J1519432M857778r629905j1433303Q355617K4602473
$$ 717916608 707780838 711062253 722581685 727439463 717809558 706376255 714731872 739334345
852.6G39334345J9595742Q501947L842652K760410J317561K97844P19786O78241m99189
$$ 739334345 758930087 767432034 771274686 774035096 775352657 775650501 776370287 777048528 776549339
870.9G76549339p31110n4539n18441j345813p62999k46704j403987k614439l111183
$$ 776549339 775818229 775763690 775245249 773899436 773136437 772889733 771485746 768871307 765760124
889.3G65760124m537583o363034o567657p486164j3853431k6212812l9594114l8638174
$$ 765760124 761222541 754859507 748291850 740805686 726952255 700739443 661145329 622507155
905.6F22507155o903052L4652412M5723080K8917790J2846946P167638N911350L885329
$$ 622507155 615604103 650256515 695979595 724897385 737744331 744911969 750823319 754708648
921.9G54708648J706719J168609Q23140m55618q95500m73619j214504k556980k556979
$$ 754708648 756415367 757583976 758407116 757951498 757055998 756582379 755367875 752810895 750253916
940.3G50253916k543867m230678o303728q628666j2420952j3789594j0978044j4886021
$$ 750253916 747710049 743479371 737175643 728546977 716126025 702336431 691358387 676472366
956.6F76472366k8291941k6222467N793690L5786510L6758363K2329748R371877K710282
$$ 676472366 648180425 621957958 627751648 663538158 700296521 722626269 731998146 734708428
972.9G34708428Q20041q63194m161060p359028n917549j148999l48508l690243p412195
$$ 734708428 735528469 734665275 730504215 723145187 717227638 716078639 715730131 712039888 704627693
991.3G04627693j3432861k3521781k0701348O136417K0931721K502322j8788755k6606619
$$ 704627693 691194832 667673051 646971703 653108120 674039841 676542163 657753408 631146789
1007.6F31146789k8191209k2547961l239452K1571517L1217813K3113072J5027225
$$ 631146789 602955580 580407619 577168167 598739684 629957497 653070569 668097794
1021.8F68097794J2349308N370199o163239j5093982j8813193j7697513j5276671j5200138
$$ 668097794 680447102 685817301 679654062 664560080 645746887 628049374 612772703 597572565
1038.2E97572565j1085331N171775K5484980L4172356K8859257J9545377J2910485
$$ 597572565 586487234 591659009 617143989 651316345 680175602 699720979 712631464
1052.4G12631464Q213818M432321K797305K408088J039206k64108K325j93954k484083
$$ 712631464 720845282 725277603 728074908 730482996 731522202 731258094 731260419 731066465 728582382
1070.8G28582382n083561p672786j2216688j4846265n505562J1874140J8451035J1866092
$$ 728582382 723498821 715826035 703609347 688763082 683257520 695131660 713582695 725448787
1087.1G25448787N176127K074659N0664n19812l1054m77076j396775j195729r63390
$$ 725448787 730624914 732699573 732750237 732230425 732199371 731722295 730325520 729129791 728166401
1105.5G28166401j953601k753675k071917p35462K24709P87616Q22723j89900j172543
$$ 728166401 726212800 723459125 721387208 720651746 720876455 721664071 722486794 722296894 721124351
1123.8G21124351q65459n06580j009763j050114l47913n04672j268268j055658m92930
$$ 721124351 720258892 719752312 718742549 717692435 717344522 716839850 715571582 714515924 714022994
1142.2G14022994j004994j677334j480580j646399k924383m642963r339571j4425934
$$ 714022994 713018000 711340666 709860086 708213687 705289304 700646341 691306770 676880836
1158.5F76880836o456315Q026361Q769453R69708l023684m297495p239461j3798952
$$ 676880836 670424521 678450882 687220335 688190043 685166359 680868864 673629403 659830451
1174.8F59830451k0271063j2098849J4985562L1193256J9938409L762603k895236m194915
$$ 659830451 639559388 627460539 642446101 673639357 693577766 697340369 694445133 690250218
1191.1F90250218l769457l268481k952695k285063j975894k749801l435850k909779
$$ 690250218 686480761 683212280 680259585 677974522 675998628 673248827 669812977 666903198
1207.5F66903198k288163k867043l345191k286792r86517j039684k395570m743755
$$ 666903198 664615035 661747992 658402801 656116009 655129492 654089808 651694238 646950483
1223.8F46950483o618976m333496J039266K614081o54876l646433m857719o130398
$$ 646950483 640331507 635998011 637037277 639651358 638996482 635350049 630492330 624361932
1240.1F24361932p817566r281576j1005819j3501405j5974880j8107116k1034717k5898934
$$ 624361932 616544366 607262790 596256971 582755566 566780686 548673570 527638853 501739919
1256.4E01739919l2728761l7979275l0603528J62273M5291961P5712770P2338104M5956433
$$ 501739919 469011158 431031883 400428355 400590628 445882589 521595359 593933463 639889896
1272.7F39889896J9429624K792358n627691q511603q885265r898662j1819601j3520420
$$ 639889896 659319520 662111878 656484187 647972584 639087319 629188657 617369056 603848636
1289F03848636j5346944j7823458j9930422k0123780j7986238j4955819j2538433r710192
$$ 603848636 588501692 570678234 550747812 530624032 512637794 497681975 485143542 475433350
1305.4D75433350o859243j0187984k2248387l5907358m3810189m3047666l2935113
$$ 475433350 468574107 458386123 436137736 400230378 356420189 313372523 280437410
1319.6B80437410j5824586N905837L0987441N8540911Q6610049R8076939P8169167
$$ 280437410 264612824 270518661 301506102 360047013 446657062 544734001 622903168
1333.9F22903168M2895019J4323950k305925j0008275j3525129j5663564j6661107
$$ 622903168 665798187 680122137 677816212 667807937 654282808 638619244 621958137
1348.2F21958137j7118574j8150091j9705295k1423996k3744285k8533459l7257045
$$ 621958137 604839563 586689472 566984177 545560181 521815896 493282437 456025392
1362.5D56025392m4819445m1557163k0505845J4855862M5506507N5999368M5652896
$$ 456025392 411205947 369648784 349142939 363998801 409505308 465504676 511157572
1376.7E11157572K9362202J6810834P618785R05156m415452q308411p728457j883686
$$ 511157572 540519774 557330608 564949393 565854549 561439097 553130686 545402229 543518543
1393.1E43518543N063474N751133R48668m074276p811129j0801255j2325824j3086736
$$ 543518543 548582017 554333150 555281818 551207542 543396413 532595158 520269334 507182598
1409.4E07182598j4452308j5634418j6193837j8231719k2645444k4014116k3973673
$$ 507182598 492730290 477095872 460902035 442670316 420024872 396010756 372037083
1423.7C72037083k4210751k3132295k2663533j9975275j2550592j773358J0256559
$$ 372037083 347826332 324694037 302030504 282055229 269504637 267731279 277987838
1437.9B77987838J7405540K1332234K4330407K7667433L6196321M9514324N8280587
$$ 277987838 295393378 316725612 341056019 368723452 404919773 454434097 512714684
1452.2E12714684N3005815L7303388J5895068o05046p833720j3774573j7866910j7609537
$$ 512714684 565720499 603023887 618918955 618313909 610480189 596705616 578838706 561229169
1468.5E61229169j8139898k1667540k3172141k2768080k4480730k8318346l3081561
$$ 561229169 543089271 521421731 498249590 475481510 451000780 422682434 389600873
1482.8C89600873l6213994l0684739k836943L1355381K9373646r20266l2850504l5987705
$$ 389600873 353386879 322702140 319865197 351220578 380594224 379673958 346823454 310835749
1499.1C10835749J76936M1012556O3975900N8578402K3418784J217544n708337q859306
$$ 310835749 311012685 352025241 416001141 474579543 497998327 499215871 493507534 484648228
1515.4D84648228j0706634j1422246j2560755j2782038j2745827j4081419j4150470
$$ 484648228 473941594 462519348 449958593 437176555 424430728 410349309 396198839
1529.7C96198839j3899475j4107168j1309624p410616m133135Q3030J446634j958310
$$ 396198839 382299364 368192196 356882572 349471956 345338821 345421851 346868485 344910175
1546C44910175r792328k0430833k8464884k8597414j7317191P198676L9298564N4618806
$$ 344910175 335117847 314687014 286222130 257624716 240307525 247506201 286804765 341423571
1562.4C41423571O4331800O3663095M7278226K9039800J4018953O060183K054989k450109
$$ 341423571 405755371 469418466 516696692 545736492 559755445 565815628 567870617 565420508
1578.7E65420508j0235726k4145008l8050562m3581485m5074046n0179899n5899888
$$ 565420508 555184782 531039774 492989212 449407727 404333681 354153782 298253894
1593B98253894n3333327l6191181r451046J3312369K7417854L6331713L6518872K5820553
$$ 298253894 244920567 208729386 199278340 212590709 240008563 276340276 312859148 338679701
1609.3C38679701J4599800R636790M276067m165054j355975J2901485K3569464K0879269
$$ 338679701 353279501 362916291 367192358 363027304 361671329 374572814 398142278 419021547
1625.6D19021547J2583434N583466l91216n143404j0417491j3685405j5278190j7773182
$$ 419021547 431604981 437188447 436797231 431653827 421236336 407550931 392272741 374499559
1641.9C74499559j8965721j8433124j3471841p151455r201914j9910276k4698228k7144283
$$ 374499559 355533838 337100714 323628873 316477418 307275504 287365228 262667000 235522717
1658.2B35522717k8392210k2113577q337632O720349K3594857M1042909M4556454M2770028
$$ 235522717 207130507 185016930 176679298 183399647 206994504 248037413 292593867 335363895
1674.5C35363895L9362997L0681103K5044590K5146783K8912514K5203973J9827485
$$ 335363895 374726892 405407995 430452585 455599368 484511882 509715855 529543340
1688.8E29543340J8892706J7269730J7703116J8033028J6806781J7773330J4504612
$$ 529543340 548436046 565705776 583408892 601441920 618248701 636022031 650526643
1703.1F50526643J1395514J1098027R565532P847846O881714P176041Q458972P899463
$$ 650526643 661922157 673020184 682585716 690433562 697315276 704491317 712950289 720849752
1719.4G20849752O169439N580008N111098M115164L726066L510832L469050K751768
$$ 720849752 727019191 732599199 737710297 741825461 745551527 749062359 752531409 755283177
1735.7G55283177J141250l02017j350283r05991R43422K952755M589558N580306M836797
$$ 755283177 756424427 756122410 754772127 753866136 754809558 757762313 762351871 767932177 772768974
1754.1G72768974L532648K511561J860977J674294J488566J713694K171814J814783
$$ 772768974 776301622 778813183 780674160 782348454 783837020 785550714 787722528 789537311
1770.4G89537311J099526R72331R08256P02977N61118M21166j14798q68559j284778
$$ 789537311 790636837 791609168 792517424 793220401 793781519 794202685 794087887 793219328 791934550
1788.8G91934550j711786k420902k441883j123727M86374J059652L76284j54436N28872
$$ 791934550 790222764 787801862 785359979 784236252 784722626 785782278 786158562 786004126 786532998
1807.1G86532998K274692M322946N447924M888177L043533J036822k41220k56598P41005
$$ 786532998 788807690 793130636 798578560 803466737 806510270 807547092 807305872 807049274 807790279
1825.5H07790279J342833Q66712j1385n88417r39071j221061j227021r90868j031935
$$ 807790279 809133112 809999824 809988439 809400022 808460951 807239890 806012869 805022001 803990066
1843.8H03990066j435161j831591k091706k016603j031399O95586J690984J281619
$$ 803990066 802554905 800723314 798631608 796615005 795583606 796279192 797970176 799251795
1860.2G99251795L76999n17964k113044m415274n532324m016459j078904J779854L605962
$$ 799251795 799628794 799110830 796997786 792582512 787050188 783033729 781954825 783734679 787340641
1878.5G87340641L787160K387643N80609q6427Q67247K533198L397822L003657J763761
$$ 787340641 791127801 793515444 794096053 794009626 794876873 797410071 800807893 803811550 805575311
1896.9H05575311N59509J21534J14977L3021j2100R1374j5974m15563o82235p37190
$$ 805575311 806134820 806256354 806371331 806404352 806392252 806483626 806467652 806052089 805369854 804632664
1917.3H04632664r35316j247883j219452q91506o40393n16474p01845j356661j870870
$$ 804632664 803697348 802449465 801230013 800338507 799698114 799181640 798479795 797123134 795252264
1935.6G95252264j727820j771212l094017n645990r118677j2531697j1004746j142800
$$ 795252264 793524444 791753232 788659215 783013225 773894548 761362851 750358105 749215305
1951.9G49215305R749830J2479901Q347928L210545o73413k800882j753330K049505
$$ 749215305 758965135 771445036 779792964 783003509 782330096 779529214 777775884 779825389
1968.3G79825389M578531L873825K082825R19223K02656l05057j59085N71370J000584
$$ 779825389 784403920 788277745 790360570 791279793 791482449 791177392 791018307 791589677 792590261
1986.6G92590261P70568M18961J76847j57654l52323k16842j33097l15308m37797m50670
$$ 792590261 793360829 793779790 793956637 793798983 793446660 793229818 793096721 792781413 792343616 791892946
2007G91892946o18220q46445q63850p37429n94437l53277j07825k59578o43432n30541
$$ 791892946 791274726 790428281 789564431 788827002 788232565 787879288 787771463 787511885 786868453 786337912
2027.4G86337912l28183n85198n83172L5286N45859M88162K74181K13802M1068k98560
$$ 786337912 786009729 785424531 784841359 784876645 785422504 785910666 786184847 786398649 786439717 786141157
2047.8G86141157m00424l03507m06742o23941o69897p40886j060485j267612j039267
$$ 786141157 785740733 785437226 785030484 784406543 783736646 782995760 781935275 780667663 779628396
2066.2G79628396n70416p8977M50373P65562N78523J82211L6359J1623j81854k74122
$$ 779628396 779057980 778979003 779429376 780194938 780773461 780955672 780992031 781003654 780821800 780547678
2086.6G80547678j27136j48595m47273o07014n84781o76512p12514l83199n245M3273
$$ 780547678 780420542 780271947 779824674 779217660 778632879 777956367 777243853 776860654 776855409 776898682
2106.9G76898682L4809J86682K23696N4062j5498K563j89006m69208n42998n87165
$$ 776898682 776933491 777120173 777343869 777397931 777382433 777384996 777195990 776726782 776183784 775596619
2127.3G75596619p96914q73089p18475o82354p76589o52790m02510l37779l34323k31981
$$ 775596619 774799705 773926616 773208141 772525787 771749198 771096408 770693898 770356119 770021796 769789815
2147.7G69789815l12090o72579q69810p35164m91560p8857N56171R34661P25627L38554
$$ 769789815 769477725 768805146 767935336 767200172 766708612 766629755 767185926 768120587 768846214 769184768
2168.1G69184768K24829J39534k04444n00500n94377p89762j048028r86338p13110
$$ 769184768 769409597 769549131 769344687 768844187 768249810 767460048 766412020 765425682 764712572
2186.5G64712572n42819l10183R7930L02732J26720p0512j66655m20928p19905p08222
$$ 764712572 764169753 763859570 763957500 764260232 764386952 764316440 764149785 763728857 763008952 762300730
2206.9G62300730n12958m55260m21465k31623m2021J05917L84986O24478M74155J12534
$$ 762300730 761787772 761332512 760911047 760679424 760637403 760743320 761128306 761752784 762226939 762339473
2227.3G62339473m9651j32978l87609n96523n50926m80056n40435n07951l88443m76539
$$ 762339473 762289822 762156844 761769235 761172712 760621786 760141730 759601295 759093344 758704901 758228362
2247.7G58228362o64771o91473q05438j209319j419484j052320m68254j13488J1921
$$ 758228362 757563591 756872118 756066680 754857361 753437877 752385557 751917303 751803815 751815736
2266G51815736p4327m61518q32916p48217l58045p570L88444Q19266R23931O73890
$$ 751815736 751741409 751279891 750446975 749698758 749340713 749333143 749721587 750540853 751464784 752138674
2286.4G52138674M68374M20272L13222J79470J64628J34528o1453k43604k80797l70324
$$ 752138674 752607048 753027320 753340542 753520012 753684640 753819168 753757715 753514111 753233314 752862990
2306.8G52862990n99623q28624j138150j709461k165020j749754n07235M44352N90861
$$ 752862990 752263367 751434743 750296593 748587132 746422112 744672358 744165123 744609475 745200336
2325.2G45200336M26173J24216m71353j245201j955151k115131q16524J667857L177405
$$ 745200336 745626509 745750725 745279372 744034171 742079020 739963889 739147365 740815222 743992627
2343.5G43992627K332389O70254J4961K5809j24693l67224k26617p2777j89245l18706
$$ 743992627 746325016 746995270 747010231 747036040 746911347 746544123 746317506 746244729 746055484 745736778
2363.9G45736778m08650n54502n81622n92708q17776j108408j202166j101077r40859
$$ 745736778 745328128 744773626 744192004 743599296 742781520 741673112 740470946 739369869 738429010
2382.3G38429010o98090l93629j89543j23322q9526j46389m26650p54595p90298n14924
$$ 738429010 737730920 737337291 737147748 737024426 736934900 736788511 736361861 735607266 734816968 734302044
2402.7G34302044j30355L49402Q37505J003027P55071L85225O0141k72929n17845n11945
$$ 734302044 734171689 734521091 735358596 736361623 737116694 737501919 737562060 737289131 736771286 736259341
2423.1G36259341l90470m24802n60522o02305n75364n02884k88546n7221n0008j76787
$$ 736259341 735868871 735444069 734883547 734281242 733705878 733202994 732914448 732857227 732807219 732630432
2443.5G32630432k03729k48730n33343q69631j059771j160920r55224j56581P50601
$$ 732630432 732426703 732177973 731644630 730774999 729715228 728554308 727599084 727442503 728193104
2461.8G28193104R93073O46591K75016M471k88844n08190n64456n98609o70612o73950
$$ 728193104 729186177 729832768 730107784 730112255 729823411 729315221 728750765 728152156 727481544 726807594
2482.2G26807594o28233o30259o44207o32823o84678p89345o98566l15130M4048R7573
$$ 726807594 726179361 725549102 724904895 724272072 723587394 722798049 722099483 721784353 721828401 721925974
2502.6G21925974M0889J25050K11895J33514r3758m53949q93533j278818j512468j517176
$$ 721925974 721966863 722091913 722303808 722437322 722343564 721889615 720996082 719717264 718204796 716687620
2523G16687620j100362k00331P21336J090884R53555O79612L05533k72393q73089j281559
$$ 716687620 715587258 715386927 716108263 717199147 718152702 718832314 719137847 718865454 717992365 716710806
2543.4G16710806j478970j305878o14882J59085M77254M49121M13120L69907K19464
$$ 716710806 715231836 713925958 713311076 713470161 713947415 714396536 714809656 715179563 715399027
2561.8G15399027Q7798N3644J1444M7684K61306M29750L51548J34289m7922j83880
$$ 715399027 715486825 715540469 715551913 715599597 715860903 716290653 716642201 716776490 716728568 716544688
2582.2G16544688l31223m83752o26981p46846p05481m46200k25604k59101m02212n18262
$$ 716544688 716213465 715729713 715102732 714355886 713650405 713204205 712978601 712719500 712317288 711799026
2602.6G11799026p01428r83298j257479j542866j987219k468407k590299k056837q24869
$$ 711799026 711097598 710114300 708856821 707313955 705326736 702858329 700268030 698211193 697386324
2620.9F97386324P46668J935959K327203K172947J899183J596928J165390O68943K55584
$$ 697386324 698132992 700068951 702396154 704569101 706468284 708065212 709230602 709899545 710155129
2639.3G10155129n6445l17455m91738n35130n14746n20110n66006o41465p65264r09209
$$ 710155129 710098684 709781229 709289491 708754361 708239615 707719505 707153499 706512034 705746770 704837561
2659.7G04837561j020611j066088r82523p45535n10395m42266m54128l63886k08378
$$ 704837561 703816950 702750862 701768339 701022804 700512409 700070143 699616015 699252129 699043751
2678F99043751j69635k89619m87447p59721j118660j431763j628577j788617j821041
$$ 699043751 698874116 698584497 698097050 697337329 696218669 694786906 693158329 691369712 689548671
2696.4F89548671j454711o84023K01822R98139J558304J730144J519024J090825O08087
$$ 689548671 688093960 687409937 687611759 688609898 690168202 691898346 693417370 694508195 695116282
2714.7F95116282K24947P3851J17778J86265J25587n3525k32577l67642m98891o49452
$$ 695116282 695341229 695415080 695532858 695719123 695844710 695791185 695558608 695190966 694692075 694042623
2735.1F94042623q13901j011253j194834j261473j226783j204312j242399j317501
$$ 694042623 693228722 692217469 691022635 689761162 688534379 687330067 686087668 684770167
2751.4F84770167j354694j295567j163602j007140q85844q29339p90655p76053q34942
$$ 684770167 683415473 682119906 680956304 679949164 679063320 678233981 677443326 676667273 675832331
2769.8F75832331r09686r68337j089811j342356j726032k177179k669692l216028l772795
$$ 675832331 674922645 673954308 672864497 671522141 669796109 667618930 664949238 661733210 657960415
2788.2F57960415m266262m639208m796327m553139l753781k359927m67658J585484
$$ 657960415 653694153 649054945 644258618 639705479 635951698 633591771 633124113 634709597
2804.5F34709597L322422M469097N035519N111397M769087M098832L265321K428651
$$ 634709597 638032019 642501116 647536635 652648032 657417119 661515951 664781272 667209923
2820.8F67209923J593948P48694o2466p99418j418590j871228k147377k374887k640963
$$ 667209923 668803871 669552565 669490099 668690681 667272091 665400863 663253486 660878599 658237636
2839.1F58237636k910614l123343l155172k985894k758265k591074k408325j850248
$$ 658237636 655327022 652203679 649048507 646062613 643304348 640713274 638304949 636454701
2855.5F36454701o38902R41456K304136L085256L193796K696395J859068J120449P26401
$$ 636454701 635815799 636757255 639061391 642146647 645340443 648036838 649895906 651016355 651742756
2873.8F51742756N30184M04358N23507R03785J135529Q87870K84553l74317r42111
$$ 651742756 652272940 652677298 653200805 654104590 655240119 656127989 656412542 656038225 655096114
2892.2F55096114j386345j707911j991868k253890k369345k288877k004326j592815
$$ 655096114 653709769 652001858 650009990 647756100 645386755 643097878 641093552 639500737
2908.5F39500737j357019j505077j889109k275646k592087k763271k713919k379358
$$ 639500737 638143718 636638641 634749532 632473886 629881799 627118528 624404609 622025251
2924.8F22025251j456201K77877K300739L578365L576815K727986J746476R10937K29717
$$ 622025251 620569050 620846927 623147666 626726031 630302846 633030832 634777308 635688245 635917962
2943.2F35917962k97547p16746j130104j536786j888693k268076k711415l152668l548205
$$ 635917962 635620415 634903669 633773565 632236779 630348086 628080010 625368595 622215927 618667722
2961.5F18667722l880441m058183l908157l332317k338529r95993L60489J217723J412093
$$ 618667722 614787281 610729098 606820941 603488624 601150095 600154102 600514591 601732314 603144407
2979.9F03144407J155257P52986M38035J54376l07620r43661j621485k257227k708197
$$ 603144407 604299664 605052650 605490685 605645061 605337441 604393780 602772295 600515068 597806871
2998.2E97806871k857387k743065k554596k718925l631294n216718p072747q637190
$$ 597806871 594949484 592206419 589651823 586932898 583301604 578084886 571012139 562374949
3014.5E62374949r099304p596612l908694R78827N408764P955432P781029N023778
$$ 562374949 553275645 545679033 541770339 542749166 548157930 556113362 563894391 568918169
3030.9E68918169R08970l091573o057561p366121o491541l949583j670778j397848
$$ 568918169 569827139 566735566 560678005 553311884 546820343 542870760 541199982 539802134
3047.2E39802134l232539o265998r500086j1308133r347618l402025K861530O133199
$$ 539802134 536569595 530303597 520803511 509495378 500147760 496745735 499607265 505740464
3063.5E05740464O551206N102694K467573q9646j559973j850605j192689M8042J323163
$$ 505740464 512291670 517394364 519861937 519772291 518212318 516361713 515169024 515217066 516540229
3081.9E16540229K300799K945066L296792L480733L522813L208041K551913K100826
$$ 516540229 518841028 521786094 525082886 528563619 532086432 535294473 537846386 539947212
3098.2E39947212K300441K664745K200723N61416j715660l672719m412055l612578
$$ 539947212 542247653 544912398 547113121 547674537 545958877 542286158 537874103 534261525
3114.5E34261525k232313j838327k947688n187511p981837j0483027j1894643j1647612
$$ 534261525 532029212 530190885 527243197 522055686 514073849 503590822 491696179 480048567
3130.8D80048567r312302m896194O68169N764245R070755J0237187R731292Q329809
$$ 480048567 470736265 465840071 466508240 472272485 481343240 491580427 501311719 509641528
3147.1E09641528O637216M891932L216147J803875P26044q3685o78241j195192j803100
$$ 509641528 516278744 521170676 524386823 526190698 526916742 526833057 526154816 524959624 523156524
3165.5E23156524k547562l349185m119575m881800n627870o315112p001490p794320
$$ 523156524 520608962 517259777 513140202 508258402 502630532 496315420 489313930 481519610
3181.8D81519610q630842r195477r136796q109897n884558k563924J391798N099476
$$ 481519610 472888768 463693291 454556495 446446598 440562040 437998116 439389914 444489390
3198.1D44489390P524281Q144260P127017N024939K642841Q19087n7698q2969L60310
$$ 444489390 452013671 460157931 467284948 472309887 474952728 475771815 475714117 475631148 475991458
3216.5D75991458N60432j56670j721770l376573m555315n325228n995602o650179p251889
$$ 475991458 476551890 476395220 474673450 471296877 466741562 461416334 455420732 448770553 441518664
3234.8D41518664p848203q488327r173721r820134j0205447j0150433r705394r016812
$$ 441518664 433670461 425182134 416008413 406188279 395982832 385832399 376127005 367110193
3251.1C67110193q151591o925911n020171k372801O59346L421337N081236M853010
$$ 367110193 358958602 352032691 347012520 344639719 345299065 348720402 353801638 358654648
3267.5C58654648K722502l08514l131240n393625p211417q497059r107709r178996
$$ 358654648 361377150 361068636 357937396 352543771 345332354 336835295 327727586 318548590
3283.8C18548590q891881q184135o826788m824608k519936j41084K307832M734070
$$ 318548590 309656709 301472574 294645786 289821178 287301242 287160158 289467990 294202060
3300.1B94202060O933808Q769810J0195881J1220217J1812419J2004524J1924893J1667818
$$ 294202060 301135868 309905678 320101559 331321776 343134195 355138719 367063612 378731430
3316.4C78731430J1253088J0647059R936631R420961R354770R594619R754747R608835
$$ 378731430 389984518 400631577 410568208 419989169 429343939 438938558 448693305 458302140
3332.7D58302140R188950Q616299Q065402P616103P135451O623536O146789N684554
$$ 458302140 467491090 476107389 484172791 491788894 498924345 505547881 511694670 517379224
3349E17379224N296886M988134M687131M381716M054189L702402L354132L033698K748727
$$ 517379224 522676110 527664244 532351375 536733091 540787280 544489682 547843814 550877512 553626239
3367.4E53626239K443672K090334J775027J536369J291096J010001P93815O94394O34789
$$ 553626239 556069911 558160245 559935272 561471641 562762737 563772738 564566553 565260947 565895736
3385.7E65895736O33002O90639O74367N79774N21958N27620M48048K11716O7890J49071
$$ 565895736 566528738 567219377 567893744 568473518 568995476 569523096 569971144 570182860 570250750 570399821
3406.1E70399821J99258J15395N9068L1710J4782R7394J62005R2626N5551J43111J92642
$$ 570399821 570599079 570714474 570773542 570805252 570820034 570917428 571079433 571172059 571227610 571370721 571563363
3428.6E71563363J33872J91510L33428K62916R3282P4148J68681K93553L88443L88146
$$ 571563363 571697235 571888745 572222173 572485089 572578371 572652519 572821200 573114753 573503196 573891342
3449E73891342L76582M19795M67003N34713O05881O09279O83606Q99553R46998O53506
$$ 573891342 574267924 574687719 575154722 575689435 576295316 576904595 577588201 578487754 579434752 580088258
3469.4E80088258L89814M59731O47366P71463P98166O77764N87463O50347O98149O97613
$$ 580088258 580478072 580937803 581585169 582356632 583154798 583832562 584420025 585070372 585768521 586466134
3489.8E86466134P79807Q79646Q62181P50124P19607Q00967P45237O35028P64728R56416
$$ 586466134 587245941 588125587 588987768 589737892 590457499 591258466 592003703 592638731 593403459 594359875
3510.2E94359875R98139R21548Q41200Q47697R03010R79186R52005Q40247Q58247R40800
$$ 594359875 595358014 596279562 597120762 597968459 598871469 599850655 600802660 601642907 602501154 603441954
3530.6F03441954R80019J064301J131236J132071J185418J229643J177550J031995
$$ 603441954 604421973 605486274 606617510 607749581 608934999 610164642 611342192 612374187
3546.9F12374187R04440R53317J071513J076281J055956J116216J062274Q40187Q89540
$$ 612374187 613278627 614231944 615303457 616379738 617435694 618551910 619614184 620454371 621343911
3565.2F21343911J300573J388848J125634J106202J292050J395702J438201J463115
$$ 621343911 622644484 624033332 625158966 626265168 627557218 628952920 630391121 631854236
3581.5F31854236J389980J294077J380980J488984J358926J273632J395225J491070
$$ 631854236 633244216 634538293 635919273 637408257 638767183 640040815 641436040 642927110
3597.9F42927110J427949J290977J151442J084745J177430J252890J234054J166225
$$ 642927110 644355059 645646036 646797478 647882223 649059653 650312543 651546597 652712822
3614.2F52712822R68933J020432J244604R91464N04672L18468P28965R90331N54979
$$ 652712822 653681755 654702187 655946791 656938255 657442927 657761395 658490360 659480691 660035670
3632.5F60035670L38912L95417M44114M82440L62575N4002o2942L21626M97461K3543
$$ 660035670 660374582 660769999 661214113 661696553 662059128 662113130 662050188 662371814 662869275 662892818
3652.9F62892818m2617M93765P18832N24759L27587Q4818j54793p7129L0101j39773
$$ 662892818 662850201 663343966 664062798 664587557 664915144 664999962 664845169 664768040 664798141 664658368
3673.3F64658368M7683L12090J85848J35123J25110J49429M90070P84814N63562L46422
$$ 664658368 664706051 665018141 665203989 665339112 665464222 665613651 666103721 666888535 667452097 667798519
3693.7F67798519K53678N9962l7670J00255R4533j59622l29971k21431N2094j9550
$$ 667798519 668052197 668112159 668074489 668174744 668269277 668109655 667779684 667558253 667610347 667590797
3714.1F67590797k60890k83479k08020k01524k58505l08395l85046m00364j98185K61366
$$ 667590797 667329907 667046428 666838408 666636884 666378379 666069984 665684938 665284574 665086389 665347755
3734.5F65347755O60360L60369l40998m49478R7394J21414j39355J50144K87115m4167
$$ 665347755 666008115 666368484 666027486 665578008 665675402 665796816 665657461 665807605 666094720 666050553
3754.9F66050553k15232r3460k9802j68980k50280k10225o0558j3531k11060k93076
$$ 666050553 665835321 665741861 665712059 665543079 665292799 665082574 665022016 665008485 664797425 664504349
3775.3F64504349j60277o5088j60158k38299j68443r9778j02877k15769l72649l98457
$$ 664504349 664344072 664278984 664118826 663880527 663712084 663612306 663509429 663293660 662921011 662522554
3795.7F62522554m07040l54051p0989m3869r1136N9009j13488m16755m30942k43664
$$ 662522554 662115514 661761463 661690474 661646605 661555469 661614478 661500990 661084235 660653293 660409629
3816.1F60409629k72393k48670J3530m4286j73212j93119k27689j95802j87814j83225
$$ 660409629 660137236 659888566 659902096 659857810 659684598 659491479 659263790 659067988 658880174 658696949
3836.5F58696949o0021L0040J4902j01924l83616o70314p10606k15292K75671n4240
$$ 658696949 658636928 658666968 658681870 658579946 658196330 657526016 656815410 656600118 656875789 656821549
3856.9F56821549l65377l66330j89125k9206j71781k31564m6730k444q5235k72274
$$ 656821549 656456172 656089842 655900717 655871511 655699730 655468166 655421436 655418992 655333757 655061483
3877.3F55061483l46064k30670k05279j86920l18587n08070m08411l12745l93093l85105
$$ 655061483 654715419 654484749 654279470 654092550 653773963 653265893 652857482 652544737 652151644 651766539
3897.7F51766539k24710k4676J56641J70350J7166l1769j2040j02103j56641q6665
$$ 651766539 651541829 651517153 651673794 651844144 651861310 651829541 651817501 651715398 651558757 651472092
3918.1F51472092j14978k20418j65224q5890j99199k86638k16663k09690k82943l09705
$$ 651472092 651357114 651136696 650971472 650885582 650686383 650399745 650183082 649973392 649690449 649380744
3938.5F49380744k85864k07901j94371k42472j94132j55509k01761k22147k10702k17200
$$ 649380744 649094880 648886979 648692608 648450136 648256004 648100495 647898734 647676587 647465885 647248685
3958.9F47248685j91509j37091j02282j6391O3896N0485L5048M649q8274j60337j72376
$$ 647248685 647057176 646920085 646817803 646801412 646865308 646915793 646950841 646955490 646867216 646706879 646534503
3981.3F46534503j37866j26004j66953j89245k18570k71439k80917k37227
$$ 646534503 646396637 646270633 646103680 645914435 645695865 645424426 645143509 644906282
3997.6F44906282
$$ 644906282
##END=$$ End of the data block
