##TITLE=B8M - Elis - Epoxido $$ Begin of the data block
##JCAMP-DX=5.00 $$ ACD/SpecManager v 10.08
##SPECTROMETER/DATA SYSTEM=Alpha
##DATE=13 Apr 2015 15:31:48
##DATA TYPE=INFRARED SPECTRUM
##DATA CLASS=XYDATA
##ORIGIN=
##OWNER=
##NPOINTS=1765
##FIRSTX=399.76428223
##LASTX=3997.64306641
##MAXX=3997.64306641
##MINX=399.76428223
##MAXY=0.81253231
##MINY=0.32347128
##XFACTOR=1.0000000000
##YFACTOR=1.000000000000000e-9
##FIRSTY=0.76261789
##DELTAX=2.03961372
##XUNITS=1/CM
##YUNITS=ARBITRARY UNITS
##XYDATA=(X++(Y..Y))
399.8G62617886j0878682j7195582j8270314j210690J9889236K0712375J0383606M909993
416.1G70957828L349840K999604J338780l450871q861303r599268l218234N747378
432.4G59263754R367108P892132N599141K782166k51710p12157J161814J137376j306355
450.8G84933269k224386p54714m7326j131654j729071q20815n10991k185225l188312
469.1G72340775j243353J320421J062572l38971K17855J165271m4287j882851j532256
487.5G71065176k46585q23200k574682k641320j102626r60291k508163k697349j341879
505.8G56169081j355410l300667m790604m834533n940318r876191j5268505k2119999
522.1F88682854l4849465n1800191m2777360J3692916P1272135P3853790L9973677
$$ y = [762617886, 751739204, 734543622, 716273308, 715062618, 734951854, 755664229, 766047835, 770957828, 774307668, 777307272, 778646052, 775195181, 766333878, 756734610, 753516376, 759263754, 768630862, 776522994, 782122135, 784904301, 784652591, 783940434, 785102248, 786239624, 784933269, 782708883, 781954169, 781906843, 780775189, 779046118, 778225303, 777714312, 775529087, 772340775, 771097422, 772417843, 773480415, 773141444, 773359299, 774524570, 774480283, 772597432, 771065176, 770818591, 769995391, 767420709, 764779389, 763676763, 762716472, 760208309, 757510960, 756169081, 754813671, 751513004, 746722400, 741887867, 735947549, 726071358, 710802853, 688682854, 653833389, 602033198, 559255838, 572948754, 644220889, 718074679, 758048356]
536.4G58048356J3989985L704667o07133m589319q342803j3042390k2716999l0859709
552.7F95584655j3278127K6180625M2482853K5523484P234752R38713J0491o52731
569.1G84024715j613855j683772j036703j002252j797736j596212m49300j73807j196862
587.4G73474216j679897q17060k00630p45773j342833p66277k27094r09805j854420
605.8G64930427j751184j478374k246440l646612l048956N40733J994312j83165j525343
624.1G53585398r08613q04544j630425k370417k846122k798259j770139j194179j886547
642.5G37376153k663910l873169n422473o707132p926941j0366380j4528632k1025062
658.8F64862454l1932473n0703049n6673229J408935J02263689O3953817j2031257
$$ y = [758048356, 772038341, 775743008, 775135875, 770546556, 762203753, 749161363, 726444364, 695584655, 682306528, 708487153, 750970006, 776493490, 783728242, 784666955, 784677446, 784024715, 782410860, 780727088, 779690385, 778688133, 776890397, 775294185, 774844885, 774671078, 773474216, 771794319, 770977259, 770776629, 770030856, 768688023, 767921746, 767694652, 766784847, 764930427, 763179243, 761700869, 759454429, 755807817, 752758861, 753299594, 755293906, 755110741, 753585398, 752676785, 751872241, 750241816, 747871399, 745025277, 742227018, 740456879, 739262700, 737376153, 734712243, 730839074, 725416601, 718709469, 710782528, 700416148, 685887516, 664862454, 632929981, 582226932, 525553703, 526962638, 629226327, 693180144, 681148887]
673.1F81148887l9069474k3012877J1144579J4457762j7911136n6283176p9566628
687.3D90907937o1889052N312741P4269145R4172001P2289825M4556737K6963293J7101050
703.7G63683677J0775566N699098J254916k638399o694556q306861p59542R346962
720G72360861Q747638J620352k626419l814638l769636l636599m442811o235540q502721
738.3G49700487j1468649j6868353k7055264m3468475n8294713m7171712J020670M9797296
754.7E96191287O0550571M3570578K5088489J2849509N033255J54138l045917n777419
771G34614491q520424j1275232j5073657k1782577l3089697m9050331n6970537k4021268
787.3E14830768M8762202R0785921O3874900J3783932k0212352m0292263n1929057
$$ y = [681148887, 642079413, 619066536, 630211115, 644668877, 626757741, 570474565, 490907937, 429018885, 434331626, 508600771, 602772772, 675062597, 719619334, 746582627, 763683677, 774459243, 780158341, 781413257, 778774858, 772080302, 763773441, 763013899, 772360861, 781108499, 782728851, 780102432, 776287794, 772518158, 768881559, 764438748, 758203208, 749700487, 738231838, 721363485, 694308221, 650839746, 592545033, 545373321, 546393991, 596191287, 656741858, 700312436, 725400925, 738250434, 743283689, 743437827, 740391910, 734614491, 726094067, 714818835, 699745178, 677962601, 644872904, 595822573, 538852036, 514830768, 563592970, 654378891, 718253791, 732037723, 711825371, 671533108, 619604051]
801.6F19604051m5662105j3782382K1695554K9347837J1635304q825302j9006908j0289491
817.9E84716558J6660631L9006233L7406147K0157337L554404o477177j0072291q755446
834.2F76196396m581809L099859J5622795K5101244K0248294K446830j4138043j0780692
850.5G13214874J0802508J9965946Q808673J318037K412439n9426p174492j4126837
866.8G35161722j9795955k3926556k4536609k1874190k2619068l1320453m1040063
881.1E50048828l9042950j7365545J8707723N1764726O5966726N9892237M4544876
895.4G34516621L0260086J9997120J2616455P267058M027188K497554J350224j55330
911.7H12376976j330554j611531j686871k161563k450227k375305l124774o116509
$$ y = [619604051, 573941946, 560159564, 581855118, 611202955, 622838259, 614012957, 595006049, 584716558, 601377189, 640383422, 677789569, 697946906, 701501310, 695024133, 684951842, 676196396, 671614587, 674714446, 690337241, 715438485, 735686779, 738133609, 723995566, 713214874, 724017382, 743983328, 752792001, 754110038, 756522477, 756463051, 749288559, 735161722, 715365767, 691439211, 666902602, 645028412, 622409344, 591088891, 550048828, 511005878, 493640333, 512348056, 564112782, 630079508, 689971745, 734516621, 764776707, 784773827, 797390282, 804657340, 808684528, 811182082, 812532306, 812376976, 811046422, 809434891, 807748020, 805586457, 803136230, 800760925, 797636151, 791519642]
928G91519642j2187362k0324945k0329714j987457J8899679K0918548J1066437L519654
944.3G91094482m71115k886295l938079k768875M31538K609670J768708j15036j543105
962.7G84181893k847791l964901m720926m431665k774179j483142k220869m221976
979G57516444o687880r365141j1077583j0187388q613526j1414945j6818703j9309878
995.3F64041400k1447897k2045791j4825285j3436973j6559958Q985460M9926698O0295820
1011.6F94933474M0097475J0992587p845521L011644K3156702J9870997M523337m247725
1028G84492970o323040l584087n46515j429796l700018m406691m084885k905190o50346
1046.3G56862402J677573K465188J439691k30134j883507m071831p503748j2679160
$$ y = [791519642, 779332280, 759007335, 738677621, 736690164, 755589843, 776508391, 787574828, 791094482, 790623367, 787737072, 783798993, 781030118, 781461656, 784071326, 785840034, 785724998, 784181893, 781334102, 777369201, 772648275, 768216610, 765442431, 763959289, 761738420, 757516444, 750828564, 741463423, 730385840, 720198452, 711584926, 700169981, 683351278, 664041400, 642593503, 620547712, 605722427, 592285454, 575725496, 584710956, 634637654, 694933474, 735030949, 746023536, 738178015, 741189659, 764346361, 784217358, 788740695, 784492970, 778169930, 774585843, 774039328, 772609532, 768909514, 764502823, 760417938, 757512748, 756862402, 758539975, 761005163, 762444854, 762214720, 760331213, 756259382, 748755634, 736076474]
1062.6G36076474k0590365k9274165k6316047K37226L2414020L9477109K4317921R834706
1079G66176879L508807J217901j6331r61125j398981j192868j184105k060533l258169
1097.3G60831475l761708l437222l689527o280839j1348188j6277850j3855994J048863
1113.6G03229010J5446603J1929870l624916r236753L934801J6938805J3945520M920542
1129.9G57483482K98977n90086k00391j10745p20561j286149j426041j719355k501667
1148.3G49227464l312170l802598m506945o084800q574784j0860085r456575m272581
1164.6F98356926l215253r884536j9198597k5449097j8925905M652977K7407289L0798017
1180.9F84541821J8175245K076387p775247o381571K191067P964849P108331L646970
$$ y = [736076474, 715486109, 686211944, 659895897, 660133123, 692547143, 732024252, 756342173, 766176879, 769685686, 770903587, 770887256, 769926131, 768527150, 767334282, 766150177, 764089644, 760831475, 757069767, 753632545, 749943018, 743662179, 732313991, 716036141, 702180147, 703229010, 718675613, 730605483, 726980567, 717743814, 721678615, 738617420, 752562940, 757483482, 757782459, 757192373, 756991982, 756881237, 756160676, 754874527, 753448486, 751729131, 749227464, 745915294, 742112696, 737605751, 731520951, 722946167, 712086082, 702629507, 698356926, 695141673, 685257137, 666058540, 640609443, 621683538, 626336515, 653743804, 684541821, 702717066, 704793453, 697018206, 690636635, 692827702, 700792551, 707900882, 711547852]
1197.3G11547852N93960k013505m428684o991327j0739803j5068710j4924050r131193
1213.6F48844540o647766j1198103j6646802k0684898k5315345l1021237l6287010
1227.9E01043379l8693398l5652339k5427908p681877J5817762L7581682M8126817
1242.1D95114118M8347205M6705067M5318663M0919781L3095002K4496853J7518580
1256.4G51515269J2787283R157121N627334K756059J156330J99557j046777k448857
1272.7G79703319l334463l551423l604114l765524l788054l377676k401888q48234
1289G55031943R31442K464473L369391K766371K40266l408014p685244j2775422j6467988
1307.4G24467218j3005316Q62121J5901804J7177165O933033j68025N07831K588749
$$ y = [711547852, 712141812, 710128307, 705699623, 698708296, 687968493, 672899783, 657975733, 648844540, 642196774, 630998671, 614351869, 593666971, 568351626, 537330389, 501043379, 462349981, 426697642, 401269734, 393587857, 409405619, 446987301, 495114118, 543461323, 590166390, 635485053, 676404834, 709499836, 733996689, 751515269, 764302552, 773459673, 779087007, 781843066, 782999396, 783198953, 782152176, 779703319, 776368856, 772817433, 769213319, 765447795, 761659741, 758282065, 755880177, 755031943, 755963385, 758427858, 761797249, 764563620, 764803886, 761395872, 753710628, 740935206, 724467218, 711461902, 712324023, 728225827, 745402992, 752336025, 752168000, 752675831, 755264580]
1323.7G55264580J834214n37992k760469m726887o860197r421289j2980938j7394840
1340G02416182k0260334j9020498j1060536L254354J5504658J8116415J2780010N377889
1356.4G07108140P9811j895786k248466l788769p157087r607375p880926m606545m700959
1374.7F65302038o922066n898774j795053r34780p618546k0688713l2336593l3447444
1391E55660069k2449255L955305L3753097M6631217L8724303K2867083J2215198O330728
1407.3F97687745K813101j60456l453195p002115j1738718j6064107j3961256q946955
1423.7F39174044l543615K215266P442176J1651695J2727082J2187540Q341730m13299
1440F89782619r833693k0584166l9836884o0634374l3629894L5921037P5223386O9019139
$$ y = [755264580, 757098794, 756560802, 753800333, 749073446, 742213249, 732791960, 719811022, 702416182, 682155848, 663135350, 652074814, 655329168, 670833826, 688950241, 701730251, 707108140, 707187951, 705292165, 703043699, 699254930, 692097843, 682490468, 674609542, 670002997, 665302038, 658379972, 652481198, 650686145, 649751365, 642132819, 621444106, 589107513, 555660069, 533210814, 537166119, 570919216, 617550433, 656274736, 679141819, 691357017, 697687745, 700500846, 700340390, 696887195, 689885080, 678146362, 662082255, 648120999, 639174044, 635630429, 637845695, 645287871, 656939566, 669666648, 681854188, 690195918, 689782619, 679948926, 659364760, 619527876, 558893502, 525263608, 561184645, 636408031, 705427170]
1456.3G05427170L9778471J3459027L710150O54877L18229L51310q05557j423419J03832
1474.7G61574090J326084P25567n99504j439869j671314k658188n847991r970844o736815
1493G34701216L905654J1269570O065309j290441m493058r049236j4794887j2276709
1509.3G14037418j2869656k0577848k0506441K870142L2940149M0531457K3293376
1523.6G59718597P587254K583206O56426j214385k352477j987338k981424n273938
1539.9G56735921l685892q53896j38700k40385o12081o01947q03470j704574l382683
1558.3G44712293k032399k79963j902700l593325n725742q416593q855760j2351572
1574.6G01554239k5025964l3945978j8375575K1066963M1573346J7301560j1277199
$$ y = [705427170, 745205641, 758664668, 762374818, 763029695, 763347924, 763699234, 762893677, 761470258, 761574090, 762900174, 763625741, 763026237, 761586368, 759915054, 757256866, 751408875, 741438031, 734701216, 738606870, 749876440, 755941749, 754651308, 750158250, 741109014, 726314127, 714037418, 701167762, 680589914, 660083473, 662953615, 695893764, 736425221, 759718597, 767305851, 769889057, 770545483, 769331098, 766978621, 764991283, 762009859, 756735921, 753050029, 752196133, 752057433, 751817048, 751204967, 750603020, 749799550, 748094976, 744712293, 742679894, 742399931, 740497231, 736903906, 731178164, 722761571, 713905811, 701554239, 676528275, 642582297, 624206722, 645273685, 686847031, 704148591, 692871392]
1588.9F92871392k6037455m0981531m8370779j6939044M1316092O5631569M1588545
1603.2G09078789J0806203m422725j1187553j3073087q085787K348483J0306716O839752
1619.5G02610791N81085k336442k571404k602696k894700l101885m388631o805896
1635.8F78490222n421460j532376J194775P44581l261268n377292m074038p151603
1652.1F53611541j1905253q442640q855403j3034344j8076062j9570887j7941594k2080720
1668.4E33704638k8351187k8941691m0626496n6821347m4665992j0826647M2031407
1682.7C65502685R9079907Q5257262N3147793M2652547L1004191K2904157J8551291
1697G18099833J6638934J9497752J4946521R403646P787346N475522L161490J248598
$$ y = [692871392, 666833937, 625852406, 577481627, 560542583, 601858675, 667490244, 709078789, 719884992, 715462267, 704274714, 691201627, 683115840, 685464323, 695771039, 702610791, 703191876, 700855434, 698284030, 695681334, 692786634, 689684749, 685296118, 678490222, 673068762, 671536386, 672731161, 673475742, 670214474, 664837182, 660763144, 653611541, 641706288, 633263648, 624408245, 611373901, 593297839, 573726952, 555785358, 533704638, 505353451, 476411760, 435785264, 378963917, 334297925, 323471278, 365502685, 464582592, 549839854, 602987647, 645640194, 676644385, 699548542, 718099833, 734738767, 754236519, 769183040, 778586686, 786374032, 791849554, 795011044, 796259642]
1713.3G96259642k91825p50363J59443M87089K2113J51217L0756l11255n88894k56836
1733.7G94911087J031637Q61466k17855n03063n88358j177907j482189j061320j6272
1752G91757226j00672r98140j218855j037002r24170l90947m01377r78232j436948
1770.4G84270883j527608n72562l27706j145244j494050o90639R0957J14441n59092
1788.8G78159380j354396p94471M09365L75569k74539k84732Q9407j98245j109540
1807.1G75017798j838148j864552j548767j700223k003252j215279M14848J650453
1823.4G66912878J913487J227081M63963N66006N38468J6034o1274P212m70280q79825
1843.8G70233750r1493O03795M60625K50101J97351J16766j09971k98321l85404n87165
$$ y = [796259642, 795967817, 795217454, 795376897, 795863986, 795886099, 796037316, 796068072, 795756817, 795167923, 794911087, 795942724, 796804190, 796586335, 796083272, 795494914, 794317007, 792834818, 791773498, 791757226, 791656554, 790658414, 789439559, 788402557, 787478387, 787087440, 786686063, 785707831, 784270883, 782743275, 782170713, 781843007, 780697763, 779203713, 778513074, 778604031, 778718472, 778159380, 776804984, 776010513, 776419878, 776795447, 776520908, 776236176, 776325583, 776127338, 775017798, 773179650, 771315098, 769766331, 768066108, 766062856, 764847577, 765262425, 766912878, 768826365, 770053446, 770517409, 771083415, 771621883, 771637917, 771576643, 771583855, 771113575, 770233750, 770142257, 770746052, 771206677, 771456778, 771654129, 771770895, 771660924, 771362603, 770977199, 770390034]
1864.2G70390034j119852j285732m12226K06113j81198o55592p37786o13332n15163
1882.6G65075266n55515o92189q10384n22614k92540n20229o32107o02245p55847r69946
1903G58721650j152873j434327j838266k363921k936959l083825k449334j786887k097726
1921.3G39577532j701653J279354M430592N089581L793776K143860R04500J50502k47896
1939.7G55420148k44259L61621R36687Q77559N01871J06096k04265l82363n35548p35700
1960.1G56101847r32396j213789j576006j761317j731813j401186n84543J31130J32263
1978.5G47164190r2209O9917L33965K86102K11179M14133O77943N62847N8591k38537
1998.8G49448121n7757K60055M37081M18186K98261J95861R1017p7784k21491l09944
$$ y = [770390034, 769270182, 767984450, 767572224, 767778337, 767597139, 766941547, 766203761, 765590429, 765075266, 764519751, 763827562, 763017178, 762494564, 762202024, 761681795, 761049688, 760447443, 759691596, 758721650, 757568777, 756134450, 754296184, 751932263, 748995304, 745911479, 743462145, 741675258, 739577532, 737875879, 739155233, 743585825, 748675406, 752469182, 754613042, 755517542, 755668044, 755420148, 755175889, 755537510, 756474197, 757351756, 757853627, 757959723, 757755458, 757373095, 756837547, 756101847, 755169451, 753955662, 752379656, 750618339, 748886526, 747485340, 746900797, 747031927, 747164190, 747071981, 747141898, 747475863, 747761965, 747973144, 748387277, 749065220, 749628067, 749686658, 749448121, 749390364, 749650419, 750087500, 750505686, 750803947, 750999808, 751090825, 751013041, 750791550, 750481606]
2019.2G50481606m55916o74487o57916j85370J30713j6630j42336j19149j24693j95027
2039.6G48040795k48074k70307l21389l56018k83480j30296j6987l3259j25230k03967
2060G46051788k48551k30193j17302k2352p8738j84536k32219j85311q3089l1590o5446
2082.5G44572461j19269j16050q4639r5844j63973k11298k13981k28166k97845l53217
2102.9G42688179l36647l48985m34220n02765m98414m32670l80278m23372m63068m37558
2123.3G38430202m49538n68211p03335p55966o71685k69413M36128R84609R76503N83768
2143.7G37993062K35974P9811m292j08003k48313l43561k71976j08242o6519j62661
2164.1G36995280k10524j79767j37687j33813j75654k13624k59995l22282l21150k14636
$$ y = [750481606, 750025690, 749351203, 748693287, 748507917, 748638630, 748622000, 748479664, 748360515, 748235822, 748040795, 747792721, 747522414, 747201025, 746845007, 746561527, 746431231, 746414244, 746380985, 746255755, 746051788, 745803237, 745573044, 745455742, 745433390, 745354652, 745170116, 744937897, 744752586, 744669497, 744637907, 744572461, 744453192, 744337142, 744252503, 744156659, 743992686, 743781388, 743567407, 743339241, 743041396, 742688179, 742351532, 742002547, 741568327, 741065562, 740567148, 740134478, 739754200, 739330828, 738867760, 738430202, 737980664, 737412453, 736709118, 735953152, 735281467, 735012054, 735448182, 736432791, 737409294, 737993062, 738229036, 738308847, 738304555, 738196552, 737948239, 737604678, 737332702, 737224460, 737157941, 736995280, 736784756, 736604989, 736467302, 736333489, 736157835, 735944211, 735684216, 735361934, 735040784, 734826148]
2184.5G34826148j37449k21073l52204l37661k53856k61306k74122j35899M7267M1246
2204.8G32941091j06215j62721m6134P6473M7922n5492j18911k04087m23371p06435
2225.2G31242120p99894n57780j70112O9559J45018K38776L11673J96993q822j04188
2245.6G30563343j09911j81020k85744k49625j33037j50025k65479k54631j10805p2003
2266G28751063j91450k53796j49191m8578j33454k89083l03924k48849l27349m98951
2286.4G26306438n62191m76479l69132l05473j93775m530R2268K4974r2447j38700
2306.8G24280953j31011j78933k74122k91764k49923l92138p70271r95279p72893m28617
2327.2G19796002k02119J06513L01957O9857k76745l44455k16782j76787o7234L04162
$$ y = [734826148, 734688699, 734467626, 734115422, 733777761, 733523905, 733262599, 732988477, 732852578, 732899845, 732941091, 732834876, 732672155, 732626021, 732702494, 732750416, 732694924, 732576013, 732371926, 731948555, 731242120, 730442226, 729884446, 729714334, 729783893, 729928911, 730167687, 730479360, 730676353, 730667531, 730563343, 730453432, 730272412, 729986668, 729737043, 729604006, 729453981, 729188502, 728933871, 728823066, 728751063, 728559613, 728305817, 728156626, 728108048, 727974594, 727685511, 727381587, 727132738, 726805389, 726306438, 725744247, 725267768, 724898636, 724593163, 724399388, 724394858, 724487126, 724512100, 724419653, 724280953, 724149942, 723971009, 723696887, 723405123, 723155200, 722763062, 721992791, 720997512, 720224619, 719796002, 719593883, 719700396, 720002353, 720072210, 719795465, 719451010, 719234228, 719057441, 718990207, 719294369]
2347.6G19294369M79639K98381n186k37048l80277m04299l05891k39908k04444o6698
2368G18228638J05918J21832M3451N6327J23322J09851k9862j97351k51651k69591
2388.4G18040884m04418n48840n12838l32177k13265k10285j63257k0504J9133j44184
2408.8G15510249l25441l91186m11868m50611l51429k5928K71976K85626J05023M3631
2429.2G14260042J64866K07484P8082k7657n781n007j42097k75672k84791k86639m33981
2451.6G13248849o47426p18653o67274o38723n69344k90215J44601M73499N39959M71890
2472G11347163M26531L40282J10806j57059k44021j36972m8339p1406q0288l0875l9577
2494.5G11416245j25409j47581m8101K8849m7684j73390j94788j80125k64227m15266
$$ y = [719294369, 719774008, 720072389, 720067203, 719830155, 719449878, 719045579, 718739688, 718499780, 718295336, 718228638, 718334556, 718456388, 718499839, 718556166, 718679488, 718789339, 718759477, 718562126, 718310475, 718040884, 717636466, 717087626, 716574788, 716242611, 716029346, 715819061, 715655804, 715635300, 715654433, 715510249, 715184808, 714793622, 714381754, 713931143, 713579714, 713553786, 713825762, 714111388, 714216411, 714260042, 714424908, 714632392, 714710474, 714682817, 714677036, 714672029, 714529932, 714254260, 713969469, 713682830, 713248849, 712601423, 711882770, 711215496, 710576773, 710007429, 709717214, 709861815, 710335314, 710875273, 711347163, 711773694, 712113976, 712224782, 712067723, 711823702, 711686730, 711638391, 711566985, 711486697, 711455822, 711416245, 711290836, 711143255, 711095154, 711124003, 711076319, 710902929, 710708141, 710528016, 710263789, 709848523]
2514.9G09848523m66406l42488j82570j29878j17481p0870q6128j79410k06650j18077
2535.3G07948565m1782q3805j96456k52188k26259k25007k80619l05116k26438j44720
2555.6G05966175k07961l31461l37720k55168k52485l77834m92394m98235m42147m05729
2576G02365041m21763m32431l93629l18051k16961j06275K9683J71304K33233K11179
2596.4G01121330J67132Q4519n6803j87695k76506k81394j69813n9188o854L7431M8995
2618.9G00421154q165q2374j13487j26779j06752L3200J93178K02835R0539j8954p8678
2641.3G00405717j44363k24232k74718k93553k85983k60651k10822j38759j03057j37865
2661.7F98331714j94550j95086j48415j23919j28984j68443j94311j80781j77085j74344
$$ y = [709848523, 709382117, 709039629, 708857059, 708727181, 708609700, 708538830, 708452702, 708273292, 708066642, 707948565, 707906783, 707822978, 707626522, 707374334, 707148075, 706923068, 706642449, 706337333, 706110895, 705966175, 705758214, 705426753, 705089033, 704833865, 704581380, 704203546, 703711152, 703212917, 702770770, 702365041, 701943278, 701510847, 701117218, 700799167, 700582206, 700475931, 700505614, 700676918, 700910151, 701121330, 701288462, 701372981, 701316178, 701128483, 700851977, 700570583, 700400770, 700341582, 700334728, 700372159, 700421154, 700412989, 700330615, 700217128, 700090349, 699983597, 700016797, 700209975, 700412810, 700503349, 700484395, 700405717, 700261354, 700037122, 699762404, 699468851, 699182868, 698922217, 698711395, 698572636, 698469579, 698331714, 698137164, 697942078, 697793663, 697669744, 697540760, 697372317, 697178006, 696997225, 696820140, 696645796]
2682.1F96645796j54853j12176q9049j23203j69396k07543k62380l37482l78489l46899
2702.5F94464326l29912l70443l91900m19080n08488o40392p93457r52780j105309
2720.9F88952565j185715j026154n12719K25365Q54433J083136R33349O10530K81692
2739.2F90216482J01447R3281P4029o6996k58863l88741l47376k04980j63853k18690
2759.6F88835740k18868j70529k10226k97844k65539j15573o855n0723j44124j74046
2780F87181413k17497l08514l59416l17812k65777k98440l73364m41491n32866o31988
2800.4F83434248o51181n84006n39243n77212o46948o84858o98447p57754r03428j075923
2820.8F76315248j140356j058102q77142n75423j66237J15514K7477l35931p94709
$$ y = [696645796, 696490943, 696378767, 696289718, 696166515, 695997119, 695789576, 695527196, 695189714, 694811225, 694464326, 694134414, 693763971, 693372071, 692952991, 692444503, 691804111, 691010654, 690057874, 688952565, 687766850, 686740696, 686227977, 686453342, 687307775, 688390911, 689324260, 689934790, 690216482, 690317929, 690411210, 690485239, 690418243, 690159380, 689770639, 689423263, 689218283, 689054430, 688835740, 688616872, 688446343, 688236117, 687938273, 687672734, 687557161, 687550306, 687499583, 687355459, 687181413, 686963916, 686655402, 686295986, 685978174, 685712397, 685413957, 685040593, 684599102, 684066236, 683434248, 682783067, 682199061, 681659818, 681082606, 680435658, 679750800, 679052353, 678294599, 677391171, 676315248, 675174892, 674116790, 673239648, 672664225, 672497988, 672613502, 672640979, 672305048, 671510339]
2839.1F71510339j231253j531721j768767k030313k250851k335190k201259j763106
2855.5F56397879j021981j98424M40478Q16346R87589J014531R50992Q09788N12183
2873.8F60709381J77205K622j40309l44515m88996n76496p18117r06885j033783j085758
2894.2F55594349j157284j306414j532138j839161k254307k725542l052592k996147
2910.5F38730764k455651j451195O5744J933098L515959M303634M267156L701508K871573
2928.9F55482590J842261Q57770J76907k01464k66314j29282j07527k95877m99308
2947.2F56859756m68493k01702l576R4056K37167L29911L08574J70767n7221k79307
2967.6F56989932m38988m81248m60625n50031p01249p92265q72672r56416j037597
$$ y = [671510339, 670279086, 668747365, 666978598, 664948285, 662697434, 660362244, 658160985, 656397879, 655375898, 655177474, 655617952, 656434298, 657421887, 658436418, 659387410, 660197198, 660709381, 660886586, 660889208, 660748899, 660404384, 659915388, 659338892, 658620775, 657713890, 656680107, 655594349, 654437065, 653130651, 651598513, 649759352, 647505045, 644779503, 641726911, 638730764, 636275113, 634823918, 634889662, 636822760, 640338719, 644642353, 648909509, 652611017, 655482590, 657324851, 658182621, 658359528, 658158064, 657891750, 657762468, 657654941, 657359064, 656859756, 656391263, 656189561, 656185985, 656280041, 656517208, 656847119, 657155693, 657326460, 657269239, 656989932, 656550944, 656069696, 655609071, 655059040, 654357791, 653565526, 652692854, 651736438, 650698841]
2986F50698841j128734j205384j418293j840472k241015k694011l351212l858983l578723
3004.4F29382014j766860J415550M131258M587054L019214J159430L84926N72443N43595
3022.7F43428624l94285j815260k761125k089083N81681K941132K268255m04298j735330
3041.1F40020311j83165K244711K624333Q83579j272798k884447l636182l415644k499878
3059.4F31880820j225710J490116O420374R861469Q275867M251599J402020K06352
3075.7F62562907l1591j67608q83102k112449l067195k233505Q04603L361046L159285
3094.1F61392391J668155R03368O83367L40998L7611Q8513L94106O29365P01666O17385
3114.5F67456925L01778j08897m65095p07865p81238p79450p63595o29485k05636M03941
$$ y = [650698841, 649570107, 648364723, 646946430, 645105958, 642864943, 640170932, 636819720, 632960737, 629382014, 627615154, 629030704, 633161962, 637749016, 640768230, 641927660, 642312586, 642885029, 643428624, 643034339, 641219079, 638457954, 636368871, 636950552, 639891684, 642159939, 641755641, 640020311, 639837146, 642081857, 644706190, 645589769, 644316971, 641432524, 637796342, 634380698, 631880820, 630655110, 632145226, 638565600, 648427069, 656702936, 660954535, 662356555, 662562907, 662531316, 662363708, 661480606, 659368157, 656300962, 654067457, 654872060, 658233106, 661392391, 663060546, 663963914, 664647281, 664988279, 665025890, 665114403, 665508509, 666137874, 666839540, 667456925, 667758703, 667649806, 667184711, 666476846, 665695608, 664916158, 664152563, 663523078, 663317442, 663721383]
3134.9F63721383P38322N60642R4771k32935k79784k32220j68800j58131l45946n51641
3155.3F63145661n06580l39865k55585k98917m60625o34372o93560o72340o74427o77943
3175.7F57931447n48363l34441l03984m74393o36220p06852o65009m44472j78635j34230
3196.1F53504848l31640n27382n77688n92708o31989o69360o97136o95645o63877o30975
3216.5F47486448o33895o57737o57678o13630n45144m81963m31299m84169p18772q78215
3236.9F41383946p92384o99878o78599o09875n96642p32541q16643p52032p34985q19802
3257.3F34150565p48933m61340k13325j29044j18136j67608m27902p36117p65026n80669
3277.7F29802465m13119m07875n09620n61118n38409m90546n15222o44327p70628q30889
$$ y = [663721383, 664459705, 665020347, 665115118, 664882183, 664602399, 664370179, 664201379, 664043248, 663697302, 663145661, 662639081, 662299216, 662043631, 661744714, 661284089, 660649717, 659956157, 659283817, 658609390, 657931447, 657383084, 657048643, 656744659, 656270266, 655634046, 654927194, 654262185, 653817713, 653639078, 653504848, 653173208, 652645826, 652068138, 651475430, 650843441, 650174081, 649476945, 648781300, 648117423, 647486448, 646852553, 646194816, 645537138, 644923508, 644378364, 643896401, 643465102, 642980933, 642262161, 641383946, 640591562, 639891684, 639213085, 638603210, 638006568, 637274027, 636457384, 635705352, 634970367, 634150565, 633401632, 632940292, 632726967, 632597923, 632479787, 632312179, 631884277, 631148160, 630383134, 629802465, 629389346, 628981471, 628471851, 627910733, 627372324, 626881778, 626366556, 625722229, 624951601, 624120712]
3298F24120712q10504p05838o43253p95067j082837j267731j279235j228392j267672
3316.4F15040183j386404j464784j524031j682461k025306k452075k799034l071726
3332.7E98634362l125131k586245j462698l07680L23117L11971M768k77042n47886
3351.1E90967536q38399j066685j227796j404643j610637j794576j925886j970410
3367.4E79128504j965881j984179j960098j860202j780510j754760j746536j691699
3383.7E64384639j553297j349509j172304j216888j397610j327514r82643q69870j231849
3402.1E53283155j496971j267135r51052q26776q26001r33230r86457q56936o92486
3420.4E44446111n59926m32432k85745j59084j87874j67728K39p0274l24905l17574
$$ y = [624120712, 623310208, 622604370, 621961117, 621166050, 620083213, 618815482, 617536247, 616307855, 615040183, 613653779, 612188995, 610664964, 608982503, 606957197, 604505122, 601706088, 598634362, 595509231, 592922986, 591460288, 591152608, 591475725, 591787696, 591792464, 591515422, 590967536, 590129137, 589062452, 587834656, 586430013, 584819376, 583024800, 581098914, 579128504, 577162623, 575178444, 573218346, 571358144, 569577634, 567822874, 566076338, 564384639, 562831342, 561481833, 560309529, 559092641, 557695031, 556367517, 555384874, 554515004, 553283155, 551786184, 550519049, 549567997, 548741221, 547915220, 546981990, 545995533, 545138597, 544446111, 543886185, 543453753, 543168008, 543008924, 542821050, 542653322, 542653561, 542583287, 542258382, 541940808]
3440.8E41940808r0241R4056K47300M27186N10216M49479M50611N83827O13213M81784
3461.2E45708239N83708R28760R75311N96046K37048K88427N79476Q05855P53879N04375
3481.6E51961124N38230P45356P40170P13885P81298P95245Q12829Q20398P67171O94275
3502E59369981O31929O60956P44581Q91387J096011J075089Q74221Q15987Q79705R48668
3522.4E67988515R12011P89403Q30114J032770J178086J184106J070916J006306J083493
3540.8E77075720J062989Q64923P81715R52065J047075J050472J159430J170218J046359
3559.1E86210966R35495O62923K80261P14004J855195K049326J514376J225412J263916
3577.5E96711874J446962J584888J316964O56724O20842J612485J877606J363814J352310
$$ y = [541940808, 541850567, 541944623, 542191923, 542619109, 543129325, 543578804, 544029415, 544613242, 545226455, 545708239, 546291947, 547220707, 548196018, 548792064, 549029112, 549317539, 549897015, 550702870, 551456749, 551961124, 552499354, 553244710, 553984880, 554698765, 555480063, 556275308, 557088137, 557908535, 558675706, 559369981, 560001910, 560662866, 561407447, 562298834, 563394845, 564469934, 565344155, 566160142, 567039847, 567988515, 568900526, 569689929, 570520043, 571552813, 572730899, 573915005, 574985921, 575992227, 577075720, 578138709, 579003632, 579785347, 580737412, 581784487, 582834959, 583994389, 585164607, 586210966, 587146461, 587809384, 588089645, 588803649, 590658844, 592708170, 594222546, 595447958, 596711874, 598158836, 599743724, 601060688, 601717412, 602338254, 603950739, 605828345, 607192159, 608544469]
3595.8F08544469J649022J563907J503825J457691R47773O00100R12309J188218J293660
3614.2F19660974J172721Q56936J311242J902462J414537J45555o00398Q35597J932025
3632.5F28631651J500845J069427Q24511N92172M12762j08242j069069j177907O39797
3650.9F31315947J642584P77066J73330N66245N41746K30134L2782o45816j231730
3669.2F33402288k50042L18885k74002O36756J545668J217127P39813J35958p40171
3687.6F36732280q38876N27263J323879R45330L07083k63393m36187J05023K77996
3706F38680398m48226j201928p06613O10053O97554j34767o86109n76555j02222M37915
3726.4F36569500P12693J29819r28283j071811K29061J280129P57038r12964j728296
$$ y = [608544469, 610193491, 611757398, 613261223, 614718914, 615666687, 616266787, 617179096, 618367314, 619660974, 620833695, 621690631, 623001873, 624904335, 626318872, 626464427, 625864029, 626699626, 628631651, 630132496, 631201923, 632026434, 632618606, 633031368, 632923126, 631854057, 630676150, 631315947, 632958531, 633735597, 633908927, 634475172, 635016918, 635247052, 635279834, 634634018, 633402288, 633152246, 633471131, 633197129, 633833885, 635379553, 636596680, 637336493, 637472451, 636732280, 635893404, 636420667, 637744546, 638689876, 638996959, 638733566, 638297379, 638402402, 638680398, 638232172, 637030244, 636323631, 636933684, 637631238, 637496471, 636810362, 636233807, 636131585, 636569500, 637282193, 637412012, 636483729, 635411918, 635640979, 636921108, 637678146, 636765182, 635036886]
3744.7F35036886l52800k46465r45211M14670J394689O52253l7551L39151N31793o080
3765.1F36781335l79205m04119J17480P13230M71472k28285n31495j49965K2828q1777
3785.5F36331499R8526J70589m5836m60565q44598p06673q22008r12964N2154J81496
3805.9F33041620J7643N27799K73824p51734j200080n81681n15461p7188R31382P39992
3826.3F32406116K92420r239l09229m26650q37564q60036J81675Q32022Q39710O25372
3846.7F32734597k0981j297951k532184p64668J621842J304925Q5890p21752m89235
3865F29920483j08838n41389m84229J89543M57466K53498n37932o58929j87516l40462
3885.4F27961695j40846r9361l56555L15190P09355k9743p58290o67453J1742R11295
$$ y = [635036886, 634684086, 634437621, 633492410, 633907080, 635301769, 635954022, 635916471, 636255622, 636787415, 636781335, 636402130, 635998011, 636115491, 636828721, 637300193, 637071908, 636540413, 636390448, 636413276, 636331499, 636430025, 636600614, 636554778, 636094213, 635249615, 634542942, 633720934, 632807970, 632860124, 633041620, 633059263, 633587062, 633860886, 633109152, 631909072, 631327391, 630811930, 630734742, 631666124, 632406116, 632698536, 632689297, 632380068, 631953418, 631115854, 630255818, 630437493, 631269515, 632109225, 632734597, 632713616, 631415665, 628883481, 628118813, 629740655, 631045580, 631131470, 630409718, 629920483, 629811645, 629270256, 628786027, 628975570, 629433036, 629686534, 629148602, 628489673, 628302157, 627961695, 627820849, 627721488, 627364933, 627680123, 628389478, 628359735, 627601445, 626933992, 626945734, 627857029]
3905.8F27857029J211048O83307J29104k04265n39899m68731L0518J23620j35363o4492
3926.2F28621876K3723k20716k19107J55926K86460O3956k15888k78473l5465J6451
3946.6F28198743j24514N6267K70247J55211m5717j41204j82509j13487q941n4181
3967F28009915j19149j23859j62422j36912m3869q1718j21117k9266m3452k11298l07143
3989.5F26629710k35677j45554j62363j92702
3997.6F25893414
$$ y = [627857029, 629068077, 629751384, 629880488, 629676223, 629136324, 628667593, 628698111, 628821731, 628686368, 628621876, 628645599, 628424883, 628205776, 628361702, 628648162, 628712118, 628496230, 628217757, 628182292, 628198743, 628074229, 628130496, 628400743, 628555954, 628510237, 628369033, 628186524, 628073037, 628064096, 628009915, 627890766, 627766907, 627604485, 627467573, 627423704, 627341986, 627220869, 627191603, 627148151, 626936853, 626629710, 626394033, 626248479, 626086116, 625893414]
##END=$$ End of the data block
