##TITLE=B8M - Elis - Chalcona $$ Begin of the data block
##JCAMP-DX=5.00 $$ ACD/SpecManager v 10.08
##SPECTROMETER/DATA SYSTEM=Alpha
##DATE=13 Apr 2015 15:31:48
##DATA TYPE=INFRARED SPECTRUM
##DATA CLASS=XYDATA
##ORIGIN=
##OWNER=
##NPOINTS=1765
##FIRSTX=399.76428223
##LASTX=3997.64306641
##MAXX=3997.64306641
##MINX=399.76428223
##MAXY=0.81310332
##MINY=0.25102910
##XFACTOR=1.0000000000
##YFACTOR=1.000000000000000e-9
##FIRSTY=0.73008996
##DELTAX=2.03961372
##XUNITS=1/CM
##YUNITS=ARBITRARY UNITS
##XYDATA=(X++(Y..Y))
399.8 730089962 735922217 739878654 743303776 750495851 758709729 761234760 757836163 754141867
416.1 754141867 754170299 756036103 753754020 749329627 748575687 750849187 750211775 744815350 738751650
434.4 738751650 734194398 727113187 717022955 714583635 725737512 739783227 746384680 745080292
450.8 745080292 741534948 741062880 743019760 742745638 738873184 735436916 735178053 735418022 732199252
469.1 732199252 726149797 721593261 719804227 716501355 708488166 697047532 683435202 663218915
485.4 663218915 627640188 574839354 532260597 549921691 626428545 698696077 728956819
499.7 728956819 729311407 716543078 693488657 667128325 662551224 690994620 727876425 748491704
516 748491704 752707899 750194132 746916413 743496597 738147378 730071545 719707608 706322789
532.3 706322789 686323702 655745864 624657869 624522090 668344378 722413778 753031075 761668026
548.7 761668026 762122035 761150956 759965658 758341491 756318390 754142463 752197921 750491798 748773694
567 748773694 746830285 744983494 743745983 743304372 743136883 742358148 740910947 739694238 739286959
585.4 739286959 738917172 737607777 735596240 734387100 734263003 733766913 731868744 729519129 728330016
603.7 728330016 727993250 726620257 723264217 718789339 714827418 714211524 716323137 716568053 714563966
622.1 714563966 713046372 711883843 709160030 704943597 700972795 697814643 692798495 682296574
638.4 682296574 669052601 659809649 647919536 615663350 558885396 523372114 570117772 663602531
654.7 663602531 719347656 728966773 725069404 720259428 715255022 706320941 690910280 679461718
671 679461718 673131764 667496145 658815145 644560933 626348138 606033206 579846561 539376974
687.3 539376974 479809135 417631447 391116798 422567517 501972020 597306490 672602534
701.6 672602534 715329230 731124222 725335121 701454163 657379508 590137482 531043410 544969141
717.9 544969141 637322903 730010033 773639500 782673836 778214753 770852447 765169859 760261834
734.3 760261834 753360212 744027317 733618498 720681906 698860288 665228605 641546309 658598423
750.6 658598423 701179206 726862669 727316082 718170285 708297312 697719693 682581127 658455789
766.9 658455789 620897472 566184103 501104712 457957774 479565829 568395853 670263648
781.2 670263648 733561456 755227983 756167889 750847936 744559109 737647951 728815317 717823207
797.5 717823207 705589473 692129850 675529659 653560042 624951124 587622643 536306262
811.8 536306262 466400057 393141598 366616249 432570100 566462517 692907751 769082069
826 769082069 802479804 812974453 813103318 808282197 800348520 789359450 774196565 758053422
842.4 758053422 752078354 760519505 771738589 776089728 775122821 772070467 767700911 762425542
858.7 762425542 756836116 750336170 740352511 723965049 706911385 706920385 728078425 750143707
875 750143707 759457350 760259986 758633316 756648421 754339218 751070797 746572673 741381109 736974239
893.4 736974239 735171080 735832334 736676216 736541152 735885680 734716713 732603908 729924083 727724850
911.7 727724850 726294994 724671602 721917212 718332767 714835107 711381972 706344306 697273970
928 697273970 682345986 666400492 663595140 677650750 692353606 696819007 695218921 691717446
944.3 691717446 686012805 679276526 675776362 676231802 676110446 672390997 665769398 657890141 649207056
962.7 649207056 639212370 628254414 616264999 601020992 580504775 554044008 522109270 484066963
979 484066963 439527154 402078867 401983380 455899835 539030910 611315548 661540926 694786787
995.3 694786787 704397619 695094824 688476205 686231673 675339282 653885484 625116944 588320971
1011.6 588320971 541069269 491712004 470907688 503401458 576102674 651995897 694022536
1025.9 694022536 687619150 645319223 584463477 525700450 503599226 542171299 619423985
1040.2 619423985 689692080 732266724 752942562 761282861 763124049 761912704 759526432 757320642
1056.5 757320642 755934060 754965901 753634214 751129270 746790171 740665734 733268142 724321842
1072.8 724321842 712919712 701391280 698362589 708257079 721716523 728308141 727823615 724485278
1089.2 724485278 721655726 720838010 720941246 720126390 718280375 716291487 713991940 710658789 706775904
1107.5 706775904 703160167 699148655 693931520 688707292 687327027 692821085 701815307 707928240
1123.8 707928240 709516287 708782792 707546175 706348002 704847455 702587783 699648738 696618557
1140.1 696618557 693891644 691199660 687938988 684088945 680335402 676956475 673229158 668265462
1156.5 668265462 661838651 653653800 645432353 642481863 644267797 642136931 631632626 612589955
1172.8 612589955 583309829 548258960 527232528 535200059 562134743 596873760 631552994
1187.1 631552994 649208963 646476984 635690451 622881293 606931746 586980045 562219560
1201.3 562219560 529939890 488950521 447436094 430201292 457328111 501047969 511069298
1215.6 511069298 481246799 441867590 419085532 428181440 473927915 543569207 613129377
1229.9 613129377 666219592 701066792 722078741 732500792 735058367 732811630 728094757 722099543
1246.2 722099543 715339482 708781183 704219162 702932656 703989685 705120146 704863369 702983499
1262.5 702983499 699379146 693917274 686798573 678692222 670552254 662402272 652312338 637478888
1278.8 637478888 616493165 591487885 570595920 565413237 579280674 600733697 615811169
1293.1 615811169 619353592 613005102 600289702 582151413 558833420 538361073 529198349 523312151
1309.4 523312151 510359108 502284408 520468533 561076522 592272580 594201684 576238155 546978772
1325.8 546978772 505546749 461403728 434371173 428810656 430066407 438849628 476813853 541288257
1342.1 541288257 603937447 650730610 685031712 710275590 724433303 727862656 724786162 720025361
1358.4 720025361 717181981 717809498 720377147 721824765 720839143 717388809 710903764 701295435 692565620
1376.7 692565620 689926982 693495214 697995424 699680746 698560834 695574582 691399574 685556233
1393.1 685556233 678297997 671995044 666836739 660559475 650623739 635597646 617790282 602021992
1409.4 602021992 596556604 607408047 627623796 646430194 658899188 664358437 665586233 664715946
1425.7 664715946 662300646 658533335 654369175 650112748 644456327 637789488 631448805 623673618
1442 623673618 611846626 592354417 571945012 578991473 616988063 652980447 667813659 669685543
1458.3 669685543 670563221 671284914 671206176 670714021 669795990 667708874 664565980 662080824 660494506
1476.7 660494506 658808410 656544030 653695047 650097787 645093322 640052855 637764931 636514783
1493 636514783 632988751 626975536 620734990 614470363 606394708 590893328 559547722 526959419
1509.3 526959419 511029959 522507608 560882807 602279723 624218106 629834712 628395677 624030828
1525.6 624030828 618403375 612840176 606377065 598801911 593206227 588550508 581000149 572563529
1542 572563529 565899849 559356868 551442862 540721536 528299630 515583813 502627194 483298212
1558.3 483298212 458957583 441784114 424204916 409139931 410972148 430696607 448652476
1572.6 448652476 457254499 459174603 458683729 459958553 457101494 438018709 399317771 348143876
1588.9 348143876 298744082 268725842 260104924 256010443 251029104 261259228 301286489 368205488
1605.2 368205488 445286781 515357375 569177091 604945838 625835240 639770210 652918518
1619.5 652918518 664156675 671679020 674381256 672289371 666546226 658782244 648054183 631848156
1635.8 631848156 613636374 593033433 566882908 538993716 511479080 487081856 466223866
1650.1 466223866 428171366 370275617 356453985 389306664 451471448 523983419 581235409
1664.3 581235409 614841759 640991747 673254311 706424773 736263454 759181559 769914925
1678.6 769914925 772157371 768337727 760187387 756473064 760167181 768616796 776625633 781357765
1694.9 781357765 783261359 783300042 782619536 782066822 780427516 777917445 775378525 772704720 770041525
1713.3 770041525 767782092 767233014 768897653 770400405 770403624 769432545 767945886 766209483 764334857
1731.7 764334857 762243271 761132002 760613382 759648025 758842766 758365691 757361710 755583704 753685057
1750 753685057 752816319 752418101 751307607 749659538 747828543 746024728 744993985 744265437 743177712
1768.4 743177712 741782308 740136445 738714039 737013757 734442770 731936932 730808675 730792880 731046200
1786.7 731046200 731018186 730394542 729967535 730219603 730000675 728303075 725346267 722621322 721441507
1805.1 721441507 721698999 722115338 721738636 720790386 719782710 719124198 719150722 719620049 720118105 720614910
1825.5 720614910 720927358 720923841 721279681 721930742 722098887 721662521 720760942 719297826 717454195 716275513
1845.9 716275513 715830684 715362489 714806736 714587510 715053976 715900779 716529667 716685057 716376543 715525031
1866.3 715525031 714349627 713618875 713442564 713270128 712915897 712419689 711829185 711264610 710751593
1884.6 710751593 710056186 709011495 708095729 707510650 706803620 705816805 704486251 702598810 699926436
1903 699926436 696029544 690616965 685047448 682440042 684545457 690162241 696757853 701467991 702869117
1921.3 702869117 701933384 700415432 699412048 699108362 699384153 700266242 701611400 702785373 703269005
1939.7 703269005 703159273 702985346 702807665 702219546 701175749 699919403 698626578 697398126 696229696
1958.1 696229696 694835782 692744315 689598382 686028361 684596360 686968744 690903723 693523645
1974.4 693523645 694412112 694142461 692853689 690786898 688944161 688536406 689523697 690720379 691659570
1992.7 691659570 692592919 693232059 693314433 693172693 693066776 692913413 692591012 692111731 691632271 691220880
2013.1 691220880 690724552 690045059 689258695 688434601 687593520 686779499 686016262 685130119 684051812
2031.5 684051812 683205903 683076441 683620989 684347093 684907734 685165644 684883654 683990359 682899773
2049.8 682899773 682285130 682518899 683289707 683933496 684078515 683753431 683100104 682207525 681200206
2068.2 681200206 680455089 680432916 681032181 681599140 681697130 681437433 681134701 680934727 680783451 680586278
2088.6 680586278 680335820 680075407 679823756 679572582 679286718 678946376 678613722 678370416 678203821 678019106
2109 678019106 677741230 677412212 677145123 676966786 676802754 676585317 676275134 675907314 675604701 675442219
2129.4 675442219 675363660 675291300 675195694 675013423 674704432 674348950 674059927 673847854 673649967 673426032
2149.8 673426032 673215032 673084795 673017681 672921240 672718883 672432423 672158182 671921492 671651840 671360373
2170.2 671360373 671136498 670981884 670831263 670624256 670325041 669983447 669686496 669396937 669002652 668496430
2190.6 668496430 667986870 667574644 667299986 667118669 666959465 666842818 666780949 666679978 666442037 666066527
2211 666066527 665665984 665353835 665099084 664812088 664481759 664137423 663790226 663479388 663246155 663035452
2231.4 663035452 662769198 662401855 661912382 661354601 660873771 660594344 660497367 660416663 660210431 659932852
2251.8 659932852 659673035 659444749 659276009 659181774 659145772 659128189 659050286 658860683 658578694 658271968
2272.2 658271968 658011258 657795489 657542288 657189727 656781554 656418324 656156003 655945122 655688465 655341923
2292.5 655341923 654901683 654374599 653787553 653189540 652735531 652632058 652845621 653087854 653143108 652989447
2312.9 652989447 652693331 652307153 651806176 651181221 650507629 649762332 648648858 647249520 646675229
2331.3 646675229 647441089 648340523 648409188 647798657 646921635 646206915 646133304 646799326 647762060 648641050
2351.7 648641050 649306595 649772942 650026262 649986625 649674296 649186790 648670495 648224473 647863448 647605062
2372.1 647605062 647442043 647373259 647377014 647348106 647207677 646950781 646610737 646272004 646009207 645795703
2392.5 645795703 645597041 645441115 645297945 645096064 644810975 644464612 644124091 643848658 643605053 643287420
2412.9 643287420 642872036 642470896 642181695 641967833 641704977 641356945 641073227 641017258 641165316 641343832
2433.3 641343832 641405940 641355991 641266644 641168475 641075432 641008377 640978515 640971422 640910685 640701413 640351295
2455.7 640351295 639950514 639539540 639115334 638729930 638445556 638261259 638104558 637879074 637555301 637198806
2476.1 637198806 636876822 636582136 636260211 635869861 635477901 635170817 634915113 634642661 634340405 634048462
2496.5 634048462 633790672 633521259 633197665 632866204 632671952 632703662 632860422 632986844 633017242 632942498
2516.9 632942498 632764220 632486045 632081091 631560266 631040454 630618870 630295157 630035341 629832506 629720986
2537.3 629720986 629721701 629776955 629800320 629760861 629683018 629560471 629349172 629064023 628757000 628458142 628169835
2559.7 628169835 627827644 627338946 626712322 626052201 625450969 624947727 624558926 624294877 624107301 623873532
2580.1 623873532 623465955 622905552 622410536 622197211 622279346 622461379 622523189 622394145 622141421 621836126
2600.5 621836126 621475697 621050358 620593131 620207429 620072663 620157897 620180905 620107293 620135665 620237172
2620.9 620237172 620234251 620162964 620294392 620778918 621419370 621969044 622418165 622840762 623243988 623541951
2641.3 623541951 623628914 623526514 623326421 623090088 622872591 622698188 622502148 622250497 622042656 621906042
2661.7 621906042 621710181 621389687 621036351 620766282 620613396 620511234 620384634 620249093 620125830 619927466
2682.1 619927466 619551361 619036734 618520141 618081510 617694557 617273152 616824329 616506040 616385043 616299748
2702.5 616299748 616061747 615649998 615193069 614821136 614534914 614243507 613904238 613566935 613270760 612921119
2722.9 612921119 612370193 611573160 610635281 609771013 609244525 609286845 609872997 610643446 611184239 611335337
2743.3 611335337 611237764 611077130 610899985 610693514 610459745 610216081 609929442 609542668 609065533 608500063
2763.7 608500063 607831180 607133269 606564343 606221318 606028736 605842769 605664253 605583787 605539620 605407715
2784.1 605407715 605231822 605061769 604776621 604257345 603474915 602481842 601445079 600655079 600366294
2802.4 600366294 600448847 600483894 600256801 599892676 599605739 599520087 599643946 599888146 600132763 600287557
2822.8 600287557 600287855 600101590 599788547 599418342 598944902 598312974 597553611 596628785 595470309 594153404
2843.2 594153404 592753768 591303289 589896739 588680446 587765455 587171793 586890519 586862624 586980939
2861.6 586980939 587195814 587476850 587769568 588086963 588426471 588594496 588438034 588087499 587700903 587249875
2882 587249875 586667061 586000621 585375845 584858239 584429562 584031940 583558857 582936943 582139373 581069887
2902.4 581069887 579674363 578012109 576094270 573871613 571323454 568583906 566179752 565012455
2918.7 565012455 565763593 568173170 571126223 573588371 575084567 575504124 575165868 574678898 574316084
2937 574316084 573929310 573482573 573150098 573035717 573167086 573623836 574437320 575362921 576085150 576508343
2957.4 576508343 576643050 576490343 576010764 575197160 574186027 573268056 572819710 572942138 573263466
2975.8 573263466 573452890 573449135 573177874 572614133 571834862 570839286 569505513 567601085 565063477
2994.2 565063477 562406421 560431778 559649706 559985161 560608089 560285628 558564007 556652665 556225121
3012.5 556225121 556878626 555994630 551831722 546300232 544240057 548341870 555620015 561361432 563906193
3030.9 563906193 564072013 562805593 560664356 558485806 556722522 554629982 551624060 548588336
3047.2 548588336 546986103 547462046 550009489 554734111 561167479 566958606 569305539 568204939
3063.5 568204939 567118526 570021808 576742828 582903624 585550904 585295975 583593786 581432879
3079.8 581432879 579804480 579666615 581484914 584742785 587961972 589888394 590410888 590102553 589545190
3098.2 589545190 589166164 589189708 589507639 589792311 589803755 589534581 589137554 588696003 588143587 587456346
3118.6 587456346 586779714 586364865 586365044 586640239 586898088 586971402 586873233 586687267 586418927 586046576
3139 586046576 585634649 585265279 584943950 584581554 584109247 583580613 583068073 582542121 581978440 581439674
3159.4 581439674 580975950 580594003 580277741 579997659 579754114 579558730 579366922 579073250 578598201 577992737
3179.8 577992737 577323258 576567590 575733006 574952304 574469864 574389398 574446440 574287951 573876619 573453963
3200.1 573453963 573205709 573041677 572751582 572249115 571563303 570770383 569925189 569037855 568122506 567257106
3220.5 567257106 566555560 566010833 565555692 565178752 564877868 564613283 564224124 563619256 562945545 562360108
3240.9 562360108 562021434 562070310 562285841 562258840 561965346 561669946 561449468 561184227 560855746 560556591
3261.3 560556591 560323060 560148418 560047984 559956729 559657872 559116960 558547735 558024049 557494044 556959152
3281.7 556959152 556439340 555895329 555259287 554494023 553558767 552477241 551374495 550357103 549519598
3300.1 549519598 548950493 548635721 548496842 548501849 548600256 548629999 548437893 547955334 547214806 546336412
3320.5 546336412 545417845 544489861 543501019 542407751 541250288 540081024 538985848 537986577 536884665
3338.8 536884665 535578787 534206986 532848835 531589746 530461669 529176235 527577996 525967002
3355.2 525967002 524581373 523282766 521849155 520399690 519225478 518180788 516824305 515075803
3371.5 515075803 513335466 511889398 510596871 509279013 507893980 506545544 505393803 504501462
3387.8 504501462 503805280 502974153 501818776 500722587 500051498 499507546 498514146 497193336 496174037
3406.1 496174037 495548397 494978607 494292200 493474931 492659748 492023647 491489798 490974009 490616500 490484893
3426.5 490484893 490418911 490224302 490037262 490051568 489992082 489619374 489202499 489024341 489068836 489256829
3446.9 489256829 489525586 489795774 490058869 490397722 490886211 491409183 491754502 492120087 492842406 493688077
3467.3 493688077 494154066 494215816 494310290 494708329 495373785 496005684 496332347 496617317 497104973 497596830
3487.7 497596830 498044610 498584092 499183774 499806851 500413597 500931382 501352489 501722038 502136588 502639592
3508.1 502639592 503307104 504160881 504918933 505451143 505962253 506568074 507234216 507826567 508311093 508916020
3528.5 508916020 509740531 510637760 511509955 512295246 513027608 513813615 514524579 514998555 515419245 516023397
3548.9 516023397 516662180 517302036 518160045 519131780 520011783 520768285 521251738 521347463 521763384 523145437
3569.3 523145437 524654388 525654316 526446462 527384996 528511405 529697061 530641437 531027257 531328738
3587.7 531328738 532456458 533833921 534776747 535690427 536854267 537981629 539063573 540101171 540727437
3606 540727437 541076005 541659892 542356789 543097377 543851316 544450164 545424223 546800971 547812521 547898114
3626.4 547898114 547315717 547770441 549085081 550053120 550668240 551056087 551258445 551386952 551204801
3644.8 551204801 550377488 549628735 550422132 551950037 552767873 553158641 553727150 553999484 554008007 554162741
3665.2 554162741 553975523 553144872 552824557 552754343 552016973 552174687 553316355 554258704 554884732 555099726
3685.6 555099726 554581463 553784609 553877413 554588497 555120885 555302560 555097580 554741919 554851890 555119395
3706 555119395 554761231 553729534 553099453 553725362 554666340 555058479 554927468 554613650 554354846 554378927
3726.4 554378927 554655790 554520369 553576887 552526891 552505970 553411782 554009676 553234339 551757336
3744.7 551757336 551555753 551571071 550954103 551210701 552143455 552510023 552382886 552594841 552910089 552791297
3765.1 552791297 552540779 552351654 552393496 552722812 552915514 552684247 552212358 552004635 551933169 551806986
3785.5 551806986 551882803 552051783 552073300 551810026 551324308 550977886 550408602 549702287 549811423 549981356
3805.9 549981356 550022185 550535560 550908208 550454676 549545944 549051344 548519790 548278153 548833072 549241841
3826.3 549241841 549331725 549161971 548749030 548326135 547608495 546853602 546941698 547530651 548069060 548504114
3846.7 548504114 548650205 547839224 545728207 544843793 546003699 546960771 546981275 546379268 545979679
3865 545979679 545877993 545365334 544920385 545090854 545550525 545883596 545570374 545220435 545258164 545152009
3885.4 545152009 545258760 545327961 544984400 545004249 545248330 544836283 543885291 543114424 542874873 543376327
3905.8 543376327 544204414 544651449 544700682 544500053 544018090 543627679 543657899 543757856 543635070 543522954
3926.2 543522954 543462276 543192267 542917907 542974472 543109179 543028235 542722821 542347014 542145848 542040288
3946.6 542040288 541972399 542124987 542371929 542479157 542494833 542526007 542521477 542443454 542356730 542324126 542339027
3969.1 542339027 542333364 542244375 542089939 541945338 541815937 541659176 541461766 541203499 540887177 540615976
3989.5 540615976 540437162 540278852 540148735 540090621
3997.6 540090621
##END=$$ End of the data block
