##TITLE=B8M - Douglas 1 $$ Begin of the data block
##JCAMP-DX=5.00 $$ ACD/SpecManager v 10.08
##SPECTROMETER/DATA SYSTEM=Alpha
##DATE=23 Jun 2015 08:35:04
##DATA TYPE=INFRARED SPECTRUM
##DATA CLASS=XYDATA
##ORIGIN=
##OWNER=
##NPOINTS=1765
##FIRSTX=399.76428223
##LASTX=3997.64306641
##MAXX=3997.64306641
##MINX=399.76428223
##MAXY=0.87323058
##MINY=0.61792272
##XFACTOR=1.0000000000
##YFACTOR=1.000000000000000e-9
##FIRSTY=0.84760028
##DELTAX=2.03961372
##XUNITS=1/CM
##YUNITS=ARBITRARY UNITS
##XYDATA=(X++(Y..Y))
$$ plain form
399.8 847600281 849501371 850762367 848870277 847590983 849225700 849547803 847523153 847617328 849869013
418.1 849869013 849458635 847688437 848621786 850053787 848448932 846491933 847419024 848270595 846497238
436.5 846497238 845615268 847331107 847831547 846046746 845827222 847401321 846954048 844992816 845220268
454.8 845220268 846581757 845606446 844127178 844998419 845842600 844150186 842581153 843366683 843591213
473.2 843591213 841638625 840715289 841774702 841359258 838796139 837529957 837736905 836152852 833191216
491.5 833191216 831829309 830460548 825187027 816008508 803098381 786092937 770741403 760488689
507.9 760488689 758133471 773721218 802306533 825333595 836862922 839896977 837751091 834558070
524.2 834558070 830648959 820999265 802572787 783454597 780587673 796526909 815034032 826776564
$$ packed form
399.8H47600281J901090J260996j892090j279294J634717L22103k024650R4175K251685
418.1H49869013m10378j770198R33349J432001j604855j956999R27091Q51571j773357
436.5H46497238q81970J715839N00440j784801k19524J574099m47273j961232K27452
454.8H45220268J361489r75311j479268Q71241Q44181j692414j569033P85530K24530
473.2H43591213j952588r23336J059413m15444k563119j266182K06948j584053k961636
491.5H33191216j361907j368761n273521r178519j2910127j7005444j5351534j0252714
507.9G60488689k355218J5587747K8585315K3027062J1529327L034055k145886l193021
524.2H34558070l909111r649694j8426478j9118190k866924J5939236J8507123J1742532
$$ plain form
540.5 826776564 833065569 835054994 835428476 837445557 839775860 839920878 839750886 841329336 842360854
558.9 842360854 841150582 840369999 841468990 841787517 840203166 839397728 840124488 839762211 838099003
577.2 838099003 837789834 838669598 837992907 836185455 835925758 836511672 835212052 832611203 830999315
595.6 830999315 829266191 824373722 815513134 804582179 798093796 804171622 819712460 832933903
611.9 832933903 837567329 835734963 834736824 838104308 841156065 840967178 840422988 841285169 841418564
630.2 841418564 839911163 839122832 839720607 839281261 837326109 836242557 836445332 835761189 834195495
648.6 834195495 833809912 833942831 832078815 828676701 825607955 821950495 817587912 816004574 819365740
667 819365740 824124157 824755251 824083567 823974252 822638333 818576396 813339174 807561278 797891378
$$ packed form
540.5H26776564O289005J989425L73482K017081K330303J45018j69992J578450J031518
558.9H42360854j210272p80583J098991L18527j584351q05438P26760l62277j663208
577.2H38099003l09169Q79764o76691j807452k59697N85914j299620k600849j611888
595.6H30999315j733124m892469q860588j0930955o488383O077826J5540838J3221443
611.9H32933903M633426j832366r98139L367484L051757j88887n44190Q62181J33395
630.2H41418564j507401p88331N97775m39346j955152j083552K02775o84143j565694
648.6H34195495l85583J32919j864016l402114l068746l657460m362583j583338L361166
667H19365740M758417O31094o71684j09315j335919m061937n237222n777896r669900
$$ plain form
685.3 797891378 780325949 754437745 726976752 710940123 713740647 734987020 768916667 799786150
701.6 799786150 815925300 821373582 822558939 820792675 817202926 814108372 811684668 808197498
717.9 808197498 803677797 799877346 796652675 792246461 786880910 782044053 777172029 770527065
734.3 770527065 762485385 754356503 745153189 733040571 718061507 700513899 679408252 656924129
750.6 656924129 640814841 636282146 639522791 646664083 662343979 689429939 719647169 744743884
766.9 744743884 766273797 786364019 801559091 810514629 816847682 822906375 827525735 830209196
783.2 830209196 832888544 836314201 838820517 840012729 841757715 844421089 846194983 846956611 848499477
801.6 848499477 850717783 851833165 852162182 853431940 855108321 855404317 854917884 855495453 856695950
$$ packed form
685.3G97891378j7565429k5888204k7460993j6036629K800524K1246373L3929647L0869483
701.6G99786150J6139150N448282J185357j766264l589749l094554k423704l487170
717.9H08197498m519701l800451l224671m406214n365551m836857m872024o644964
734.3G70527065q041680q128882r203314j2112618j4979064j7547608k1105647k2484123
750.6F56924129j6109288m532695L240645P141292J5679896K7085960L0217230K5096715
766.9G44743884K1529913K0090222J5195072Q955538O333053O058693M619360K683461
783.2H30209196K679348L425657K506316J192212J744986K663374J773894P61628J542866
801.6H48499477K218306J115382L29017J269758J676381K95996m86433N77569J200497
$$ plain form
819.9 856695950 856908560 856667817 857392430 858118713 857096553 854871571 852376163 848896205 845677912
838.3 845677912 846421063 850546002 852378845 849091828 846006036 849576831 856789052 861245215 863170207
856.6 863170207 864880502 865757644 865353882 865277588 866126418 866344333 865509391 865216076 865791440 865713120
877 865713120 864840746 864715278 865293503 864890993 863494515 862554729 861815631 859856665 857099533 854650915
897.4 854650915 850998878 843226612 831308365 820830226 820119560 830052614 842227459 850512862
913.7 850512862 854771495 856426001 857355356 858703256 859501958 859013021 858608782 859273672 859728158
932.1 859728158 858956754 858097255 857945621 857366979 855712414 854113460 852924466 850525916 846227288
950.5 846227288 842087805 839212418 834339619 825241864 818029940 820866108 831358254 841203451
$$ packed form
819.9H56695950K12610k40743P24613P26283j022160k224982k495408l479958l218293
838.3H45677912P43151M124939J832843l287017l085792L570795P212221M456163J924992
856.6H63170207J710295Q77142m03762p6294Q48830K17915q34942k93315N75364p8320
877H65713120q72374j25468N78225m02510j396478r39786p39098j958966k757132k448618
897.4H54650915l652037p772266j1918247j0478139p10666R933054J2174845Q285403
913.7H50512862M258633J654506R29355J347900P98702m88937m04239O64890M54486
932.1H59728158p71404q59499j51634n78642j654565j598954j188994k398550m298628
950.5H46227288m139483k875387m872799r097755p211924K836168J0492146R845197
$$ plain form
966.8 841203451 847280979 850057185 850462675 849940538 849342227 848126590 845666945 843365490 842773080
985.1 842773080 842683315 841208816 838262558 833929420 827160835 821147561 822543144 828201532 828830361
1003.5 828830361 823151946 814994395 807038307 801336288 800795317 806920409 816038430 822723567
1019.8 822723567 826118231 828349710 829336584 827257037 822055459 816304743 812290192 809100151
1036.1 809100151 805032670 802321553 805100501 813171625 822480977 830347478 836271822 839843452
1052.4 839843452 841352046 842318475 843474150 844026089 843729615 843615949 843993306 843820751 842624247
1070.8 842624247 841049016 838947475 835210502 830734730 829574168 833637476 839032233 842103124
1087.1 842103124 843510389 844329357 844279826 843738973 843661427 843821585 843328655 842454672 842034400 841738939
$$ packed form
966.8H41203451O077528K776206M05490n22137n98311j215637k459645k301455n92410
985.1H42773080q9765j474499k946258m333138o768585o013274J395583N658388O28829
1003.5H28830361n678415q157551p956088n702019n40971O125092R118021O685137
1019.8H22723567L394664K231479R86874k079547n201578n750716m014551l190041
1036.1H09100151m067481k711117K778948Q071124R309352P866501N924344L571630
1052.4H39843452J508594R66429J155675N51939k96474j13666L77357j72555j196504
1070.8H42624247j575231k101541l736973m475772j160562M063308N394757L070891
1087.1H42103124J407265Q18968m9531n40853p7546J60158m92930q73983m20272k95461
$$ plain form
1107.5 841738939 840770304 839658618 839546442 840107620 840220928 840075850 840365231 840575457 840066314
1125.9 840066314 839542627 839798987 840220094 840058804 839828014 840065777 840144873 839589953 839076936 839020193
1146.3 839020193 838659286 837530494 836271226 835004449 832137942 827643454 825912237 828523278
1162.6 828523278 830856562 830679417 829776049 828777194 826504648 822148621 816791177 814837098 820434451
1180.9 820434451 829556286 835077882 836262167 835437536 834024727 833010137 832414687 831593752 830618799
1199.3 830618799 830042243 829589248 828629971 827556551 827090144 826770663 825850904 824895680 824727416
1217.7 824727416 824688613 823628008 821666479 819768190 818647385 818328500 818270087 817965686 817022741
1236 817022741 815274715 813184261 811011016 808100820 803990781 799177825 794014990 787917733 780373037
$$ packed form
1107.5H41738939r68635j111686j12176N61178J13308j45078K89381K10226n09143
1125.9H40066314n23687K56360M21107j61290k30790K37763P9096n54920n13017n6743
1146.3H39020193l60907j128792j259268j266777k866507m494488j731217K611041
1162.6H28523278K333284j77145r03368r98855k272546m356027n357444j954079N597353
1180.9H20434451R121835N521596J184285q24631j412809j014590n95450q20935r74953
1199.3H30618799n76556m52995r59277j073420m66407l19481r19759r55224j68264
1217.7H24727416l8803j060605j961529j898289j120805l18885n8413l04401r42945
1236H17022741j748026k090454k173245k910196m110039m812956n162835o097257p544696
$$ plain form
1254.4 780373037 771422148 760717630 748407960 738633573 739334345 754707694 779106975 801804364
1270.7 801804364 816411197 823070049 824303031 822592139 820087492 817536592 814315081 810168803
1287 810168803 805561125 800434589 794172525 786919951 779808939 773685038 768450439 763940692 760538936
1305.4 760538936 757591605 752023101 740978420 724748969 705943346 688365042 676874340 674730301
1321.7 674730301 682002246 697857678 722333968 754865289 788741410 813626111 826192737
1336 826192737 830044210 828918278 825143397 820340872 815285623 809873819 803994417 798119962 792428732
1354.3 792428732 786201596 778687298 769098043 755937159 739366174 723290861 714205503 717503250
1370.6 717503250 731535435 749400973 764140904 773590326 778532624 780384064 781220794 781860590
$$ packed form
1254.4G80373037q950889j0704518j2309670r774387P00772J5373349K4399281K2697389
1270.7H01804364J4606833O658852J232982j710892k504647k550900l221511m146278
1287H10168803m607678n126536o262064p252574p111012o123901n234599m509747l401756
1305.4G60538936k947331n568504j1044681j6229451j8805623j7578304j1490702k144039
1321.7F74730301P271945J5855432K4476290L2531321L3876121K4884701J2566626
1336H26192737L851473j125932l774881m802525n055249n411804n879402n874455n691230
1354.3G92428732o227136p514298r589255j3160884j6570985j6075313r085358L297747
1370.6G17503250J4032185J7865538J4739931R449422M942298J851440Q36730O39796
$$ plain form
1386.9 781860590 781574190 780944228 781800747 784527600 786836982 787163019 785988390 783765316 780342937
1405.3 780342937 776203156 771898925 767191648 761864960 756048203 749263227 740581334 731176794
1421.6 731176794 721476614 711679757 702595770 693602085 685513854 680122733 677724123 678377807
1437.9 678377807 681663752 687995791 698424041 713348866 733028412 755654454 777614295 795084774
1454.3 795084774 806327999 810854733 810518861 807858586 803252757 797638059 792321920 786577046
1470.6 786577046 779286146 771387458 763430357 754524350 744096637 732049584 719086468 708119750
1486.9 708119750 707082450 717887342 726426661 721791208 702804685 684797108 686670423 706864178
1503.2 706864178 735806644 762280464 772605598 772980988 770550489 766886652 762299895 757093132
$$ packed form
1386.9G81860590k86400o29962Q56519K726853K309382L26037j174629k223074l422379
1405.3G80342937m139781m304231m707277n326688n816757o784976q681893r404540
1421.6G31176794r700180r796857r083987q993685q088231n391121k398610O53684
1437.9F78377807L285945O332039J0428250J4924825J9679546K2626042K1959841J7470479
1454.3G95084774J1243225M526734l35872k660275m605829n614698n316139n744874
1470.6G86577046p290900p898688p957101q906007j0427713j2047053j2963116j0966718
1486.9G08119750j037300J0804892Q539319m635453j8986523j8007577J873315K0193755
1503.2G06864178K8942466K6473820J0325134L75390k430499l663837m586757n206763
$$ plain form
1519.5 757093132 751058221 744987726 738934398 732109785 725534081 719042838 711652875 705209494
1535.8 705209494 700461149 696187377 693486035 692797482 692661941 691333115 687384486 681473732 676107585
1554.2 676107585 674150407 679848433 696670294 717534721 740935504 763285160 779351056 789307833
1570.5 789307833 794028997 795547485 795357704 793733358 789281011 779665530 765117824 748035133
1586.8 748035133 728729486 705473661 677897274 649068236 626810551 619043350 626509309 643807769
1603.2 643807769 664426327 682448208 693945527 699540019 702018440 701438725 697291553 694971263
1619.5 694971263 698098660 704737604 710298240 712742507 712547302 710673511 707731068 703137279
1635.8 703137279 697808206 692660928 687409163 682470679 678200006 675845742 675408721 673784077
$$ packed form
1519.5G57093132o034911o070495o053328o824613o575704o491243p389963o443381
1535.8G05209494m748345m273772k701342o88553j35541j328826l948629n910754n366147
1554.2F76107585j957178N698026J6821861K0864427K3400783K2349656J6065896R956777
1570.5G89307833M721164J518488j89781j624346m452347r615481j4547706j7082691
1586.8G48035133j9305647k3255825k7576387k8829038k2257685p767201P465959J7298460
1603.2F43807769K0618558J8021881J1497319N594492K478421n79715m147172k320290
1619.5F94971263L127397O638944N560636K444267j95205j873791k942443m593789
1635.8G03137279n329073n147278n251765m938484m270673k354264m37021j624644
$$ plain form
1652.1 673784077 667429566 658650756 648431659 636699378 625607371 618615806 617922723 625456154
1668.4 625456154 642336547 661679924 680718064 698630452 712383032 723452866 734700561
1682.7 734700561 747822762 758850038 767279863 775448024 782792807 790044367 797491014 804594278
1699 804594278 812092364 817994595 822497129 826782584 830256879 832972884 835348666 837721050 840325892
1717.4 840325892 842740357 844693840 846447706 848079562 849420667 850623548 851757109 852959812
1733.7 852959812 854063570 854689717 854947984 854965985 854994595 855403304 856396258 857857943 859504104
1752 859504104 860884726 861978173 862826109 863356292 863803327 864386499 865024030 865607023 866131604 866642654
1772.4 866642654 867090642 867361546 867638707 868036032 868321180 868299544 868142664 867983222 867580116 866844833
$$ packed form
1652.1F73784077o354511q778810j0219097j1732281j1092007o991565o93083P533431
1668.4F25456154J6880393J9343377J9038140J7912388J3752580J1069834J1247695
1682.7G34700561J3122201J1027276Q429825Q168161P344783P251560P446647P103264
1699H04594278P498086N902231M502534M285455L474295K716005K375782K372384K604842
1717.4H40325892K414465J953483J753866J631856J341105J202881J133561J202703
1733.7H52959812J103758O26147K58267J8001K8610M08709R92954J461685J646161
1752H59504104J380622J093447Q47936N30183M47035N83172O37531N82993N24581N11050
1772.4H66642654M47988K70904K77161L97325K85148k1636j56880j59442m03106p35283
$$ plain form
1792.8 866844833 866203487 866030157 866206646 866408169 866488576 866584182 866872668 867503405 868652284 870198786
1813.2 870198786 871572316 872300029 872505963 872525930 872494698 872547626 872829020 873175681 873230577 872939765
1833.6 872939765 872614920 872440636 872209370 871817052 871492684 871304989 870870411 870170116 869663119 869560361
1854 869560361 869665623 869844675 870153427 870384276 870150864 869373739 868216336 866889715 865788519
1872.4 865788519 865415514 865988553 867022216 867833197 868275404 868499696 868564606 868668556 869252384 870256543
1892.8 870256543 871056974 871320009 871339917 871440530 871484458 871341467 871247649 871344745 871355116 871096849
1913.2 871096849 870800376 870605767 870313287 869824886 869407892 869232178 869062781 868741453 868403196 868052244
1933.6 868052244 867511153 866846681 866238236 865459919 863974452 861451447 858157992 855485082 855287313
$$ packed form
1792.8H66844833o41346j73330J76489K01523Q0407R5606K88486O30737J148879J546502
1813.2H70198786J373530P27713K05934J9967l1232N2928K81394L46661N4896k90812
1833.6H72939765l24845j74284k31266l92318l24368j87695m34578p00295n06997j02758
1854H69560361J05262J79052L08752K30849k33412p77125j157403j326621j101196
1872.4H65788519l73005N73039J033663Q10981M42207K24292O4910J03950N83828J004159
1892.8H70256543Q00431K63035J9908J00613M3928j42991r3818R7096J0371k58267
1913.2H71096849k96473j94609k92480m88401m16994j75714j69397l21328l38257l50952
1933.6H68052244n41091o64472o08445p78317j485467k523005l293455k672910j97769
$$ plain form
1951.9 855287313 857670128 860805690 863013208 863742709 863328695 862600863 862335324 862821102 863765657
1970.3 863765657 864731729 865369618 865475237 865306973 865262330 865311265 865263820 865274549 865513682 865701497
1990.7 865701497 865579665 865408182 865434468 865431547 865194142 864959836 864932835 864851654 864505529 864161015
2011.1 864161015 864024878 863849461 863489628 863215923 863111556 862792969 862240136 862095296 862377524 862427711
2031.5 862427711 862205029 862190902 862450659 862600207 862533152 862510204 862561405 862435460 862169862 862061381
2051.9 862061381 862076700 861912310 861581981 861366987 861216366 860866547 860472500 860389411 860521853 860590577
2072.3 860590577 860639870 860824585 860986829 860898972 860752106 860819578 860918522 860780001 860587418 860571265
2092.7 860571265 860541523 860300899 860058188 860038698 860057890 859922647 859841645 859962761 860038579 859955311 859951913
$$ packed form
1951.9H55287313K382815L135562K207518P29501m14014p27832k65539M85778R44555
1970.3H63765657R66072O37889J05619j68264m4643M8935m7445J0729K39133J87815
1990.7H65701497j21832j71483K6286k921k37405k34306k7001q1181l46125l44514
2011.1H64161015j36137j75417l59833k73705j04367l18587n52833j44840K82228N0187
2031.5H62427711k22682j4127K59757J49548o7055k2948N1201j25945k65598j08481
2051.9H62061381J5319j64390l30329k14994j50621l49819l94047q3089J32442O8724
2072.3H60590577M9293J84715J62244q7857j46866O7472R8944j38521j92583j6153
2092.7H60571265k9742k40624k42711j9490J9192j35243q1002J21116P5818q3268l398
$$ plain form
2115.1 859951913 860098839 860126734 859942198 859793007 859761178 859615266 859313250 859109223 859028578 858829856
2135.5 858829856 858518600 858353794 858348489 858269691 858112335 858057976 858052075 857883632 857579410 857376933 857339323
2157.9 857339323 857336879 857397199 857628882 857872784 857893765 857827723 857906640 857999504 857897341 857658267 857442439
2180.4 857442439 857239962 856964171 856693864 856572211 856559277 856532216 856536508 856652439 856745362 856644690
2200.8 856644690 856441379 856305182 856177270 855951250 855759859 855731487 855723023 855619848 855580866 855734527
2221.2 855734527 855908573 855933011 855927885 855988801 855965018 855768204 855557323 855447412 855306685 855067313
2241.6 855067313 854905128 854874790 854774773 854516447 854255617 854042411 853718162 853283584 852981865 852927983
2262 852927983 852941334 852874935 852807641 852740169 852536082 852262437 852146626 852207005 852303982 852416158 852611423
$$ packed form
2115.1H59951913J46926K7895j84536j49191l1829j45912l02016k04027q0645j98722
2135.5H58829856l11256j64806n305p8798j57356n4359n901j68443l04222k02477l7610
2157.9H57339323k444O0320K31683K43902K0981o6042P8917R2864j02163k39074k15828
2180.4H57442439k02477k75791k70307j21653j2934k7061M292J15931R2923j00672
2200.8H56644690k03311j36197j27912k26020j91391k8372q464j03175l8982J53661
2221.2H55734527J74046K4438n126O0916k3783j96814k10881j09911j40727k39372
2241.6H55067313j62185l0338j00017k58326k60830k13206l24249m34578l01719n3882
2262H52927983J3351o6399o7294o7472k04087k73645j15811O0379R6977J12176J95265
$$ plain form
2284.4 852611423 852836490 852936208 852954268 853064954 853227317 853265762 853174448 853096306 853053510 852936387 852760077
2306.8 852760077 852635980 852515757 852224588 851741374 851232588 850870252 850757480 850867927 851088643 851287186
2327.2 851287186 851285815 850976527 850427330 849756479 849118590 848883033 849348605 850187361 850687087 850758255
2347.6 850758255 850888014 851225495 851486683 851547539 851614296 851665080 851511180 851199687 850943089 850679278
2368 850679278 850289881 849885523 849532306 849122643 848609626 848150253 847843528 847580492 847340405 847277820
2388.4 847277820 847367823 847357154 847165167 846960068 846801102 846573651 846321940 846283495 846483111 846674144
2408.8 846674144 846779287 846929073 847082078 847046137 846845746 846696615 846637070 846502066 846273661 846113741
2429.2 846113741 846002162 845795989 845577538 845504045 845492303 845380783 845218420 845137000 845061421 844826937
$$ packed form
2284.4H52611423K25067R9718J8060J10686J62363L8445r1314p8142m2796j17123j76310
2306.8H52760077j24097j20223k91169m83214n08786l62336j12772J10447K20716J98543
2327.2H51287186j371l09288n49197o70851o37889k35557M65572Q38756M99726P1168
2347.6H50758255J29759L37481K61188O0856O6757N0784j53900l11493k56598k63811
2368H50679278l89397m04358l53217m09663n13017m59373l06725k63036k40087o2585
2388.4H47277820R0003j0669j91987k05099j58966k27451k51711l8445J99616J91033
2408.8H46674144J05143J49786J53005l5941k00391j49131n9545j35004k28405j59920
2429.2H46113741j11579k06173k18451p3493j1742j11520j62363q1420p5579k34484
$$ plain form
2449.6 844826937 844505191 844248295 843987048 843664110 843518615 843720138 843999922 844082594 844055772 844060898
2470 844060898 844016016 843801558 843541503 843396246 843255222 842992485 842760324 842686832 842581153 842288792
2490.4 842288792 841977298 841783762 841611207 841446996 841447413 841578424 841590405 841470957 841460347 841556549 841507554
2512.8 841507554 841282010 841058552 840821862 840412080 839912355 839633524 839667141 839802206 839940071 840167761
2533.2 840167761 840387464 840360641 840106249 839797914 839427710 838944793 838531911 838404536 838476419 838519156
2553.6 838519156 838516831 838593721 838713527 838735759 838700891 838739991 838784397 838727057 838690281 838809490 838938892
2576 838938892 838888049 838763833 838736713 838710368 838510811 838220716 838012934 837841511 837639630 837521613
2596.4 837521613 837525487 837457001 837193727 836883783 836632192 836290479 835769594 835208237 834647238 833960056
$$ packed form
2449.6H44826937l21746k56896k61247l22938j45495K01523K79784Q2672k6822N126
2470H44060898m4882k14458k60055j45257j41024k62737k32161p3492j05679k92361
2490.4H42288792l11494j93536j72555j64211M17J31011J1981j19448j0610R6202m8995
2512.8H41507554k25544k23458k36690m09782m99725k78831L3617J35065J37865K27690
2533.2H40167761K19703k6823k54392l08335l70204m82917m12882j27375P1883M2737
2553.6H38519156k325P6890J19806K2232l4868L9100M4406n7340l6776J19209J29402
2576H38938892n0843j24216k7120k6345j99557k90095k07782j71423k01881j18017
2596.4H37521613L874o8486k63274l09944k51591l41713n20885n61357n60999o87182
$$ plain form
2616.8 833960056 833262026 832976460 833271503 833828390 834376097 834960163 835558236 835956693 836140692 836302519
2637.2 836302519 836426139 836335897 836087346 835913897 835796773 835541666 835225046 835023642 834832549 834489703
2657.6 834489703 834098041 833823979 833579242 833212495 832849562 832679749 832587838 832395792 832226217 832223415
2678 832223415 832220018 832025886 831744373 831504881 831179142 830669105 830148995 829749584 829342067 828877747
2698.4 828877747 828586698 828634739 828888953 829210341 829628885 830076277 830334306 830365777 830368519 830441177
2718.8 830441177 830482483 830462396 830481827 830504537 830368757 830108523 829905629 829772294 829543233 829164505
2739.2 829164505 828785181 828466117 828102410 827670336 827225924 826758265 826255202 825800955 825466216 825187266
2759.6 825187266 824871719 824533224 824246287 824001789 823702812 823365927 823090494 822778881 822253227 821566582
$$ packed form
2616.8H33960056o98030k85566K95043N56887N47707N84066N98073L98457J83999J61827
2637.2H36302519J23620r0242k48551j73449j17124k55107l16620k01404j91093l42846
2657.6H34489703l91662k74062k44737l66747l62933j69813r1911j92046j69575k802
2678H32223415l397j94132k81513k39492l25739n10037n20110l99411m07517m64320
2698.4H28877747k91049M8041K54214L21388M18544M47392K58029L1471K742P2658
2718.8H30441177M1306k0087J9431K2710j35780k60234k02894j33335k29061l78728
2739.2H29164505l79324l19064l63707m32074m44412m67659n03063m54247l34739k78950
2759.6H25187266l15547l38495k86937k44498k98977l36885k75433l11613n25654o86645
$$ plain form
2780 821566582 820854247 820077837 819142103 818062305 816873848 815527260 814044952 812671781 811602116
2798.4 811602116 810847819 810565174 810953021 811915457 813148499 814381242 815561831 816718757 817713261
2816.7 817713261 818432987 818967402 819383681 819569528 819424510 819043577 818557799 817942023 817165136 816323042
2837.1 816323042 815381706 814160824 812704146 811233342 809835613 808473825 807242036 806353033 805909038
2855.5 805909038 805921972 806395113 807271898 808360577 809351146 810066760 810608089 811071634 811329424 811347246
2875.9 811347246 811351359 811461091 811608613 811751783 811839998 811752677 811404049 810849190 810205162 809457779
2896.3 809457779 808542967 807552576 806609750 805714428 804843545 804057658 803382456 802614450 801514387
2914.6 801514387 800160050 798794687 797508001 796332896 795453370 795167148 795613408 796629310 797998190
$$ packed form
2780H21566582p12335p76410r35734j079798j188457j346588j482308j373171j069665
2798.4H11602116p54297k82645L87847R62436J233042J232743J180589J156926R94504
2816.7H17713261P19726N34415M16279J85847j45018l80933m85778o15776p76887q42094
2837.1H16323042r41336j220882j456678j470804j397729j361788j231789q89003m43995
2855.5H05909038J2934M73141Q76785J088679R90569P15614N41329M63545K57790J7822
2875.9H11347246M113J09732J47522J43170Q8215q7321l48628n54859o44028p47383
2896.3H09457779r14812r90391r42826q95322q70883p85887o75202p68006j100063
2914.6H01514387j354337j365363j286686j175105q79526k86222M46260J015902J368880
$$ plain form
2933 797998190 799503624 800824225 801770627 802449048 802962959 803178906 802991033 802568734 802111268 801498771
2953.4 801498771 800599337 799623251 798750818 797861576 796815932 795749605 794868290 794178963 793741703
2971.7 793741703 793727040 794108689 794675469 795218289 795615554 795832455 795890749 795878172 795875490 795749843
2992.1 795749843 795282185 794540226 793711066 792820156 791858554 790862262 789841056 788660109 787043631
3010.5 787043631 784805357 782054126 779164612 776689410 775303960 775480270 776975334 779021144
3026.8 779021144 780937374 782162666 782208502 780895770 778607488 776151896 774158657 772866547 772158563
3045.1 772158563 771527767 770355046 768217921 765100777 761572778 758766294 757817924 758820653 760809481
3063.5 760809481 762808681 764200091 764720023 764550507 764050841 763563693 763374686 763518393 763893723
$$ packed form
2933G97998190J505434J320601R46402O78421N13911K15947j87873m22299m57466o12497
2953.4H01498771q99434r76086q72433q89242j045644j066327q81315o89327m37260
2971.7G93741703j4663L81649N66780N42820L97265K16901N8294j2577k682j25647
2992.1G95749843m67658p41959q29160q90910r61602r96292j021206j180947j616478
3010.5G87043631k238274k751231k889514k475202j385450J76310J495064K045810
3026.8G79021144J916230J225292M5836j312732k288282k455592j993239j292110p07984
3045.1G72158563o30796j172721k137125l117144l527999k806484r48370J002729J988828
3063.5G60809481J999200J391410N19932j69516m99666m87148j89007J43707L75330
$$ plain form
3081.9 763893723 764476657 765243232 766170502 767182648 768148065 769003391 769708157 770283878 770872056
3100.2 770872056 771524012 772035360 772084594 771452606 770191550 768723726 767528653 766668260 765803039
3118.6 765803039 764456391 762284517 759259105 755576551 751577973 747728229 744631648 742994905
3134.9 742994905 743242979 745109439 747837722 750827074 753741324 756274283 758312345 759855449
3151.2 759855449 760712743 760826290 760516942 760068476 759487808 758670747 757583439 756280601 754751682
3169.6 754751682 752920806 750840366 748581827 746065378 743233263 740146875 736882806 733486533
3185.9 733486533 730096877 727054417 724781156 723580062 723569036 724690139 726624429 728773713 730512977
3204.2 730512977 731545389 731923819 731787443 731300473 730751336 730370104 729997456 729275882 728080153
$$ packed form
3081.9G63893723N82934P66575R27270J012146R65417Q55326P04766N75721N88178
3100.2G70872056O51956N11348M9234o31988j261056j467824j195073q60393q65221
3118.6G65803039j346648k171874l025412l682554l998578l849744l096581j636743
3134.9G42994905K48074J866460K728283K989352K914250K532959K038062J543104
3151.2G59855449Q57294J13547l09348m48466n80668q17061j087308j302838j528919
3169.6G54751682j830876k080440k258539k516449k832115l086388l264069l396273
3185.9G33486533l389656l042460k273261j201094j1026J121103J934290K149284J739264
3204.2G30512977J032412L78430j36376m86970n49137l81232l72648p21574j195729
$$ plain form
3222.6 728080153 726438880 724370301 722007930 719556689 716973841 713999927 710665166 707215548
3238.9 707215548 703643382 699859977 696002007 692241371 688580453 685082674 681965888 679369032
3255.2 679369032 677367747 676176727 676030815 676896811 678357840 679746807 680449426 680095375 678682208
3273.6 678682208 676464140 673706293 670623124 667353034 664007068 660730541 657690525 655054927
3289.9 655054927 652942896 651412964 650494635 650225103 650754988 652266622 654669404 657561660 660625160
3308.2 660625160 663826942 667161405 670524240 673789561 676896036 679816246 682475865 684863150
3324.6 684863150 687087655 689278305 691459715 693560064 695531845 697334409 698860645 700082719
3340.9 700082719 701108158 701959968 702664375 703295946 703719914 703816295 703731894 703610182 703430772 703090906
$$ packed form
3222.6G28080153j641273k068579k362371k451241k582848k973914l334761l449618
3238.9G07215548l572166l783405l857970l760636l660918l497779l116786k596856
3255.2F79369032k001285j191020j45912Q65996J461029J388967P02619l54051j413167
3273.6F78682208k218068k757847l083169l270090l345966l276527l040016k635598
3289.9F55054927k112031j529932r18329k69532N29885J511634K402782K892256L063500
3308.2F60625160L201782L334463L362835L265321L106475K920210K659619K387285
3324.6F84863150K224505K190650K181410K100349J971781J802564J526236J222074
3340.9G00082719J025439Q51810P04407O31571M23968R6381q4401j21712j79410l39866
$$ plain form
3361.3 703090906 702595949 702127635 701693773 700978339 699822187 698551714 697447658 696369708 695199013
3379.6 695199013 694025457 692914724 691860437 690950036 690252423 689494371 688441396 687384486 686693370
3398 686693370 686190248 685350597 684194326 683245301 682601452 682012916 681389034 680723846 680067182 679528594
3418.4 679528594 679097593 678737938 678484201 678370297 678388834 678434253 678525865 678706348 678768933 678636611
3438.8 678636611 678537607 678668380 679055393 679580688 680071235 680526137 681071460 681759357 682562232 683398902
3459.2 683398902 684151292 684929669 685980260 687143564 687965095 688420355 688948929 689763367 690804958
3477.5 690804958 691862524 692687571 693453729 694402933 695366800 696222723 697125494 698165417 699265361
3495.9 699265361 700311661 701355815 702448547 703385592 704174459 705121696 706319630 707665801 708951950
$$ packed form
3361.3G03090906m94957m68314m33862p15434j156152j270473j104056j077950j170695
3379.6F95199013j173556j110733j054287r10401o97613p58052j052975j056910o91116
3398F86693370n03122q39651j156271r49025o43849n88536o23882o65188o56664n38588
3418.4F79528594m31001l59655k53737j13904J8537M5419R1612J80483O2585j32322
3438.8F78636611r9004J30773L87013N25295M90547M54902N45323O87897Q02875Q36670
3459.2F83398902P52390P78377J050591J163304Q21531M55260N28574Q14438J041591
3477.5F90804958J057566Q25047P66158R49204R63867Q55923R02771J039923J099944
3495.9F99265361J046300J044154J092732R37045P88867R47237J197934J346171J286149
$$ plain form
3514.2 708951950 710049808 711132884 712382913 713762462 715025842 716110826 717256427 718546689
3530.6 718546689 719932795 721414149 722852230 724161565 725567698 727157712 728657186 729865134
3546.9 729865134 731016934 732321262 733663499 734980643 736363351 737876356 739400744 740707517
3563.2 740707517 741883397 743366420 745134294 746763766 748280227 749902129 751670778 753578246
3579.5 753578246 755578816 757489145 759120345 760636747 762387991 764236927 766046286 767955422
3595.8 767955422 769936919 771808386 773557663 775231004 776772022 778268158 779830396 781435132
3612.1 781435132 783083558 784617424 786042333 787609518 789104223 790267527 791140676 792018294 793195307
3630.5 793195307 794348001 795328557 796231747 797066212 797851682 798599958 799215138 799661994 800221503
$$ packed form
3514.2G08951950J097858J083076J250029J379549J263380J084984J145601J290262
3530.6G18546689J386106J481354J438081J309335J406133J590014J499474J207948
3546.9G29865134J151800J304328J342237J317144J382708J513005J524388J306773
3563.2G40707517J175880J483023J767874J629472J516461J621902J768649J907468
3579.5G53578246K000570J910329J631200J516402J751244J848936J809359J909136
3595.8G67955422J981497J871467J749277J673341J541018J496136J562238J604736
3612.1G81435132J648426J533866J424909J567185J494705J163304Q73149Q77618J177013
3630.5G93195307J152694R80556R03190Q34465P85470P48276O15180M46856N59509
$$ plain form
3648.8 800221503 800933957 801409304 801762283 802367747 803105414 803603828 803864121 804035664 804068089 803994000
3669.2 803994000 804039180 804034770 803952038 804150164 804486513 804791510 805143535 805566013 806046605 806490004
3689.6 806490004 806875408 807289481 807642758 807847202 807950139 808096111 808334529 808498800 808499038 808373034
3710 808373034 808287024 808382928 808512747 808530748 808459103 808368862 808268189 808205903 808187008 808110893 808009446
3732.5 808009446 808030725 808291137 808614612 808606327 808211327 807936966 808048546 808067262 807962477 808052778
3752.9 808052778 808226228 808250785 808187008 808210254 808245838 808192670 808099627 808029950 808030069 808062792 808074594 808076501
3777.3 808076501 808049858 807947576 807806492 807721198 807706177 807686567 807607174 807460666 807299972 807153225
3797.7 807153225 806939602 806777537 806773365 806726754 806702197 806770086 806737185 806522369 806303799 806203723 806082547
$$ packed form
3648.8H00221503P12454M75347L52979O05464P37667M98414K60293J71543L2425p4089
3669.2H03994000M5180m410q2732J98126L36349L04997L52025M22478M80592M43399
3689.6H06490004L85404M14073L53277K04444J02937J45972K38418J64271K38j26004
3710H08373034q6010R5904J29819J8001p1645r0241j00673o2286j8895p6115j01447
3732.5H08009446K1279K60412L23475q285l95000k74361J11580J8716j04785R0301
3752.9H08052778J73450K4557o3777K3246L5584n3168r3043o9677J19L2723J1802J907
3777.3H08076501k6643j02282j41084q5294j5021j9610p9393j46508j60694j46747
3797.7H07153225k13623j62065m172m6611k4557O7889l2901k14816k18570j00076j21176
$$ plain form
3820.2 806082547 806006789 806018591 806001842 805939376 805834591 805767059 805801630 805766284 805571139 805446625 805468917
3842.6 805468917 805531502 805491865 805244088 804735363 804149687 804127455 804437935 804516554 804401696 804269373
3863 804269373 804215252 804146647 803997397 803935230 803951442 803948700 803890407 803757250 803708553 803730845 803693712 803571999
3887.5 803571999 803309798 803035975 802952051 802933812 802789390 802560866 802397132 802397370 802553117 802701354
3907.9 802701354 802725613 802680671 802630842 802545249 802417994 802310228 802233875 802148819 802057922 801988363 801931798
3930.3 801931798 801882327 801827610 801732242 801591218 801435411 801314712 801268399 801269233 801263034 801232457 801173389
3952.7 801173389 801079869 800969243 800850034 800747693 800708771 800717533 800713360 800677240 800665617 800712228 800767481
3975.2 800767481 800748646 800646842 800595582 800618052 800548315 800376236 800223291 800122797 800068915 800034285 799960673
$$ packed form
3820.2H06082547p5758J1802j6749o2466j04785o7532L4571l5346j95145j24514K2292
3842.6H05468917O2585l9637k47777n08725n85676k2232L10480P8619j14858j32323
3863H04269373n4121o8605j49250o2167J6212k742n8293j33157m8697K2292l7133j21713
3887.5H03571999k62201k73823q3924j8239j44422k28524j63734K38J55747J48237
3907.9H02701354K4259m4942m9829q5593j27255j07766p6353q5056r0897o9559n6565
3930.3H01931798m9471n4717r5368j41024j55807j20699m6313Q34o199l0577n9068
3952.7H01173389r3520j10626j19209j02341l8922Q762m173l6120j1623M6611N5253
3975.2H00767481j8835j01804n1260K2470o9737j72079j52945j00494n3882l4630p3612
$$ plain form
3997.6 799960673
$$ packed form
3997.6G99960673
##END=$$ End of the data block
