##TITLE=B8M - Douglas - Chalcona $$ Begin of the data block
##JCAMP-DX=5.00 $$ ACD/SpecManager v 10.08
##SPECTROMETER/DATA SYSTEM=Alpha
##DATE=13 Apr 2015 08:10:36
##DATA TYPE=INFRARED SPECTRUM
##DATA CLASS=XYDATA
##ORIGIN=
##OWNER=
##NPOINTS=1765
##FIRSTX=399.76428223
##LASTX=3997.64306641
##MAXX=3997.64306641
##MINX=399.76428223
##MAXY=0.77868021
##MINY=0.39019293
##XFACTOR=1.0000000000
##YFACTOR=1.000000000000000e-9
##FIRSTY=0.75733036
##DELTAX=2.03961372
##XUNITS=1/CM
##YUNITS=ARBITRARY UNITS
##XYDATA=(X++(Y..Y))
$$ plain form
399.8 757330358 758388817 759427130 759059191 759070456 758842111 756380260 753574431 752903879 752575874
418.1 752575874 749946117 747192144 744931340 740578294 734336197 730003834 729986727 733244777 738349378
436.5 738349378 744026124 747660697 747712195 746720672 747027874 746703446 744552970 742858887 742625296
454.8 742625296 741151810 737593353 734870911 732388914 727608442 722429514 721132755 723779261
471.2 723779261 727095604 730073631 732881486 733242571 730739772 728706181 727655530 724720538 720398009
489.5 720398009 717446923 714629650 709084928 702261508 696125925 687866807 674717069 657500148
505.8 657500148 635099173 605816305 576344490 562521636 571809053 589395344 596304893 596013486
522.1 596013486 601293802 610382438 613930762 611182928 606851220 611712515 640229166 688904822
$$ packed form
399.8G57330358J058459J038313l67939J1265k28345k461851k805829o70552l28005
418.1G52575874k629757k753973k260804m353046o242097m332363j7107L258050N104601
436.5G38349378N676746L634573N1498r91523L07202l24428k150476j694083k33591
454.8G42625296j473486l558457k722442k481997m780472n178928j296759K646506
471.2G23779261L316343K978027K807855L61085k502799k033591j050651k934992m322529
489.5G20398009k951086k817273n544722o823420o135583q259118j3149738j7216921
505.8F57500148k2400975k9282868k9471815j3822854R287417J7586291O909549k91407
522.1E96013486N280316R088636L548324k747834m331708M861295K8516651M8675656
$$ plain form
538.5 688904822 734245718 760928810 772904396 777301192 776090920 771859646 768256605 765535295
554.8 765535295 762698114 761081159 761282146 760846496 758518517 756455421 755595267 754138172 751814485
573.1 751814485 750377834 749653280 748008013 746030569 745319009 744990408 743456244 741680026 740974307
591.5 740974307 740305126 738603830 737060308 736423075 735519350 733797014 732252181 731163263 729519069
609.8 729519069 726806402 723192394 719535649 718077004 719954073 722407401 722501636 720290959 717180133
628.2 717180133 713653624 708176792 701627851 700513303 706090212 710268378 709041595 705276906
644.5 705276906 701068521 695535779 687332869 675644696 657732308 630557179 612987757 638196588
660.8 638196588 686992884 710948467 704777062 686921000 673228741 660494208 644888997 627433777
$$ packed form
538.5F88904822M5340896K6683092J1975586M396796j210272m231274l603041k721310
554.8G65535295k837181j616955K00987m35650k327979k063096q60154j457095k323687
573.1G51814485j436651p24554j645267j977444p11560l28601j534164j776218p05719
591.5G40974307o69181j701296j543522o37233r03725j722336j544833j088918j644194
609.8G29519069k712667l614008l656745j458645J877069K453328R4235k210677l110826
628.2G17180133l526509n476832o548941j114548N576909M178166j226783l764689
644.5G05276906m208385n532742q202910j1688173j7912388k7175129j7569422K5208831
660.8F38196588M8796296K3955583o171405j7856062j3692259j2734533j5605211j7455220
$$ plain form
677.2 627433777 606975257 581737936 551814735 519198656 492060512 486312866 509530067 553852022
693.5 553852022 607278407 657507718 694734991 717795312 729852676 733885229 733223200 728904545
709.8 728904545 719022036 701033592 671177924 625629723 577972412 565586388 607235909 675137758
726.1 675137758 726530492 747237921 750778794 748516440 743869603 739414573 735825241 731347382
742.4 731347382 725423455 719546974 714390635 709713519 705842495 702474892 697710335 690298200
758.7 690298200 681349397 671836615 660116076 643915474 622041941 592131734 550745249 499719411
775.1 499719411 452717125 435593814 471316725 551544011 636288166 693239093 719824910
789.3 719824910 728477716 729486048 726419687 719707668 710836351 701164007 689990222 676084518
$$ packed form
677.2F27433777k0458520k5237321k9923201l2616079k7138144n747646K3217201M4321955
693.5E53852022N3426385N0229311L7227273K3060321J2057364M032553o62029m318655
709.8G28904545r882509j7988444k9855668m5548201m7657311j2386024M1649521O7901849
726.1F75137758N1392734K0707429L540873k262354m646837m455030l589332m477859
742.4G31347382n923927n876481n156339m677116l871024l367603m764557p412135
758.7F90298200q948803r512782j1720539j6200602k1873533k9910207m1386485n1025838
775.1D99719411m7002286j7123311L5722911Q0227286Q4744155N6950927K6585817
789.3G19824910Q652806J008332l066361o712019q871317r672344j1173785j3905704
$$ plain form
805.6 676084518 657920420 632291734 598736405 569402575 559512377 557283342 531813979 480737865
822 480737865 439746946 442819059 492232293 563479125 628561497 674171388 701380014 714999437
838.3 714999437 718055665 715099037 715298831 724440217 737616479 746838629 749814332 748115003
854.6 748115003 743532598 739572644 739775002 742595494 744691432 745314658 744990468 744612098 744348824
873 744348824 743385136 741738975 740341544 739092588 736991227 734153390 731690347 729871333 728159606
891.3 728159606 726658404 725769818 725189447 724566877 724322557 724514008 724109888 722588003 720839441
909.7 720839441 719491720 717860699 715568364 713299453 711270213 708710551 705416501 701860845
926 701860845 697061539 689105272 680676937 678785443 684047997 689501941 691207886 690502763 688832641
$$ packed form
805.6F76084518j8164098k5628686l3555329k9333830r890198k229035k5469363n1076114
822D80737865m0990919L072113M9413234P1246832O5082372M5609891K7208626J3619423
838.3G14999437L056228k956628J99794R141386J3176262R222150K975703j699329
854.6G48115003m582405l959954K02358K820492K095938O23226l24190l78370k63274
873G44348824r63688j646161j397431j248956k101361k837837k463043j819014j711727
891.3G28159606j501202q88586n80371o22570k44320J91451m04120j521885j748562
909.7G20839441j347721j631021k292335k268911k029240k559662l294050l555656
926G01860845m799306p956267q428335j891494N262554N453944J705945p05123j670122
$$ plain form
944.3 688832641 686196268 682713985 678991497 675149143 670549333 665223479 660560369 656639040
960.7 656639040 651723266 645227790 637382388 627501786 615083575 600141227 581258357 555287242
977 555287242 520119727 478593081 444383562 442214131 483973682 545868397 592433929 612553835
993.3 612553835 614709795 606594324 592291951 577042520 565550685 556378663 541708410 515621424
1009.6 515621424 482808650 455701232 441461295 439378202 454943329 498795867 559537947
1023.9 559537947 602445364 609713852 601767659 611210644 645427465 684984148 713246286 729340613
1040.2 729340613 738485932 744089544 746798933 746742904 745269775 743650079 741556883 738514364 735271573
1058.6 735271573 732361019 728929579 724225461 718583703 712638080 707490444 704881608 704837859 704690695
$$ packed form
944.3F88832641k636373l482283l722488l842354m599810n325854m663110l921329
960.7F56639040m915774o495476p845402r880602j2418211j4942348j8882870k5971115
977E55287242l5167515m1526646l4209519k169431M1759551O1894715M6565532K0119906
993.3F12553835K155960q115471j4302373j5249431j1491835r172022j4670253k6086986
1009.6E15621424l2812774k7107418j4239937k083093J5565127M3852538O0742080
1023.9E59537947M2907417P268488p946193R442985L4216821L9556683K8262138J6094327
1040.2G29340613R145319N603612K709389n6029j473129j619696k093196l042519l242791
1058.6G35271573k910554l431440m704118n641758n945623n147636k608836m3749j47164
$$ plain form
1076.9 704690695 702295959 698612928 696288228 696113527 696294129 695520937 694129467 692095280 688958406
1095.3 688958406 685133517 681205273 676704764 669778407 657869279 640571654 623628438 618885219
1111.6 618885219 633797288 658633351 676105142 681655407 681323946 679399669 676672935 673735321
1127.9 673735321 671301842 668939531 665810406 662159562 658664346 655061305 650729239 645646930
1144.2 645646930 639843643 632915676 625426352 618683159 612581491 605224192 595043242 582299113
1160.5 582299113 566035509 544127822 519140959 498125494 492622644 515101075 553919852
1174.8 553919852 573692322 563901126 556919217 580809772 620699227 646821976 652158856 645643234
1191.1 645643234 634466290 620927632 605599344 589217842 571947217 552754104 531266093
$$ packed form
1076.9G04690695k394736l683031k324700j74701J80602p73192j391470k034187l136874
1095.3F88958406l824889l928244m500509o926357j1909128j7297625j6943216m743219
1111.6F18885219J4912069K4836063J7471791N550265l31461j924277k726734k937614
1127.9F73735321k433479k362311l129125l650844l495216l603041m332066n082309
1144.2F45646930n803287o927967p489324o743193o101668p357299j0180950j2744129
1160.5E82299113j6263604k1907687k4986863k1015465n502850K2478431L8818777
1174.8E53919852J9772470r791196o981909K3890555L9889455K6122749N336880o515622
1191.1F45643234j1176944j3538658j5328288j6381502j7270625j9193113k1488011
$$ plain form
1205.4 531266093 509931564 492492437 482031435 481217802 491286695 511450469 539990425 572877765
1221.7 572877765 603764951 628933489 649126351 665213346 675695717 679114878 676534176 670321822
1238.1 670321822 661553025 650498927 638538718 627231538 615409017 599859893 579267323
1252.3 579267323 554920852 528338790 500524700 474973887 460752398 467702359 498201281
1266.6 498201281 544999242 594902098 635061622 658781052 666785777 663881838 655322134 646211803
1282.9 646211803 640396178 635334849 623247623 603787243 585594714 572278738 559737623 545125067
1299.2 545125067 532925487 528861403 534375429 555092156 589690506 616708577 618366063 599836528
1315.6 599836528 582148850 585258961 606747627 624918044 626811147 616802037 603346884 589671075
$$ packed form
1205.4E31266093k1334529j7439127j0461002q13633J0068893K0163774K8539956L2887340
1221.7E72877765L0887186K5168538K0192862J6086995J0482371L419161k580702o212354
1238.1F70321822q768797j1054098j1960209j1307180j1822521j5549124k0592570
1252.3E79267323k4346471k6582062k7814090k5550813j4221489O949961L0498922
1266.6D98201281M6797961M9902856M0159524K3719430Q004725k903939q559704r110331
1282.9F46211803n815625n061329j2087226j9460380j8192529j3315976j2541115j4612556
1299.2E45125067j2199580m064084N514026K0716727L4598350K7018071J657486j8529535
1315.6E99836528j7687678L110111K1488666J8170417J893103j0009110j3455153j3675809
$$ plain form
1331.9 589671075 576208413 564888656 559074938 562183261 577506363 605847895 641103148 673236609
1348.2 673236609 698274493 718399227 735844791 750377178 760591805 766193449 768354237 768641293
1364.5 768641293 767605007 765017450 761728823 758893847 756135046 752904236 749143183 744744956
1380.8 744744956 739860833 735359251 731580853 727967620 724264324 720475972 717009306 714100003
1397.1 714100003 710815251 706829607 702470303 697072864 690312266 682082176 672272563 660654843
1413.5 660654843 646041870 630986154 629778266 647776484 668264210 679314315 679700553 672030449
1429.8 672030449 658040583 643334091 636951268 640516758 638303697 620640755 592320263 582343817
1446.1 582343817 617626309 664456666 680413246 671836615 649170280 622083962 612365305 616188288
$$ packed form
1331.9E89671075j3462662j1319757n813718L108323J5323102K8341532L5255253L2133461
1348.2F73236609K5037884K0124734J7445564J4532387J0214627N601644K160788K87056
1364.5G68641293j036286k587557l288627k834976k758801l230810l761053m398227
1380.8G44744956m884123m501582l778398l613233l703296l788352l466666k909303
1397.1G14100003l284752l985644m359304n397439o760598q230090r809613j1617720
1413.5F60654843j4612973j5055716j207888J7998218K0487726J1050105L86238p670104
1429.8F72030449j3989866j4706492o382823L565490k213061j7662942k8320492r976446
1446.1E82343817L5282492M6830357J5956580q576631k2666335k7086318r718657L822983
$$ plain form
1462.4 616188288 622601211 627644658 635755122 648575127 661440253 667054594 666314602 663138509
1478.7 663138509 658822119 653922200 648887277 643147826 635879397 627790034 620260775 611435533
1495 611435533 598559380 583333015 568449974 554016888 533024371 493027896 453879505 436953574
1511.4 436953574 451912373 508432090 590436757 657663584 697063386 712104797 712015688 706119299
1527.7 706119299 698842287 690829873 681249321 673425019 667810977 660145640 650520504 641806841
1544 641806841 633041918 623747468 613047183 601824462 590920031 580326974 565232635 546302319
1560.3 546302319 535069287 525876522 513930976 495310605 471992582 458544970 453406781 452770710
1576.6 452770710 471132785 501559138 515916407 501904011 477327496 458631098 442950726
$$ packed form
1462.4F16188288O412923N043447Q110464J2820005J2865126N614341p39992l176093
1478.7F63138509m316390m899919n034923n739451p268429q089363p529259q825242
1495F11435533j2876153j5226365j4883041j4433086k0992517l9996475l9148391j6925931
1511.4D36953574J4958799N6519717Q2004667O7226827L9399802J5041411q9109n896389
1527.7G06119299p277012q012414r580552p824302n614042p665337r625136q713663
1544F41806841q764923r294450j0700285j1222721j0904431j0593057j5094339j8930316
1560.3E46302319j1233032r192765j1945546j8620371k3318023j3447612n138189o36071
1576.6D52770710J8362075L0426353J4357269j4012396k4576515j8696398j5680372
$$ plain form
1590.9 442950726 423840642 405117035 393311471 390192926 397553056 417223752 446628004 481041104
1607.2 481041104 516347706 548493683 575215340 599100947 621148646 636948705 650247276
1621.5 650247276 664191127 674024343 677330434 675375164 670108974 662190139 649706364 637251139
1637.8 637251139 628593802 620713890 610510349 591554284 563633740 538145065 502722025 447951615
1654.1 447951615 417209625 413217008 432893544 481955528 544693828 596272469 637061894
1668.4 637061894 666979373 684232652 701867461 723631442 740224004 750630856 757788777
1682.7 757788777 762257159 763101161 763179719 765174150 768784344 772635281 775519967 777263224 778215647
1701.1 778215647 778680205 778595686 777786434 776572883 775599718 775184989 775144577 774953902 774606705 774638891
$$ packed form
1590.9D42950726j9110084j8723607j1805564l118545P360130J9670696K9404252L4413100
1607.2D81041104L5306602L2145977K6721657K3885607K2047699J5800059J3298571
1621.5F50247276J3943851R833216L306091j955270n266190p918835j2483775j2455225
1637.8F37251139q657337p879912j0203541j8956065k7920544k5488675l5423040n4770410
1654.1D47951615l0741990l992617J9676536M9061984O2738300N1578641M0789425
1668.4F37061894K9917479J7253279J7634809K1763981J6592562J0406852P157921
1682.7G57788777M468382Q44002P8558J994431L610194L850937K884686J743257R52423
1701.1G78215647M64558q4519q09252j213551r73165m14729m0412j90675l47197L2186
$$ plain form
1721.5 774638891 774703860 774506986 774022341 773375869 772546232 771153033 769665122 768813729 767930686
1739.8 767930686 766840935 765956461 765064061 763873339 762065589 759952724 758000374 755987823 754177511
1758.2 754177511 753137887 752511680 751995504 751473904 750688136 749782205 748885214 748545527 748908699
1776.5 748908699 749404728 749630213 749595761 749336600 748883426 748502135 748148084 747608840 747033000 746603966
1796.9 746603966 746116340 745379627 744479895 743540943 742360592 740565240 738199592 736098409 735083044
1815.3 735083044 735196531 736035645 737082064 737986684 738571942 738886237 738955200 738768578 738471687 738040984
1835.7 738040984 737523735 737002969 736355662 735485494 734931827 735004187 735272288 735429704 735339284 734914303
1856.1 734914303 734199643 733408809 732687533 732014537 731236696 730147481 728842318 727544487 726047158
$$ packed form
1721.5G74638891O4969j96874m84645o46472q29637j393199j487911q51393q83043
1739.8G67930686j089751q84474q92400j190722j807750k112865j952350k012551j810312
1758.2G54177511j039624o26207n16176n21600p85768r05931q96991l39687L63172
1776.5G48908699M96029K25485l4452k59161m53174l81291l54051n39244n75840m29034
1796.9G46603966m87626p36713q99732r38952j180351j795352k365648k101183j015365
1815.3G35083044J13487Q39114J046419R04620N85258L14295O8963j86622k96891m30703
1835.7G38040984n17249n20766o47307q70168n53667P2360K68101J57416r0420m24981
1856.1G34914303p14660p90834p21276o72996p77841j089215j305163j297831j497329
$$ plain form
1874.4 726047158 724074602 721442044 717817068 712841034 706404805 699131131 692755163 690917730
1890.7 690917730 695716739 704040289 710840583 714083672 715102732 715568662 716363907 717658222 719148755
1909.1 719148755 720323801 720902622 721013546 720930338 720843792 720784605 720692515 720665455 720792770 720981658
1929.5 720981658 721106529 721031666 720641732 719945669 719085872 718146741 717262089 716620922 716135204 715605795
1949.9 715605795 714963436 714182198 713203490 711931050 710220158 708023906 705599070 703646183 703157485
1968.3 703157485 704439819 706527770 708145738 708811164 708866954 708705902 708390474 707963824 707589507
1986.6 707589507 707354605 707181454 706994116 706840575 706730425 706523180 706023097 705161214 704102814
2005 704102814 703158379 702561080 702221632 701846719 701373696 700841784 700047135 698858976 697470248 696543813
$$ packed form
1874.4G26047158j972556k632558l624976m976034o436229p273674o375968j837433
1890.7F90917730M799009Q323550O800294L243089J019060M65930P95245J294315J490533
1909.1G19148755J175046N78821J10924q3208q6546n9187r2090k7060J27315J88888
1929.5G20981658J24871p4863l89934o96063q59797r39131q84652o41167m85718n29409
1949.9G15605795o42359p81238r78708j272440j710892k196252k424836j952887m88698
1968.3G03157485J282334K087951J617968O65426N5790j61052l15428m26650l74317
1986.6G07589507k34902j73151j87338j53541j10150k07245n00083q61883j058400
2005G04102814r44435n97299l39448l74913m73023n31912p94649j188159j388728r26435
$$ plain form
2025.4 696543813 696992159 698775828 700932086 702736735 703881919 704314828 704251111 704051852 703955591
2043.7 703955591 703934729 703829169 703543842 703064978 702478647 702066541 702066004 702373505 702672839 702723444
2064.1 702723444 702494621 702112257 701647162 701142251 700741172 700580835 700640380 700782061 700881004 700848579
2084.5 700848579 700661778 700400531 700148940 699869335 699516714 699150980 698833525 698533654 698216081 697914124
2104.9 697914124 697680533 697538257 697474360 697502494 697638512 697793543 697875977 697909594 697893381 697788239
2125.3 697788239 697648168 697550178 697478175 697374940 697236180 697050929 696795583 696483850 696164310 695909560
2145.7 695909560 695737839 695572197 695355713 695134878 694924772 694676638 694421709 694190800 693917871 693548679
2166.1 693548679 693140566 692860425 692737281 692628801 692489922 692328691 692104816 691847265 691649795 691530228
$$ packed form
2025.4F96543813M48346J783669K156258J804649J145184M32909o3717j99259r6261
2043.7G03955591k0862j05560k85327m78864n86331m12106n37L07501K99334N0605
2064.1G02723444k28823l82364m65095n04911m01079j60337N9545J41681R8943l2425
2084.5G00848579j86801k61247k51591k79605l52621l65734l17455k99871l17573l01957
2104.9F97914124k33591j42276o3897K8134J36018J55031Q2434L3617j6213j05142
2125.3F97788239j40071r7990p2003j03235j38760j85251k55346l11733l19540k54750
2145.7F95909560j71721j65642k16484k20835k10106k48134k54929k30909k72929l69192
2166.1F93548679m08113k80141j23144j08480j38879j61231k23875k57551j97470j19567
$$ plain form
2186.5 691530228 691410363 691233397 691034913 690837264 690611541 690377653 690192223 690024495 689786732 689490914
2206.9 689490914 689214289 688977182 688769519 688594580 688404679 688115597 687732875 687373519 687125266 686918199
2227.3 686918199 686680555 686493397 686403573 686288118 686079085 685869396 685676634 685418665 685137451 684912741
2247.7 684912741 684646785 684203565 683630824 683071136 682638407 682459414 682579398 682806790 682872474 682708085
2268.1 682708085 682407141 682007909 681484818 680912733 680475235 680289209 680295169 680366039 680431604 680498004
2288.5 680498004 680590510 680680215 680717587 680617273 680301070 679851055 679399073 678940892 678427756 677845478
2308.9 677845478 677181959 676468551 675793946 675192714 674555242 673834324 673248589 673072577 673257589 673469126
2329.3 673469126 673448026 673203111 672950089 672899425 673061490 673239946 673306346 673412800 673710465 673976719
$$ packed form
2186.5F91530228j19865j76966j98484j97649k25723k33888j85430j67728k37763k95818
2206.9F89490914k76625k37107k07663j74939j89901k89082l82722l59356k48253k07067
2227.3F86918199k37644j87158q9824j15455k09033k09689j92762k57969k81214k24710
2247.7F84912741k65956m43220n72741n59688m32729j78993J19984K27392O5684j64389
2268.1F82708085l00944l99232n23091n72085m37498j86026N960P0870O5565O6400
2288.5F80498004R2506Q9705L7372j00314l16203m50015m51982m58181n13136n82278
2308.9F77845478o63519p13408o74605o01232o37472p20918n85735j76012J85012K11537
2329.3F73469126k1100k44915k53022n0664J62065J78456O6400J06454K97665K66254
$$ plain form
2349.7 673976719 673907161 673474252 672939777 672568560 672489285 672550738 672490239 672342658 672248483 672239542 672355890
2372.1 672355890 672562182 672772467 672971606 673171818 673348784 673447669 673432708 673339963 673221767 673058987
2392.5 673058987 672841668 672604859 672357917 672088325 671779335 671436071 671084344 670702040 670271218 669832706
2412.9 669832706 669416368 669002414 668571651 668160498 667851031 667724252 667850673 668200731 668578267 668786108
2433.3 668786108 668786466 668657839 668484211 668327093 668230653 668174982 668056548 667809188 667479515 667097211
2453.7 667097211 666598141 665982544 665451407 665197730 665177226 665214837 665216625 665196121 665168583 665178835 665278614
2476.1 665278614 665368080 665308714 665161788 665076435 665043831 664944172 664755404 664546072 664294660 663933516
2496.5 663933516 663507104 663062632 662560165 662027836 661598206 661299229 660976946 660560668 660232782 660218179
$$ packed form
2349.7F73976719o9558m32909n34475l71217p9275O1453o0499j47581r4175q941J16348
2372.1F72355890K06292K10285J99139K00212J76966R8885j4961r2745j18196j62780
2392.5F73058987k17319k36809k46942k69592l08990l43264l51727l82304m30822m38512
2412.9F69832706m16338m13954m30763m11153l09467j26779J26421L50058L77536K07841
2433.3F68786108L58j28627j73628j57118r6440n5671j18434k47360l29673l82304
2453.7F67097211m99070o15597n31137k53677k0504L7611J788k0504k7538J0252R9779
2476.1F65278614Q9466n9366j46926q5353l2604r9659j88768k09332k51412l61144
2496.5F63933516m26412m44472n02467n32329m29630k98977l22283m16278l27886j4603
$$ plain form
2516.9 660218179 660538733 661018252 661467969 661762059 661809564 661666334 661509156 661343575 661029935 660590708
2537.3 660590708 660141826 659660816 659082472 658431470 657722175 656917572 656068802 655370414 654966950 654785514
2557.7 654785514 654702544 654697299 654758692 654888093 655092835 655249417 655100584 654517233 653830111 653597951
2578.1 653597951 653842092 654036641 653936505 653735459 653578639 653455496 653316617 653079748 652733743 652492166
2598.5 652492166 652638376 653181434 653832912 654335618 654691100 654974103 655130863 655156314 655194342 655292153
2618.9 655292153 655323446 655251622 655215681 655232549 655124247 654893219 654733241 654673338 654650748 654706895 654859424
2641.3 654859424 655011475 655096471 655176580 655284345 655328035 655271113 655193329 655112028 654955924 654739082 654572785
2663.7 654572785 654457271 654290259 654101610 653991163 653872192 653645456 653445303 653362453 653239965 652952909
$$ packed form
2516.9F60218179L20554M79519M49717K94090M7505j43230j57178j65581l13640m39227
2537.3F60590708m48882m81010n78344o51002p09295q04603q48770o98388m03464j81436
2557.7F54785514q2970n245O1393J29401K04742J56582j48833n83351o87122k32160
2578.1F53597951K44141J94549j00136k01046j56820j23143j38879k36869l46005k41577
2598.5F52492166J46210N43058O51478N02706L55482K83003J56760K5451L8028R7811
2618.9F55292153L1293p1824l5941J6868j08302k31028j59978n9903k2590N6147J52529
2641.3F54859424J52051Q4996Q0109J07765M3690n6922p7784q1301j56104k16842j66297
2663.7F54572785j15514j67012j88649j10447j18971k26736k00153q2850j22488k87056
$$ plain form
2684.1 652952909 652589798 652263880 651923358 651491940 651056111 650717318 650451243 650239110 650133967 650086880
2704.5 650086880 649943292 649702549 649486959 649283290 648998857 648694813 648503363 648382843 648198307 647990644
2724.9 647990644 647811174 647517681 647085726 646687686 646398783 646095574 645691693 645309627 645056546 644891977
2745.3 644891977 644710898 644416749 644031763 643723249 643666029 643852592 644063473 644087434 643937945 643770874
2765.7 643770874 643659413 643576324 643535912 643526137 643379807 643018782 642600954 642227829 641834974 641440153
2786.1 641440153 641139209 640830040 640357614 639820695 639407277 639082313 638664842 638188899 637855291 637689352
2806.5 637689352 637567282 637398005 637214005 637142479 637187243 637186110 636977315 636477053 635671794 634573221
2826.9 634573221 633153975 631282210 628762722 625368953 620860219 615576506 611717522 612555265
$$ packed form
2684.1F52952909l63111l25918l40522m31418m35829l38793k66075k12133j05143m7087
2704.5F50086880j43588k40743k15590k03669k84433l04044j91450j20520j84536k07663
2724.9F47990644j79470k93493m31955l98040k88903l03209m03881l82066k53081j64569
2745.3F44891977j81079k94149l84986l08514n7220J86563K10881K3961j49489j67071
2765.7F43770874j11461q3089m0412r775j46330l61025m17828l73125l92855l94821
2786.1F41440153l00944l09169m72426n36919m13418l24964m17471m75943l33608j65939
2806.5F37689352j22070j69277j84000p1526M4764j133k08795n00262q05259j098573
2826.9F34573221j419246j871765k519488l393769m508734n283713l858984Q37743
$$ plain form
2843.2 612555265 618305922 625168204 629903853 632307291 633359492 633693099 633660018 633515418 633366406
2861.6 633366406 633219719 633050561 632833123 632545829 632126927 631490469 630713701 629995227 629378796 628796279
2882 628796279 628170609 627395928 626422584 625266433 623860836 622031450 619694650 617146730 615111470
2900.3 615111470 614332378 614980221 616460145 617954493 618995726 619453430 619382024 618990004 618520379
2918.7 618520379 618136048 617879093 617557704 616935551 616017580 614893496 613598883 612064660 610129297
2937 610129297 607911766 606204808 606029689 607284009 608347476 607713103 605471373 603102148 602602959
2955.4 602602959 605017126 609252989 613283813 615973353 617277086 617681503 617705762 617624283 617495120
2973.8 617495120 617264330 616832316 615992904 614499092 612373829 609978735 607932746 606971741 607338190
$$ packed form
2843.2F12555265N750657O862282M735649K403438J052201L33607l3081j44600j49012
2861.6F33366406j46687j69158k17438k87294m18902o36458p76768p18474o16431n82517
2882F28796279o25670p74681r73344j156151j405597j829386k336800k547920k035260
2900.3F15111470p79092O47843J479924J494348J041233M57704p1406l92020m69625
2918.7F18520379l84331k56955l21389o22153r17971j124084j294613j534223j935363
2937F10129297k217531j706958j75119J254320J063467o34373k241730k369225m99189
2955.4F02602959K414167M235863M030824K689540J303733M04417K4259q1479j29163
2973.8F17495120k30790m32014q39412j493812k125263k395094k045989r61005L66449
$$ plain form
2992.1 607338190 608333230 608926833 608646572 608012438 607988656 608515143 608512521 607277691 604777694 601564586
3012.5 601564586 599385440 600613415 605494201 611025035 614231110 615089655 615232706 615488231 615554392
3030.9 615554392 615179121 614659846 614555359 615392864 616862476 617657900 616799295 614379466 610852480
3049.2 610852480 606251299 600899220 596378446 594641089 596815288 602386296 608811378 613413692
3065.5 613413692 615291238 614862621 613238335 612114906 612721860 614526570 615872622 615775168 614287496
3083.9 614287496 612095594 610781372 611993611 615354538 618711770 620620728 621223748 621242106 621244371
3102.2 621244371 621539712 622086942 622569501 622772872 622767031 622658193 622442186 622111440 621659875 621135950
3122.6 621135950 620677471 620333672 620020449 619651794 619194090 618643343 618020296 617377698 616786897 616309881
$$ packed form
2992.1F07338190R95040N93603k80261o34134k3782N26487k622j234830k499997l213108
3012.5F01564586k179146J227975M880786N530834L206075Q58545J43051K55525O6161
3030.9F15554392l75271n19275j04487Q37505J469612P95424q58605k419829l526986
3049.2F10852480m601181n352079m520774j737357K174199N571008O425082M602314
3065.5F13413692J877546m28617j624286j123429O06954J804710J346052r7454j487672
3083.9F14287496k191902j314222J212239L360927L357232J908958O03020J8358K265
3102.2F21244371K95341N47230M82559K03371n841j08838k16007l30746m51565n23925
3122.6F21135950m58479l43799l13223l68655m57704n50747o23047o42598n90801m77016
$$ plain form
3143 616309881 615925252 615553558 615180373 614831269 614518166 614263833 614096701 613991082 613859117 613615513
3163.4 613615513 613227189 612723529 612169802 611675680 611341596 611096442 610750735 610237718 609639704 609096169
3183.8 609096169 608719051 608465374 608195186 607860088 607516527 607209742 606930256 606618881 606223762 605763614
3204.2 605763614 605245173 604615211 603857040 603027046 602172673 601312757 600415289 599435270 598424792
3222.6 598424792 597468972 596668005 596156895 595979154 595953345 595782399 595400393 594911814 594340384 593779504
3243 593779504 593385458 593050838 592554927 591975570 591470480 590984285 590439498 589888632 589385390 588912308
3263.4 588912308 588493705 588260591 588269114 588259101 587987483 587547481 587075412 586608648 586150706 585668862
3283.8 585668862 585128486 584541738 583968341 583361089 582583427 581633866 580588281 579499900 578363061
$$ packed form
3143F16309881l84629l71694l73185l49104l13103k54333j67132j05619j31965k43604
3163.4F13615513l88324n03660n53727m94122l34084k45154l45707n13017n98014n43535
3183.8F09096169l77118k53677k70188l35098l43561l06785k79486l11375l95119m60148
3204.2F05763614n18441o29962p58171q29994q54373q59916q97468r80019j010478
3222.6E98424792r55820q00967n11110j77741k5809j70946l82006m88579n71430n60880
3243E93779504l94046l34620m95911n79357n05090m86195n44787n50866n03242m73082
3263.4E88912308m18603k33114Q523j0013k71618m40002m72069m66764m57942m81844
3283.8E85668862n40376n86748n73397o07252p77662r49561j045585j088381j136839
$$ plain form
3302.1 578363061 577069700 575599194 574247003 573516786 573566198 573953092 574129999 573879838 573246658
3320.5 573246658 572382867 571391940 570240140 568955362 567658424 566376925 565136731 563978374 562742412
3338.8 562742412 561303854 559761167 558192313 556697309 555334091 553855598 552099407 550301135
3355.2 550301135 548653901 547071338 545378566 543630779 542097211 540715635 539095879 537122071
3371.5 537122071 535125732 533406436 531892776 530430019 528978646 527562559 526243567 525149703
3387.8 525149703 524349570 523520947 522341073 521113753 520300865 519733965 518792868 517447412 516297877
3406.1 516297877 515528202 514862120 514112175 513237894 512371421 511698782 511150837 510625839 510234892 510031104
3426.5 510031104 509891391 509698987 509577870 509648502 509655058 509404659 509128869 509080350 509258866 509503365
$$ packed form
3302.1E78363061j293361j470506j352191p30217M9412L86894J76907k50161o33180
3320.5E73246658q63791r90927j151800j284778j296938j281499j240194j158357j235962
3338.8E62742412j438558j542687j568854j495004j363218j478493j756191j798272
3355.2E50301135j647234j582563j692772j747787j533568j381576j619756j973808
3371.5E37122071j996339j719296j513660j462757j451373j416087j318992j093864
3387.8E25149703q00133q28623j179874j227320q12888n66900r41097j345456j149535
3406.1E16297877p69675o66082p49945q74281q66473o72639n47945n24998l90947k03788
3426.5E10031104j39713j92404j21117P0632O556k50399k75790m8519J78516K44499
$$ plain form
3446.9 509503365 509721875 510013998 510417700 510866344 511404097 512074530 512700677 513280988 514095664 515039027
3467.3 515039027 515670896 515955985 516300321 516926467 517787874 518632472 519159913 519597769 520288467 521040797
3487.7 521040797 521690845 522391975 523202896 524044156 524817348 525575101 526400089 527096212 527655900 528352380
3508.1 528352380 529234409 530228913 531178653 531953216 532701075 533605933 534639776 535556197 536266625
3526.5 536266625 536981583 537847400 538888097 540078163 541198432 542139053 543190181 544448256 545589566
3544.8 545589566 546386719 547109485 547986388 548878610 549789071 550815344 551881015 552914977 553930402
3563.2 553930402 554907382 555862784 556922197 558071494 559200168 560331166 561548769 562903047 564375639
3581.5 564375639 565872729 567205966 568238616 569342613 570741415 572169423 573572099 575079560
$$ packed form
3446.9E09503365K18510K92123M03702M48644N37753O70433O26147N80311Q14676R43363
3467.3E15039027O31869K85089L44336O26146Q61407Q44598N27441M37856O90698P52330
3487.7E21040797O50048P01130Q10921Q41260P73192P57753Q24988O96123N59688O96480
3508.1E28352380Q82029R94504R49740P74563P47859R04858J033843R16421P10428
3526.5E36266625P14958Q65817J040697J190066J120269R40621J051128J258075J141310
3544.8E45589566P97153P22766Q76903Q92222R10461J026273J065671J033962J015425
3563.2E53930402R76980R55402J059413J149297J128674J130998J217603J354278J472592
3581.5E64375639J497090J333237J032650J103997J398802J428008J402676J507461
$$ plain form
3597.9 575079560 576554179 577888608 579200745 580448270 581561506 582709014 583962202 585172296
3614.2 585172296 586310983 587401509 588437617 589467824 590530217 591587484 592382550 593048394 593964100
3632.5 593964100 594875336 595604956 596244037 596855521 597490370 598181784 598784745 599010408 598957598 599187434
3652.9 599187434 599694729 600221574 600802600 601259649 601393521 601485550 601667285 601553977 601344049 601600587
3673.3 601600587 601712286 601639390 601967633 602432013 602969229 603737891 604471684 604547739 604296029 604437709
3693.7 604437709 604750812 604913712 604919612 604754508 604609013 604736269 604930580 604821503 604389012 604215622
3714.1 604215622 604423463 604712725 604994297 605197191 605264723 605329633 605631351 606106222 606434882 606437385
3734.5 606437385 606250465 606161237 606205285 605931818 605013669 604496300 604557335 604294837 604055703 604336917
$$ packed form
3597.9E75079560J474619J334429J312137J247525J113236J147508J253188J210094
3614.2E85172296J138687J090526J036108J030207J062393J057267P95066O65844R15706
3632.5E93964100R11236P29620O39081O11484O34849O91414O02961K25663n2810K29836
3652.9E99187434N07295N26845N81026M57049J33872R2029J81735j13308k09928K56538
3673.3F01600587J11699p2896L28243M64380N37216P68662P33793P6055k51710J41680
3693.7F04437709L13103J62900N900j65104j45495J27256J94311j09077m32491j73390
3714.1F04215622K07841K89262K81572K02894O7532O4910L01718M74871L28660K503
3734.5F06437385j86920q9228M4048k73467r18149n17369O1035k62498k39134K81214
$$ plain form
3754.9 604336917 604670167 604629517 604440689 604455471 604479313 604429841 604323089 604142249 604096532 604194939 604298115
3777.3 604298115 604181945 603871286 603632987 603448212 603323102 603268802 603223205 603168130 603001714 602876902
3797.7 602876902 602895021 602670491 602527022 602569938 602359116 602272272 602494478 602637053 602422178 602288961
3818.1 602288961 602219403 601822317 601696491 601772368 601749122 601736903 601732552 601841509 601871669 601494253 601127207
3840.6 601127207 600965202 600816786 600803673 600964665 601020098 600381434 599496424 599502325 599856138 600056112
3861 600056112 599995315 599772155 599704504 599606276 599314690 599125445 599053323 599183142 599296987 599208772 599225998
3883.4 599225998 599076390 598832011 598845840 598731399 598565817 598684132 598773658 598577321 598269701 597983241
3903.8 597983241 597799778 597858548 598013878 598080456 598086953 598002970 597790778 597633719 597628236 597608328 597540438
$$ packed form
3754.9F04336917L33250m0650j88828J4782K3842m9472j06752j80840m5717R8407J03176
3777.3F04298115j16170l10659k38299j84775j25110n4300m5597n5075j66416j24812
3797.7F02876902J8119k24530j43469M2916k10822q6844K22206J42575k14875j33217
3818.1F02288961o9558l97086j25826P5877k3246j2219m351J08957L0160l77416l67046
3840.6F01127207j62005j48416j3113J60992N5433o38664q85010N901L53813J99974
3861F00056112o0797k23160o7651r8228k91586j89245p2122J29819J13845q8215J7226
3883.4E99225998j49608k44379J3829j14441j65582J18315Q9526j96337l07620k86460
3903.8E97983241j83463N8770J55330O6578O497q3983k12192j57059n483j9908o7890
$$ plain form
3926.2 597540438 597552001 597549498 597444236 597346961 597236395 597067535 596888006 596670687 596524060 596497297
3946.6 596497297 596373439 596126020 595963836 595962465 595986128 595951200 595874786 595766366 595677853 595623076 595579684
3969.1 595579684 595586002 595652282 595707476 595729649 595764399 595809042 595784903 595631301 595456421 595357955 595225692
3991.5 595225692 595018685 594832301 594693720
3997.6 594693720
$$ packed form
3926.2E97540438J1563k503j05262r7275j10566j68860j79529k17319j46627k6763
3946.6E96497297j23858k47419j62184j371K3663l4928p6414j08420q8513n4777m3392
3969.1E95579684O318O6280N5194K2173L4750M4643k4139j53602j74880r8466j32263
3991.5E95225692k07007j86384j38581
3997.6E94693720
##END=$$ End of the data block
