##TITLE=B8M - Breno 3 $$ Begin of the data block
##JCAMP-DX=5.00 $$ ACD/SpecManager v 10.08
##SPECTROMETER/DATA SYSTEM=Alpha
##DATE=22 Jun 2015 10:50:00
##DATA TYPE=INFRARED SPECTRUM
##DATA CLASS=XYDATA
##ORIGIN=
##OWNER=
##NPOINTS=1765
##FIRSTX=399.76428223
##LASTX=3997.64306641
##MAXX=3997.64306641
##MINX=399.76428223
##MAXY=0.87246406
##MINY=0.46670079
##XFACTOR=1.0000000000
##YFACTOR=1.000000000000000e-9
##FIRSTY=0.80268365
##DELTAX=2.03961372
##XUNITS=1/CM
##YUNITS=ARBITRARY UNITS
##XYDATA=(X++(Y..Y))
$$ plain form
399.8 802683651 810584307 817911327 819810748 819849610 819822013 816812932 813375175 812859595 812310934
418.1 812310934 810625970 810687304 810101867 807493687 806097627 805266082 802417636 800203264 799372613
436.5 799372613 796211064 791891515 788463473 782747328 775757551 774664998 781394422 792093337
452.8 792093337 803409636 811439991 812932312 811957657 811862648 810017407 807257593 806806862 806125462
471.2 806125462 803487778 802515745 802369893 800077915 798324227 798144519 796175420 793606639 793061435
489.5 793061435 791689694 788412631 786487758 784836233 780891776 776498497 771235287 760619879
505.8 760619879 742729187 717805505 692516923 682858527 692165494 705956519 719236076 736887217
522.1 736887217 754527926 764672697 768635333 770331204 768755436 763987064 758620143 752392054
$$ packed form
399.8H02683651P900656P327020J899421L8862k7597l009081l437757n15580n48661
418.1H12310934j684964O1334n85437k608180j396060q31545k848446k214372q30651
436.5G99372613l161549m319549l428042n716145o989777j092553O729424J0698915
452.8G92093337J1316299Q030355J492321r74655r5009j845241k759814m50731o81400
471.2H06125462k637684r72033j45852k291978j753688j79708j969099k568781n45204
489.5G93061435j371741l277063j924873j651525l944457m393279n263210j0615408
505.8G60619879j7890692k4923682k5288582r658396R306967J3791025J3279557J7651141
522.1G36887217J7640709J0144771L962636J695871j575768m768372n366921o228089
$$ plain form
538.5 752392054 744801164 735807657 725025535 720936298 732057810 748743951 757660687 759234905
554.8 759234905 759412766 759070992 757197976 755623937 754821599 752996743 750912130 749996722 748836875
573.1 748836875 747038960 746255100 745784700 744197607 742749214 741791308 739795566 737465143 735914767
591.5 735914767 733779609 730707407 728269696 726061225 722992957 720572293 719876826 719525874 718851149
609.8 718851149 718290806 718135715 721152961 733140349 755613685 780279219 795620322 797363341
626.2 797363341 790068567 780770123 773109972 766255856 759917378 755471230 751750171 746885121
642.5 746885121 741927207 737939000 733629704 728606403 723955035 719882607 718168497 724563181
658.8 724563181 742356956 764815927 781366408 788368642 783557117 774596870 768330514 763374090
$$ packed form
538.5G52392054p590890q993507j0782122m089237J1121512J6686141Q916736J574218
554.8G59234905J77861l41774j873016j574039q02338j824856k084613r15408j159847
573.1G48836875j797915p83860m70400j587093j448393r57906j995742k330423j550376
591.5G35914767k135158l072202k437711k208471l068268k420664o95467l50952o74725
609.8G18851149n60343j55091L017246J1987388K2473336K4665534J5341103J743019
626.2G97363341p294774r298444p660151o854116o338478m446148l721059m865050
642.5G46885121m957914l988207m309296n023301m651368m072428j714110O394684
658.8G24563181J7793775K2458971J6550481P002234m811525q960247o266356m956424
$$ plain form
675.1 763374090 758796751 755176067 752339423 749110937 745864630 743240237 740367293 737145007
691.4 737145007 734656870 732489944 729772627 727282286 725933790 725282907 724905968 724864244 724712670
709.8 724712670 724329770 723926127 722859502 720886946 719067454 717676818 715878606 713861763 712410688
728.1 712410688 711027741 709186614 707587719 706199527 704203784 701875627 699355662 695406139
744.5 695406139 690304399 687339485 688956916 693529129 698031485 701085627 702682257 704044342
760.8 704044342 706205666 708551645 710936904 714467943 719071269 724327683 731379092 739793837
777.1 739793837 745217621 743105650 733431995 720735550 710506439 705204487 702960014 700927317
793.4 700927317 698571265 695478678 689405441 677898347 659542620 641242266 637438655 650262773
$$ packed form
675.1G63374090m577339l620684k836644l228486l246307k624393k872944l222286
691.4G37145007k488137k166926k717317k490341j348496o50883l76939m1724j51574
709.8G24712670l82900m03643j066625j972556j819492j390636j798212k016843j451075
728.1G12410688j382947j841127j598895j388192j995743k328157k519965l949523
744.5F95406139n101740k964914J617431M572213M502356L054142J596630J362085
760.8G04044342K161324K345979K385259L531039M603326N256414P051409Q414745
777.1G39793837N423784k111971r673655j2696445j0229111n301952k244473k032697
793.4G00927317k356052l092587o073237j1507094j8355727j8300354l803611J2824118
$$ plain form
809.7 650262773 666853428 676850915 679364383 677236974 670288980 655424654 631620228 609699249
826 609699249 608285487 625883102 640386760 642853022 643327296 650615454 666691601 689308703
842.4 689308703 712942004 732383668 744013309 744634151 733818352 717343032 703838587 697261333
858.7 697261333 695536792 695985854 698615313 703201473 707892537 712396860 717634857 722842157 727361917
877 727361917 732310653 737559617 741710782 745355844 749417186 752831936 755451381 758641958 761889756
895.4 761889756 764104664 766422093 769382834 771516621 772920728 774733484 775894761 775584221 774986446
913.7 774986446 773661256 769548178 762414932 752395570 739925086 731532693 737203419 756827056
930.1 756827056 779205084 797405303 812169194 823396325 831077874 837028980 840789616 841432333
$$ packed form
809.7F50262773J6590655R997487K513468k127409o947994j4864326k3804426k1920979
826F09699249j413762J7597615J4503658K466262M74274P288158J6076147K2617102
842.4F89308703K3633301J9441664J1629641O20842j0815799j6475320j3504445o577254
858.7F97261333j724541M49062K629459M586160M691064M504323N237997N207300M519760
877G27361917M948736N248964M151165L645062M061342L414750K619445L190577L247798
895.4G61889756K214908K317429K960741K133787J404107J812756J161277l10540n97775
913.7G74986446j325190m113078p133246j0019362j2470484q392393N670726J9623637
930.1G56827056K2378028J8200219J4763891J1227131P681549N951106L760636O42717
$$ plain form
946.4 841432333 840206802 836853683 829485357 818655670 805460513 788894534 769285083 749748766
962.7 749748766 732173800 715542495 699698210 686002851 674707651 666293323 661583602 659442663
979 659442663 658613086 659579694 662069857 664653361 667512894 671409249 675315022 678600669 682253897
997.4 682253897 686052322 688844144 691213846 693799376 695366561 695130527 694103241 694570124 698180974
1015.7 698180974 703391433 707416594 709324539 710385978 712016821 713338435 713209689 711874306
1032 711874306 707676470 696982741 678825378 655697823 631830275 613747835 608529687 618275523
1048.4 618275523 638208926 661293626 682108700 697542965 707994282 715818226 721517384 725011468
1064.7 725011468 727982819 731083632 733105719 734426379 736145854 737341762 737647831 738582730 739995837
$$ packed form
946.4H41432333j225531l353119p368326j0829687j3195157j6565979j9609451j9536317
962.7G49748766j7574966j6631305j5844285j3695359j1295200q414328m709721k140939
979F59442663q29577R66608K490163K583504K859533L896355L905773L285647L653228
997.4F82253897L798425K791822K369702K585530J567185k36034j027286M66883L610850
1015.7F98180974N210459M025161J907945J061439J630843J321614j28746j335383
1032G11874306m197836j0693729j8157363k3127555k3867548j8082440n218148R745836
1048.4F18275523J9933403K3084700K0815074J5434265J0451317P823944N699158L494084
1064.7G25011468K971351L100813K022087J320660J719475J195908L06069R34899J413107
$$ plain form
1083 739995837 740497112 740955412 742427707 743682802 744296372 745372236 746163368 745408118 743916214
1101.4 743916214 741475701 735660374 726108015 715660155 707621157 704198778 704793334 705949664
1117.7 705949664 705580831 704922736 705193996 707524478 713614941 721153319 725614905 726488173 726350367
1136.1 726350367 726754785 727492034 729345858 733520210 738140285 740456283 740690887 739987850 738997579
1154.4 738997579 739350438 741396010 742585599 741518080 739448130 736155093 729548216 718323290
1170.7 718323290 701207995 680981457 669929445 674639881 686015725 700872183 723957717
1185 723957717 747978568 762296200 767731547 769537985 769133866 766334534 761971116 755654275
1201.3 755654275 747245908 741136730 742268085 749351323 756939113 761199355 761440694 759285450
$$ packed form
1083G39995837N01275M58300J472295J255095O13570J075864P91132p55250j491904
1101.4G43916214k440513n815327r552359j0447860q038998l422379N94556J156330
1117.7G05949664l68833o58095K71260K330482O090463P538378M461586Q73268j37806
1136.1G26350367M04418P37249J853824M174352M620075K315998K34604p03037r90271
1154.4G38997579L52859K045572J189589j067519k069950l293037o606877j1224926
1170.7G18323290j7115295k0226538j1052012M710436J1375844J4856458K3085534
1185G23957717K4020851J4317632N435347J806438m04119k799332m363418o316841
1201.3G55654275q408367o109178J131355P083238P587790M260242K41339k155244
$$ plain form
1217.7 759285450 757176995 755496025 752447844 747746468 742586792 736657858 729428232 721828163
1234 721828163 713754714 703650177 691340029 677330196 661586702 645968556 632471263 618672013
1250.3 618672013 602073550 586715400 578733802 577902675 579445422 584392786 602140248 637797356
1266.6 637797356 681828201 718887091 742051125 754395247 760828853 761973262 756622255 746607959
1282.9 746607959 737185299 734827578 742797434 756709516 768515527 774572968 775904059 772868156
1299.2 772868156 763471663 746223032 726295590 718894601 733191133 757596791 775919080 784758627
1315.6 784758627 788999736 791863739 793051779 792257667 790035963 787390530 787043989 790392816 793874502
1333.9 793874502 793223023 787800670 779020548 769602597 764255881 765920877 771593750 776281774
$$ packed form
1217.7G59285450k108455j680970l048181m701376n159676n928934p229626p600069
1234G21828163q073449j0104537j2310148j4009833j5743494j5618146j3497293j3799250
1250.3F18672013j6598463j5358150p981598q31127J542747M947364J7747462L5657108
1266.6F37797356M4030845L7058890K3164034J2344122O433606J144409n351007j0014296
1282.9G46607959r422660k357721P969856J3912082J1806011O057441J331091l035903
1299.2G72868156r396493j7248631j9927442p400989J4296532K4405658J8322289Q839547
1315.6G84758627M241109K864003J188040p94112k221704k645433l46541L348827L481686
1333.9G93874502o51479n422353q780122r417951n346716J664996N672873M688024
$$ plain form
1350.2 776281774 779689968 783786654 787978828 791095793 793239832 793635011 791539371 788541436
1366.6 788541436 785566986 782095969 778156519 773841977 768639624 763294637 760171771 760130942 761373818
1384.9 761373818 760828733 754542887 741296589 725603759 717349768 725114763 745569289 766589344
1401.2 766589344 780446947 787478268 790001214 790727556 790720224 790411174 791282296 793978930 797294259
1419.6 797294259 800220072 802879751 804249644 803499401 801739514 799943209 797403157 791578472
1435.9 791578472 781336665 771769643 768335104 772137463 778190136 780991912 779373407 775232732
1452.2 775232732 771731317 772913635 779156983 784017146 785748541 785588026 783727765 780011714
1468.5 780011714 772907853 756435752 729945540 707332075 700292230 710457146 734659731 762701869
$$ packed form
1350.2G76281774L408194M096686M192174L116965K144039L95179k095640k997935
1366.6G88541436k974450l471017l939450m314542n202353n344987l122866m0829J242876
1384.9G61373818n45085o285846j3246298j5692830q253991P764995K0454526K1020055
1401.2G66589344J3857603P031321K522946P26342p332l09050Q71122K696634L315329
1419.6G97294259K925813K659679J369893p50243j759887j796305k540052n824685
1435.9G91578472j0241807r567022l434539L802359O052673K801776j618505m140675
1452.2G75232732l501415J182318O243348M860163J731395j60515j860261l716051
1468.5G80011714p103861j6472101k6490212k2613465p039845J0164916K4202585K8042138
$$ plain form
1484.9 762701869 781235039 785524011 780441880 772799432 762953639 747886598 728141487 705851376
1501.2 705851376 681062639 645423114 588019848 531306386 489550769 466700792 475543708
1515.4 475543708 515717983 569851279 625358403 667269111 692298532 710257530 725519419
1529.7 725519419 740073144 753170669 761423290 765477657 766999424 765973628 764008462 762697935
1546 762697935 763469636 766148329 769468963 773461044 778909624 786490262 793758750 798119485 801424861
1564.4 801424861 803929329 805341363 805935144 805793524 805252552 804247618 802507102 800008476 796957970
1582.8 796957970 793873906 791111052 789714456 790190220 790918708 789557755 785165250 777533650 766686797
1601.1 766686797 754035950 740609467 724173605 704188466 688755512 685744464 692301810 698452353
$$ packed form
1484.9G62701869J8533170M288972n082131p642448r845793j5067041j9745111k2290111
1501.2G05851376k4788737l5639525n7403266n6713462m1755617k2849977Q842916
1515.4D75543708M0174275N4133296N5507124M1910708K5029421J7958998J5261889
1529.7G25519419J4553725J3097525Q252621M054367J521767j025796j965166j310527
1546G62697935P71701K678693L320634L992081N448580P580638P268488M360735L305376
1564.4H01424861K504468J412034N93781j41620n40972j004934j740516k498626l050506
1582.8G96957970l084064k762854j396596M75764P28488j360953m392505p631600j0846853
1601.1G66686797j2650847j3426483j6435862j9985139j5432954l011048O557346O150543
$$ plain form
1617.4 698452353 699395120 702045619 712444723 725958943 734841049 738218129 738801122 738561094
1633.7 738561094 736960411 734528363 732692599 731085956 729428291 727859616 726621151 726206183
1650.1 726206183 726925611 727906168 727944314 728297114 730540812 735126138 740785539 746609986 753271520
1668.4 753271520 760013163 765409529 770698607 775859773 779878259 783720374 788241863 792983770
1684.7 792983770 796929121 800826669 804804325 808188081 811675668 815093100 817296207 818636179
1701.1 818636179 819616139 820096314 820177436 820577145 821395814 822289467 823561668 825210750 826256514
1719.4 826256514 827052414 828342319 829689860 830797315 832337141 834278345 835749626 836610556 837606072
1737.8 837606072 838574946 839333117 840473950 841802120 842649043 843180239 843672395 843911171 844177008
$$ packed form
1617.4F98452353R42767K650499J0399104J3514220Q882106L377080N82993k40028
1633.7G38561094j600683k432048j835764j606643j657665j568675j238465m14968
1650.1G26206183P19428R80557L8146L52800K243698M585326N659401N824447O661534
1668.4G53271520O741643N396366N289078N161166M018486L842115M521489M741907
1684.7G92983770L945351L897548L977656L383756L487587L417432K203107J339972
1701.1H18636179R79960M80175Q1122L99709Q18669Q93653J272201J649082J045764
1719.4H26256514P95900J289905J347541J107455J539826J941204J471281Q60930R95516
1737.8H37606072R68874P58171J140833J328170Q46923N31196M92156K38776K65837
$$ plain form
1756.1 844177008 844925404 845789492 846276581 846872032 847855330 848598123 849032640 849439323 849311650 848814428
1776.5 848814428 848898709 849537015 849922955 850131035 850547493 850899160 851070046 851346910 851501584 851367474
1796.9 851367474 851504683 852010906 852150679 852060258 852386117 852732360 852582276 852493107 852707803 852641225
1817.3 852641225 852474511 852752268 853019476 852880478 852937877 853157938 852879763 852567434 852641821 852537811
1837.7 852537811 852202415 852241874 852256000 851570427 850809038 850222170 849294424 848520517 848913372 849872112
1858.1 849872112 850252688 850243986 850163400 849613190 848706365 847998619 847231209 846047699 844728589 843346179
1878.5 843346179 842107356 842145383 843752146 845532298 846467435 846596897 845856965 844647765 844563127
1896.9 844563127 846091390 847638130 848276138 848521531 848560989 848493159 848937511 849710226 850095212 850412905
$$ packed form
1756.1H44177008P48396Q64088M87089N95451R83298P42793M34517M06683j27673m97222
1776.5H48814428Q4281O38306L85940K08080M16458L51667J70886K76864J54674j34110
1796.9H51367474J37209N06223J39773r0421L25859L46243j50084q9169K14696o6578
1817.3H52641225j66714K77757K67208j38998N7399K20061k78175l12329P4387j04010
1837.7H52537811l35396L9459J4126o85573p61389n86868r27746p73907L92855R58740
1858.1H49872112L80576q702q0586n50210r06825p07746p67410j183510j319110j382410
1878.5H43346179j238823L8027J606763J780152R35137J29462p39932j209200q4638
1896.9H44563127J528263J546740O38008K45393L9458o7830M44352P72715L84986L17693
$$ plain form
1917.3 850412905 851136625 851666570 851736844 852017283 852524698 852636933 852609217 852809310 852721155 852332890
1937.7 852332890 852361858 852618277 852472484 852322638 852462053 852367043 852082133 852089167 852002621 851451635
1958.1 851451635 850993216 850784957 850368679 850023329 850238144 850578189 850774109 851296306 851995945 852269411
1978.5 852269411 852409482 852782190 852916539 852783382 853022099 853502393 853709638 854021251 854707062 855215907
1998.8 855215907 855513752 856063902 856561959 856675029 856907308 857339561 857378602 857166290 857120454 856756628
2019.2 856756628 855839372 854940534 854399443 854429305 855144322 856064439 856544077 856698155 857147992 857729495
2039.6 857729495 857973814 858246446 858753026 858940303 858860791 859091938 859392464 859402180 859522820 859810710
2060 859810710 859740078 859470487 859493375 859554410 859464109 859674573 860105574 860210896 860246956 860609114 860888481
$$ packed form
1917.3H50412905P23720N29945P0274K80439N07415J12235k7716K00093q8155l88265
1937.7H52332890K8968K56419j45793j49846J39415r5010k84910P034q6546n50986
1958.1H51451635m58419k08259m16278l45350K14815L40045J95920N22197O99639K73466
1978.5H52269411J40071L72708J34349j33157K38717M80294K07245L11613O85811N08845
1998.8H55215907K97845N50150M98057J13070K32279M32253L9041k12312m5836l63826
2019.2H56756628r17256q98838n41091K9862P15017R20117M79638J54078M49837N81503
2039.6H57729495K44319K72632N06580J87277p9512K31147L00526R716J20640K87890
2060H59810710p0632k69591K2888O1035r0301K10464M31001J05322L6060L62158K79367
$$ plain form
2082.5 860888481 860944688 861247718 861636817 861696362 861809731 862187982 862312675 862230599 862434268 862628698
2102.9 862628698 862497747 862502515 862710297 862603128 862362862 862412453 862368882 862025738 861873925 861852050
2123.3 861852050 861482024 861054957 860890210 860538244 859931171 859620333 859472156 859044433 858664095 858525634
2143.7 858525634 858149409 857622564 857501626 857583880 857590139 857946515 858655989 859142244 859520376 860146403
2164.1 860146403 860584676 860632777 860891461 861368656 861506939 861507595 861679792 861631811 861337006 861280739 861291826
2186.5 861291826 861023068 860864997 860979199 860901833 860713780 860820889 860890388 860653520 860559881 860618651
2206.9 860618651 860366642 860035956 859979689 859808743 859357655 859039545 858790100 858354092 858158410 858435273
2227.3 858435273 858674049 858774960 859113276 859449863 859463274 859497011 859645724 859533906 859307170 859290659
$$ packed form
2082.5H60888481N6207L03030L89099N9545J13369L78251J24693q2076K03669J94430
2102.9H62628698j30951M768K07782j07169k40266M9591m3571l43144j51813k1875
2123.3H61852050l70026m27067j64747l51966o07073l10838j48177m27723l80338j38461
2143.7H58525634l76225n26845j20938Q2254O259L56376P09474M86255L78132O26027
2164.1H60146403M38273M8101K58684M77195J38283O56J72197m7981k94805n6267J1087
2186.5H61291826k68758j58071J14202p7366j88053J07109O9499k36868r3639N8770
2206.9H60618651k52009l30686n6267j70946m51088l18110k49445m36008j95682K76863
2227.3H58435273K38776J00911L38316L36587J3411L3737J48713j11818k26736j6511
$$ plain form
2247.7 859290659 859160006 858760118 858510077 858374119 858018577 857707024 857633054 857390940 856949329 856709361
2268.1 856709361 856557429 856264651 856127203 856196642 856066525 855830431 855890632 856119275 856340110 856772721
2288.5 856772721 857316494 857590914 857760787 858138263 858493567 858655751 858922660 859332979 859655559 860093653
2308.9 860093653 860799015 861336172 861671746 862433672 863655388 864786029 865693569 866467834 867023647
2327.2 867023647 867462039 867828131 867890537 867794454 867866457 867973387 867660403 866577685 864535630 862613797
2347.6 862613797 862513304 864614904 867750108 870261073 871768951 872464061 872166276 870922387 869134903
2366 869134903 866877198 864234090 861658812 859276235 856834114 854423285 852321088 850491703 848949611
2384.3 848949611 847954929 847379506 846792102 846218586 845829427 845392883 844849706 844484746 844182730 843648314
$$ packed form
2247.7H59290659j30653l99888k50041j35958l55542l11553p3970k42114m41611k39968
2268.1H56709361j51932k92778j37448O9439j30117k36094O0201K28643K20835M32611
2288.5H56772721N43773K74420J69873L77476L55304J62184K66909M10319L22580M38094
2308.9H60093653P05362N37157L35574P61926J221716J130641R07540P74265N55813
2327.2H67023647M38392L66092O2406r6083P2003J06930l12984j082718k042055j921833
2347.6H62613797j00493K101600L135204K510965J507878O95110k97785j243889j787484
2366H69134903k257705k643108k575278k382577k442121k410829k102197j829385j542092
2384.3H48949611r94682n75423n87404n73516l89159m36544n43177l64960l02016n34416
$$ plain form
2404.7 843648314 843109608 842745841 842266202 841684520 841289997 840914071 840353191 839861035 839525223 839099884
2425.1 839099884 838699877 838580668 838444531 838043332 837692380 837468982 837098002 836696267 836409450 835911810
2445.5 835911810 835170388 834607363 834197581 833667934 833236933 833016932 832604349 831969619 831457317 830942273
2465.9 830942273 830240428 829615772 829063594 828223288 827229321 826412201 825586379 824668825 824015975 823612571
2486.3 823612571 823142290 822738051 822506011 822078645 821394801 820763528 820049524 819040060 818066597
2504.7 818066597 817232788 816154838 814906120 813787222 812510729 810884178 809258044 807637632
2521 807637632 805740952 803796589 802034378 800138950 798054755 796146274 794291019 792166293 789980948
2539.3 789980948 787787497 785158694 782144308 779192269 776186943 772867441 769430161 765766978
$$ packed form
2404.7H43648314n38706l63767m79639n81682l94523l75926n60880m92156l35812m25339
2425.1H39099884m00007j19209j36137m01199l50952k23398l70980m01735k86817m97640
2445.5H35911810p41422n63025m09782n29647m31001k20001m12583o34730n12302n15044
2465.9H30942273p01845o24656n52178q40306r93967q17120q25822r17554o52850m03404
2486.3H23612571m70281m04239k32040m27366o83844o31273p14004j009464r73463
2504.7H18066597q33809j077950j248718j118898j276493j626551j626134j620412
2521H07637632j896680j944363j762211j895428k084195j908481j855255k124726k185345
2539.3G89980948k193451k628803l014386k952039l005326l319502l437280l663183
$$ plain form
2555.6 765766978 761405408 756472588 751433194 746419907 741765201 738145828 735642254 733787417
2572 733787417 732448101 731606483 731041908 730997384 731980741 733666718 735236406 736443579 737347126
2590.3 737347126 737914920 738510787 739492059 740330338 740317881 739431500 737771273 735396624 732963860
2608.7 732963860 731219351 730210721 729769826 729741573 729439318 728128493 725955486 723464072 721022010
2627 721022010 719351649 719421387 721518755 725343049 730638981 736888349 743132591 748742223 753497899
2645.4 753497899 757036567 759287238 760858536 762199461 763298512 764434874 765910149 767356753
2661.7 767356753 768450916 769357085 769942284 769878387 769391298 768770039 767859876 766716301 765687644
2680.1 765687644 764620185 763203919 761769235 760606289 759504080 758490026 757737339 756877959 755562425
$$ packed form
2555.6G65766978m361570m932820n039394n013287m654706l619373k503574j854837
2572G33787417j339316q41618n64575m4524R83357J685977J569688J207173R03547
2590.3G37347126N67794N95867R81272Q38279j2457q86381j660227k374649k432764
2608.7G32963860j744509j008630m40895k8253l02255j310825k173007k491414k442062
2627G21022010j670361O9738K097368L824294N295932O249368O244242N609632M755676
2645.4G53497899L538668K250671J571298J340925J099051J136362J475275J446604
2661.7G67356753J094163R06169N85199o3897m87089o21259r10163j143575j028657
2680.1G65687644j067459j416266j434684j162946j102209j014054p52687q59380j315534
$$ plain form
2698.4 755562425 754050076 752441168 750463903 748274446 746162891 743885577 741356671 738994718
2714.7 738994718 736885428 734846354 733107924 731871307 730852425 729864478 728986323 727980554 726599395
2733.1 726599395 725183070 723896146 722307742 720331311 718295932 716211557 714062750 712130249
2749.4 712130249 710420072 708672941 706932902 705276072 703415751 701268077 699140668 697011530
2765.7 697011530 694584131 691886961 688969851 685582638 681712627 677689910 673587084 669320405
2782 669320405 665081203 660960197 656757593 652484298 648326099 644192994 639998198 635885239 631772757
2800.4 631772757 627470851 623132050 618933141 614699364 610330045 606088579 602108419 598337352
2816.7 598337352 594896674 591779053 588730454 585763812 583135486 580878735 578892589 577262521
$$ packed form
2698.4G55562425j512349j608908j977265k189457k111555k277314k528906k361953
2714.7G38994718k109290k039074j738430j236617j018882r87947q78155j005769j381159
2733.1G26599395j416325j286924j588404j976431k035379k084375k148807j932501
2749.4G12130249j710177j747131j740039j656830j860321k147674k127409k129138
2765.7F97011530k427399k697170k917110l387213l870011m022717m102826m266679
2782F69320405m239202m121006m202604m273295m158199m133105m194796m112959m112482
2800.4F31772757m301906m338801m198909m233777m369319m241466l980160l771067
2816.7E98337352l440678l117621l048599k966642k628326k256751j986146j630068
$$ plain form
2833 577262521 576037228 575029314 574078262 573229074 572568476 572108805 571918428 572032034 572398186 573010862
2853.4 573010862 573756158 574350655 574628770 574733555 574852645 574923873 574787438 574323714 573395371 572051167
2873.8 572051167 570836067 570479989 571314514 573322892 576278090 579677224 583048642 586159170 588870704
2892.2 588870704 591332018 593985975 596907198 599684894 602018654 603738725 604470432 604148328 603567839
2910.5 603567839 603521764 603867888 604099572 603918672 603176534 602392316 602966189 606042802 611204684
2928.9 611204684 616830885 621692538 625643015 629348874 633658886 638655663 643724501 648465455
2945.2 648465455 652656496 656020105 658650041 660754502 662101984 662561059 662719786 663382173 664650202
2963.6 664650202 665800452 665506005 661698580 652672648 640502751 631146908 627211332 625726998
$$ packed form
2833E77262521j225293j007914r51052q49188o60598m59671j90377J13606L66152O12676
2853.4E73010862P45296N94497K78115J04785J19090P1228j36435m63724r28343j344204
2873.8E72051167j215100l56078Q34525K008378K955198L399134L371418L110528K711534
2892.2E88870704K461314K653957K921223K777696K333760J720071P31707l22104n80489
2910.5F03567839m6075L46124K31684j80900p42138p84218N73873L076613N161882
2928.9F11204684N626201M861653L950477L705859M310012M996777N068838M740954
2945.2F48465455M191041L363609K629936K104461J347482M59075J58727O62387J268029
2963.6F64650202J150250k94447l807425r025932j2169897r355843l935576j484334
$$ plain form
2979.9 625726998 626106024 631695688 642705917 655225635 666064024 674448609 680857539 685942411
2996.2 685942411 689959407 693164110 695969522 698368132 700241745 701843083 703266382 704374731
3012.5 704374731 705368340 706473291 707453489 708130121 708689034 709169388 709510326 709971905 710743487
3030.9 710743487 711624384 712554038 713771880 715185642 716402471 717338383 718017399 718415856 718845248
3049.2 718845248 719567955 720292568 720699072 720918179 721234679 721708238 722347081 723299265 724509776
3067.6 724509776 725897670 727586389 729339123 730813801 732251108 734012306 736094534 738404214
3083.9 738404214 740824819 743050158 744876802 746573627 748482287 750514448 752480686 754303038
3100.2 754303038 755800307 756974459 758152306 759326577 760180116 760975778 762133837 763310909 764126182
$$ packed form
2979.9F25726998L79026N589664J1010229J2519718J0838389Q384585O408930N084872
2996.2F85942411M016996L204703K805412K398610J873613J601338J423299J108349
3012.5G04374731R93609J104951R80198O76632N58913M80354L40938M61579P71582
3030.9G10743487Q80897R29654J217842J413762J216829R35912O79016L98457M29392
3049.2G18845248P22707P24613M06504K19107L16500M73559O38843R52184J210511
3067.6G24509776J387894J688719J752734J474678J437307J761198K082228K309680
3083.9G38404214K420605K225339J826644J696825J908660K032161J966238J822352
3100.2G54303038J497269J174152J177847J174271Q53539P95662J158059J177072Q15273
$$ plain form
3118.6 764126182 764677167 764949143 764959693 765069067 765359521 765468240 765470922 765863180 766667724 767576098
3139 767576098 768543005 769633830 770697951 771700263 772846639 774018228 774850905 775390506 775812566
3157.3 775812566 776018858 776115358 776264131 776236892 775951922 775634885 775219202 774548233 773851514 773247719
3177.7 773247719 772509396 771676064 771027923 770468175 769816101 769281268 768996477 768828511 768804133 769043803
3198.1 769043803 769432604 769832373 770324767 770852625 771157146 771309912 771487892 771497130 771245182 770938873
3218.5 770938873 770558596 769958198 769271672 768563509 767740667 767012179 766528130 765990138 765313566 764787197
3238.9 764787197 764372706 763854861 763354361 762892663 762263298 761611581 761240959 761001766 760622084 760253012
3259.3 760253012 760009229 759709120 759356976 759176016 759104550 758810222 758363485 757988453 757555187 757102430
$$ packed form
3118.6G64126182N50985K71976J0550J09374K90454J08719K682L92258Q04544R08374
3139G67576098R66907J090825J064121J002312J146376J171589Q32677N39601M22060
3157.3G75812566K06292R6500J48773k7239k84970l17037m15683o70969o96719o03795
3177.7G73247719p38323q33332o48141n59748o52074n34833k84791j67966k4378K39670
3198.1G69043803L88801L99769M92394N27858L04521J52766J77980R238k51948l06309
3218.5G70938873l80277o00398o86526p08163q22842p28488m84049n37992o76572n26369
3238.9G64787197m14491n17845n00500m61698o29365o51717l70622k39193l79682l69072
3259.3G60253012k43783l00109l52144j80960p1466k94328m46737l75032m33266m52757
$$ plain form
3279.7 757102430 756814122 756550372 756245553 756137788 756239355 756280005 756228566 756170511 755974352 755698562
3300.1 755698562 755650580 755743921 755594373 755134284 754497826 753750503 753022611 752382815 751668692 750785828
3320.5 750785828 749904335 749011993 747837543 746475041 745184004 743842065 742408872 741081774 739662707
3338.8 739662707 737878025 735963285 734117806 732245922 730396569 728545785 726431668 724087059
3355.2 724087059 721826851 719671845 717366755 715016127 712917089 710842848 708431840 705810487
3371.5 705810487 703276634 700888991 698651552 696567237 694466770 692354858 690477133 688900113
3387.8 688900113 687507272 686090946 684453964 682760715 681435168 680407166 679037869 677294016
3404.1 677294016 675870836 674898803 673958600 672968507 672030330 671095550 670267105 669684529 669168830
$$ packed form
3279.7G57102430k88308k63750l04819j07765J01567M0650n1439n8055j96159k75790
3300.1G55698562m7982R3341j49548m60089o36458p47323p27892o39796p14123q82864
3320.5G50785828q81493q92342j174450j362502j291037j341939j433193j327098j419067
3338.8G39662707j784682j914740j845479j871884j849353j850784k114117k344609
3355.2G24087059k260208k155006k305090k350628k099038k074241k411008k621353
3371.5G05810487k533853k387643k237439k084315k100467k111912j877725j577020
3387.8F88900113j392841j416326j636982j693249j325547j028002j369297j743853
3404.1F77294016j423180r72033r40203r90093r38177r34780q28445n82576n15699
$$ plain form
3422.5 669168830 668613970 668273330 668227971 668176711 668134034 668328583 668481171 668357372 668353438 668756604
3442.9 668756604 669341981 669946313 670598745 671241462 671880245 672701895 673751056 674835384 675843239
3461.2 675843239 676923513 678170443 679415286 680450082 681233585 682021916 683120549 684515655 685812175
3479.6 685812175 686781585 687766612 688951790 690113246 691282749 692576230 693836153 695070982 696424842
3497.9 696424842 697843313 699228227 700512707 701700687 702918708 704317927 705916345 707438648
3514.2 707438648 708796382 710311890 712047398 713764787 715332806 716807604 718267083 719804764
3530.6 719804764 721585870 723495960 725191355 726758301 728567481 730548143 732426167 734102905
3546.9 734102905 735633016 737179756 738848269 740585625 742321193 744166076 746158361 748046756
$$ packed form
3422.5F69168830n54860l40640m5359n1260m2677J94549J52588j23799l934M03166
3442.9F68756604N85377O04332O52432O42717O38783Q21650J049161J084328J007855
3461.2F75843239J080274J246930J244843J034796P83503P88331J098633J395106J296520
3479.6F85812175R69410R85027J185178J161456J169503J293481J259923J234829J353860
3497.9F96424842J418471J384914J284480J187980J218021J399219J598418J522303
3514.2G07438648J357734J515508J735508J717389J568019J474798J459479J537681
3530.6G19804764J781106J910090J695395J566946J809180J980662J878024J676738
3546.9G34102905J530111J546740J668513J737356J735568J844883J992285J888395
$$ plain form
3563.2 748046756 749811709 751753807 753708005 755413949 757197618 759281039 761420250 763593078
3579.5 763593078 766009033 768505692 770832539 773093820 775358975 777477920 779576778 781827569
3595.8 781827569 784089327 786272645 788517594 790733933 792674661 794530034 796523094 798487425
3612.1 798487425 800425351 802472115 804522574 806326449 807911932 809502661 811054587 812531769
3628.5 812531769 813895822 814965963 815851510 816786289 817794859 818703473 819586873 820654809 821752787
3646.8 821752787 822608113 823197365 823569894 823857725 824346960 824972689 825303614 825382531 825689137 826152802
3667.2 826152802 826355815 826517642 826776087 826652348 826298654 826310277 826603591 827036977 827758491 828692734
3687.6 828692734 829259455 829428256 829779267 830249012 830613136 831008375 831375480 831506014 831642628 831927061
$$ packed form
3563.2G48046756J764953J942098J954198J705944J783669K083421K139211K172828
3579.5G63593078K415955K496659K326847K261281K265155K118945K098858K250791
3595.8G81827569K261758K183318K244949K216339J940728J855373J993060J964331
3612.1G98487425J937926K046764K050459J803875J585483J590729J551926J477182
3628.5H12531769J364053J070141Q85547R34779J008570R08614Q83400J067936J097978
3646.8H21752787Q55326N89252L72529K87831M89235O25729L30925P8917L06606M63665
3667.2H26152802K03013J61827K58445j23739l53694J1623K93314M33386P21514R34243
3687.6H28692734N66721J68801L51011M69745L64124L95239L67105J30534J36614K84433
$$ plain form
3708 831927061 831995308 831735373 831612170 831739783 831947923 832242608 832592845 832761168 832784295 832941949
3728.4 832941949 833163798 833303988 833368897 833251357 832945764 832637906 832387149 832182109 832073510 832010746
3748.8 832010746 831868947 831660748 831600487 831665456 831590891 831415951 831379175 831435800 831453681 831446528 831420362
3771.2 831420362 831313610 831249654 831355631 831380188 831146359 830936193 830842197 830729365 830677509 830731988
3791.6 830731988 830717027 830642223 830687225 830660284 830415070 830274999 830252409 830124080 829994261 830044568 830087721
3814.1 830087721 829986036 830032349 830117822 829930305 829722941 829700053 829688728 829595089 829640508 829839826 829816639
3836.5 829816639 829583585 829450250 829245567 828923225 828803420 828947127 829026997 828774035 828493476 828342140
3856.9 828342140 828196466 828203797 828310311 828325570 828276098 828179300 828020751 827851653 827758193 827706397 827609718
$$ packed form
3708H31927061O8247k59935j23203J27613K08140K94685L50237J68323K3127J57654
3728.4H32941949K21849J40190O4909j17540l05593l07858k50757k05040j08599o2764
3748.8H32010746j41799k08199o0261O4969p4565j74940l6776N6625J7881p153k6166
3771.2H31420362j06752o3956J05977K4557k33829k10166r3996j12832n1856N4479
3791.6H30731988j4961p4804M5002k6941k45214j40071k2590j28329j29819N0307M3153
3814.1H30087721j01685M6313Q5473j87517k07364k2888j1325r3639M5419J99318k3187
3836.5H29816639k33054j33335k04683l22342j19805J43707P9870k52962k80559j51336
3856.9H28342140j45674P331J06514J5259m9472r6798j58549j69098r3460n1796r6679
$$ plain form
3879.3 827609718 827593923 827628314 827493489 827318132 827262700 827185452 827067912 827107668 827207565 827055395 826739013
3901.8 826739013 826553762 826437891 826345801 826378345 826429009 826369405 826322138 826322496 826233685 826124430 826111197
3924.2 826111197 826078415 825990558 825989187 826023459 825945020 825836599 825828075 825814307 825706303 825644910 825635374 825568914
3948.7 825568914 825518727 825483561 825330973 825153708 825110078 825091720 825003803 824912906 824790359 824640930 824596107
3971.1 824596107 824594915 824495971 824372590 824361384 824401021 824334502 824205935 824119627 824029505 823964894 824023187
3993.5 824023187 824071944 823955953
3997.6 823955953
$$ packed form
3879.3H27609718j5795L4391j34825j75357n5432p7248j17540L9756R9897j52170l16382
3901.8H26739013j85251j15871r2090L2544N0664n9604m7267L58q8811j09255j3233
3924.2H26111197l2782q7857j371L4272p8439j08421q524j3768j08004o1393r536o6460
3948.7H25568914n0187l5166j52588j77265m3630j8358q7917r0897j22547j49429m4823
3971.1H24596107j192r8944j23381j1206L9637o6519j28567q6308r0122o4611N8293
3993.5H24023187M8757j15991
3997.6H23955953
##END=$$ End of the data block
