##TITLE=B8M - Breno 2 $$ Begin of the data block
##JCAMP-DX=5.00 $$ ACD/SpecManager v 10.08
##SPECTROMETER/DATA SYSTEM=Alpha
##DATE=22 Jun 2015 10:50:00
##DATA TYPE=INFRARED SPECTRUM
##DATA CLASS=XYDATA
##ORIGIN=
##OWNER=
##NPOINTS=1765
##FIRSTX=399.76428223
##LASTX=3997.64306641
##MAXX=3997.64306641
##MINX=399.76428223
##MAXY=0.86436516
##MINY=0.53108591
##XFACTOR=1.0000000000
##YFACTOR=1.000000000000000e-9
##FIRSTY=0.82909065
##DELTAX=2.03961372
##XUNITS=1/CM
##YUNITS=ARBITRARY UNITS
##XYDATA=(X++(Y..Y))
399.8H29090655J257479K572417M475832O07848l790319j491308J451612j143456l089547
418.1H29941213J625717L838122l57867k542018O10411J991749j666844k899230Q36611
436.5H31377864J811683j791418k694547K94209m4167m058004n098283k963483j557172
454.8H15276682J167834O483734P841885L173172j832604j429379J491785L89934k448142
473.2H30114901j006484J517713q3685k513707r65595J259327m55141k552926j021088
491.5H24293315P44939j096725k982378j430869q6189k196908m158735l148079k730012
509.9H07208359n818665r626686j2288392j6616285k0234346j2666404P487535K4794579
526.2G62239695K4247050J3286888N620897R18985m784525r786606j3547062k1164298
$$ y = [829090655, 830348134, 832920551, 837396383, 838004231, 834213912, 832722604, 834174216, 833030760, 829941213, 831566930, 835405052, 835047185, 832505167, 833115578, 835107327, 833440483, 830541253, 831377864, 833189547, 831398129, 828703582, 828997791, 828953624, 824895620, 819797337, 816833854, 815276682, 816444516, 822928250, 830770135, 833943307, 832110703, 830681324, 832173109, 832563043, 830114901, 829108417, 830626130, 830542445, 828028738, 827063143, 828322470, 827867329, 825314403, 824293315, 825038254, 823941529, 820959151, 819528282, 819442093, 817245185, 813086450, 809938371, 807208359, 801389694, 791763008, 779474616, 762858331, 742623985, 729957581, 737445116, 762239695, 786486745, 799773633, 805394530, 806313515, 801528990, 791742384, 778195322, 757031024]
542.5G57031024k8503716j1952162K7965247M7354460L1247378J0511934K839625J107574
558.9H37601364j414776k664864q08358K07781j663983k340376j82748P20322j228571
577.2H28225791k083659k21729L76701j813113k827943j241147j058400l776491n496561
595.6H10083449n663812r623111j7538964j6563058K264380K2103071K2993565J2622595
611.9H20678115N844712K351165j242876k411664p68542p09474l903270p188856n809725
630.2H06839585K260745R006321O980002J973808j859009o376386q135080k181649
646.6H08508337O576597Q236110M500211K489030J248121j026034j639962O9976P02679
664.9H29665065j435757k896547j56999L82900j499652k082229n79357j96159j792073
$$ y = [757031024, 728527308, 716575146, 744540393, 791894853, 823142231, 833654165, 836493790, 837601364, 836186588, 833521724, 832713366, 832921147, 831257164, 828916788, 828734040, 829454362, 828225791, 826142132, 825920403, 826297104, 824483991, 821656048, 820414901, 819356501, 815580010, 810083449, 804419637, 794796526, 777257562, 760694504, 762958884, 785061955, 808055520, 820678115, 826522827, 828873992, 827631116, 825219452, 824450910, 823741436, 819838166, 812649310, 806839585, 809100330, 818106651, 825086653, 827060461, 825201452, 818825066, 810689986, 808508337, 815084934, 823321044, 827821255, 830310285, 831558406, 830532372, 828892410, 828962386, 829665065, 828229308, 825332761, 825175762, 825558662, 824059010, 821976781, 821397424, 821201265, 819409192]
683.3H19409192k226174p32303m25339k001643k472401j198411r26136k374769k847373
701.6H04204643j685620j653313l574014m230082j475453Q13245j049101l560007l396451
720G84393847l012240m234493m992962m175961l803670m759967n006016l508746k022028
738.3G48877764j620233o56247J705288L722132M291475M911780O502867P365763O401479
756.7G81502068N324662N429268N177199L448666J847982J533508P91431j712442m553675
775.1G98788667o869972j0470927j5581131j5237570o89029K0782053K9076934K0548523
791.4H20347548R246647K602696j380264l795386m543483n043745n578160n118966
807.7H06736887n398036p972896q724570n872369o969809j6285062k7189791k7645111
$$ y = [819409192, 817183018, 816450715, 816025376, 814023733, 811551332, 810352921, 809426785, 807052016, 804204643, 802519023, 800865710, 797291696, 793061614, 791586161, 792399406, 791350305, 787790298, 784393847, 781381607, 777147114, 772154152, 767978191, 764174521, 759414554, 754408538, 750899792, 748877764, 747257531, 746601284, 748306572, 752028704, 756320179, 761231959, 767734826, 775100589, 781502068, 786826730, 792255998, 797433197, 800881863, 802729845, 804263353, 805054784, 803342342, 798788667, 791918695, 781447768, 765866637, 750629067, 749940038, 770722091, 799799025, 820347548, 829594195, 832196891, 830816627, 827021241, 822477758, 817434013, 811855853, 806736887, 801338851, 793365955, 784641385, 778769016, 771799207, 755514145, 728324354, 700679243]
824G00679243j0050416J1893212J4361561k491534j9773185k3274243o226897K2173166
840.3F87290907L8967371L6007881K4425626J4375985Q283078M696667K308309K301991
856.6H18657815M856468O624102N375028K949536J825750J755356J193226K17020J28329
875H43582630P17461M76361n22495q02934l21567l72469q92520p14898r8885l88622
895.4H40662062j370370j541674r20356j048565k049625k527832k470077l461182n874693
913.7H19397688q521378j1422634j4747381j3601006j172423J6579390K3512065J6755283
930.1H26779604Q150697M461467K847314P60794o55354r51170j739860l875494o003201
948.4H29774797n300939j242876J907945J144886j326681l394842o110370r904861
$$ y = [700679243, 690628827, 702522039, 716883600, 714392066, 694618881, 671344638, 665117741, 687290907, 726258278, 762266159, 786691785, 801067770, 809350848, 814047515, 816355824, 818657815, 823514283, 830138385, 835513413, 838462949, 840288699, 842044055, 843237281, 843454301, 843582630, 844300091, 844776452, 844253957, 843451023, 843129456, 842756987, 841864467, 841149569, 841050684, 840662062, 839291692, 837750018, 836829662, 835781097, 833731472, 831203640, 828733563, 825272381, 819397688, 810876310, 799453676, 784706295, 771105289, 769932866, 786512256, 810024321, 826779604, 834930301, 839391768, 842239082, 842999876, 842344522, 841393352, 839653492, 835777998, 829774797, 824473858, 823230982, 825138927, 826283813, 824957132, 821562290, 815451920, 805547059]
964.7H05547059j0214746k032400Q687318J1487245P369280K946675K68281q71540
981.1H23187172r74834j156210j822591k215386k061546k115547k699197l127038l198028
999.4H03816795l754615n237997p125914r276867j2079954j1315942j552701N650342
1015.7G59123147j029671l597915P357180J2191534M724562l407478p587016j0055124
1032G57719219j3173104j7247438j9731224j8193841j4201462j0357022m951716N252064
1048.4F65115476J8991947K9910743L2536268K7763069K0218551J3160288P844031
1062.6H15540373M461348K460719J252412P24614O89626M44233l48329j221657j739204
1081H22264135k136469k694607l183841l407777l620624m161716n163669o879211r717286
$$ y = [805547059, 795332313, 793299913, 801987231, 813474476, 820843756, 823790431, 824058712, 823187172, 822212338, 821056128, 819233537, 817018151, 814956605, 812841058, 810141861, 807014823, 803816795, 800062180, 794824183, 787698269, 778421402, 766341448, 755025506, 753472805, 759123147, 758093476, 754495561, 761852741, 774044275, 778768837, 775361359, 767774343, 757719219, 744546115, 727298677, 707567453, 689373612, 675172150, 664815128, 659863412, 665115476, 684107423, 714018166, 746554434, 774317503, 794536054, 807696342, 815540373, 820001721, 822462440, 823714852, 824439466, 825129092, 825573325, 825224996, 824003339, 822264135, 820127666, 817433059, 814249218, 810841441, 807220817, 803059101, 797895432, 791016221, 781298935]
1099.4G81298935j4101326j8400550j6201675l924787O545723K44796j5386403j5705645
1115.7G04369068P138312K9391706L0279279J8069148P502258J961231L29852J353502
1132H00394356K447903J786590J26362j306474k455116l689587n057573n934000n138338
1150.3G81174123k279460Q95560K119720J175046o96063k555788m465461p234216j2156903
1168.7G55976558k0530045k6211679j0598302K3720741L9737642K5965512Q126437
1183G96186864J44542j967788k474904k745211l078759l468573l896177m390240m943847
1201.3G69365907n579055o289422p113874q016408q754074q911550q418739p446766
1217.7G08836019o080508m695833m455030o228924r371042j2611091j5307903j7669440
$$ y = [781298935, 767197609, 748797059, 732595384, 728670597, 735216320, 735461116, 720074713, 704369068, 711507380, 740899086, 771178365, 789247513, 796749771, 798711002, 799040854, 800394356, 802842259, 804628849, 804755211, 803448737, 800993621, 797304034, 792246461, 786312461, 781174123, 778894663, 779790223, 781909943, 783084989, 782388926, 779833138, 775367677, 768133461, 755976558, 735446513, 709234834, 698636532, 722357273, 762094915, 788060427, 796186864, 796331406, 794363618, 791888714, 789143503, 786064744, 782596171, 778699994, 774309754, 769365907, 763786852, 757497430, 750383556, 742367148, 733613074, 724701524, 716282785, 708836019, 702755511, 698059678, 693604648, 687375724, 678004682, 665393591, 650085688, 632416248]
1234F32416248k0079493k2564411k4022520k1606803j2609601K249062J8572629L1274080
1250.3E83629191L7418306L6617458K9829263J7822922J156985j4631211j8444658
1264.6F73398256o227374J1584580K1541119K1189928J7302751J5006841J4115274
1278.8G67911375J3019979J1246800R210408P287860N483746L737807K030731O914
1295.2H19935620k888501p191062j4263689k2039116j6855359M589439J7616152J0875702
1311.5G89779186R2507n713761q683443j0397256r254932m171372J898647N126059
1327.8G58675635N249560M334271M696309P204056R233236P387162K292454k267659
1344.1G96805024m811168n325436m264414l539861m949152q201719j2310743j6223013
$$ y = [632416248, 612336755, 589772344, 565749824, 544143021, 531533420, 533782482, 552355111, 583629191, 621047497, 657664955, 687494218, 705317140, 706474125, 691842914, 673398256, 667170882, 678755462, 700296581, 721486509, 738789260, 753796101, 767911375, 780931354, 792178154, 801388562, 808676422, 814160168, 817897975, 819928706, 819935620, 817047119, 809856057, 795592368, 773553252, 756697893, 761287332, 778903484, 789779186, 789871693, 784157932, 775474489, 765077233, 755822301, 751650929, 753549576, 758675635, 763925195, 768259466, 772955775, 780159831, 789393067, 796780229, 799072683, 796805024, 791993856, 786668420, 782404006, 778864145, 773914993, 765713274, 753402531, 737179518]
1360.4G37179518j5513063q580446o296337r030401j205147J5624106K3757577J7727554
1376.7G53663361Q219957J104057l924727p513285j2195468j6961634j5231132m256666
1393.1G02904463J0362565J4219523O868958o01887m981697q613706j1562884j2365341
1409.4F96229994q443653J811564J3000846K0628035K3421466J7109394P531643m45247
1425.7G70844042n801439p905543p381081o585539r050667j2142003j0894715r436548
1442G01646507q422375n319357M95613O330192Q742213Q696318R029209P428050K457917
1460.4G31084287p50720l011823m631877m978478o292820j0396361j4515162j6721308
1476.7F69785738j7449200j1064351Q487284K8206110K8737307J2592793l183842r136141
$$ y = [737179518, 721666455, 713086009, 706789672, 697759271, 696554124, 712178230, 735935807, 753663361, 761883318, 762987375, 759062648, 751549363, 739353895, 722392261, 707161129, 702904463, 713267028, 727486551, 734355509, 733753622, 728771925, 720158219, 708595335, 696229994, 687786341, 689597905, 702598751, 723226786, 746648252, 763757646, 771289289, 770844042, 765042603, 757137060, 749755979, 743170440, 734119773, 721977770, 711083055, 701646507, 693224132, 687904775, 688400388, 694730580, 703472793, 712169111, 721198320, 728626370, 731084287, 730333567, 727321744, 722689867, 717711389, 711418569, 701022208, 686507046, 669785738, 652336538, 641272187, 649759471, 677965581, 706702888, 719295681, 716111839, 706975698]
1493G06975698j2232363j7535627k1215081k1717012k1450519k6755154l5018206j9965828
1509.3E31085908K028704J6416490K5850296K9938340K6941657K2150338J4406443
1523.6F68818176O667316K052128j361012m170061o670951o165624m238427l735304
1539.9F51196241l188789l194212n167246q202493j0930539r597301m215241J717389
1556.2F08417809J0221958J9849837J9324720J9591510J9744873J7502725J5596152
1570.5G30249584J2356460J1467337J2689233R545148N600512L231585N52952k475142
1586.8G83217669n263925p793963j0904014j5195549j7728567j5039205r842277o308317
1603.2F95141852l333747o33121j108050k759040j256943L089309O654144N704700
$$ y = [706975698, 694743335, 677207708, 655992627, 634275615, 612825096, 586069942, 551051736, 531085908, 533114612, 549531102, 575381398, 605319738, 632261395, 654411733, 668818176, 675485492, 677537620, 676176608, 672006547, 665335596, 659169972, 654931545, 651196241, 648007452, 644813240, 639645994, 631443501, 620512962, 610915661, 606700420, 608417809, 618639767, 638489604, 657814324, 677405834, 697150707, 714653432, 730249584, 742606044, 754073381, 766762614, 776307762, 781908274, 785139859, 785692811, 783217669, 777953744, 770159781, 759255767, 744060218, 726331651, 711292446, 701450169, 695141852, 691808105, 691174984, 690066934, 687307894, 686050951, 689140260, 695794404, 701499104]
1619.5G01499104L310979R70662k144218n573094q288085q927822j0154248j5080034
1635.8F55613244j6853095j4063239j1175453o414712n38707L007412J158834p102728
1652.1F03631556k1322846k0017207j1178851N60641J7632246K9300809K8887034K7289211
1668.4F54782593K5071204J8247068J4984310J3803303J0775864R082496R355128J0225356
1684.7G66327322Q078098O505012O729544O037950N757213N614221M863083M291117
1701.1H14203560L001213K477169K675474K301276K048969K275467K535284K255082
1717.4H33773494J513302J499295J886428J884460J523197J524508J555860J073241
1733.7H46233785L47674M16696Q18908O23644J40846Q1181K52485j5378l12805k6047
$$ y = [701499104, 704810083, 705780745, 703636527, 698063433, 689775348, 680847526, 670693278, 655613244, 638760149, 624696910, 613521457, 607106745, 606568038, 609575450, 610734284, 603631556, 582308710, 562291503, 551112652, 551673293, 569305539, 598606348, 627493382, 654782593, 679853797, 698100865, 713085175, 726888478, 737664342, 746746838, 756101966, 766327322, 774405420, 780910432, 787639976, 793677926, 799435139, 805049360, 809912443, 814203560, 817204773, 819681942, 822357416, 824658692, 826707661, 828983128, 831518412, 833773494, 835286796, 836786091, 838672519, 840556979, 842080176, 843604684, 845160544, 846233785, 846581459, 846998155, 847817063, 848440707, 848581553, 848662734, 848915219, 848899841, 848587036, 848560989]
1754.1H48560989L75152M67419N97239J160025J592815J452625J087546R29177P43151
1772.4H56966138J31011k66671R0241O68407O52790K56538K64049N71489M49836j3709
1792.8H59770119k1457L37123K83361m5896K5630L12865J68860k48730j99735K65896
1813.2H60648036L78132M8995N9K89739K96652J6510J03534M72009M12643J10924J92702
1835.7H62969935N20647M74691R9778l6895J78695J58309j63435k92004k35855o37949
1856.1H63035917j720190k742827k693355j234710M17471Q77738K38061p04169j814187
1874.4H53659749l036499m119098m536510k816617J246929M822016N466759L811717
1890.7H54498446K038121J252532P14243j21892o90818m50313K34187O05881O36459
$$ y = [848560989, 848936141, 849403560, 850000799, 851160824, 852753639, 854206264, 855293810, 856222987, 856966138, 857097149, 856830478, 856920719, 857589126, 858241916, 858498454, 858762503, 859333992, 859783828, 859770119, 859748662, 860085785, 860369146, 860323250, 860348880, 860661745, 860830605, 860581875, 860382140, 860648036, 861026168, 861075163, 861075222, 861364961, 861661613, 861678123, 861781657, 862253666, 862666309, 862777233, 862969935, 863490582, 863965273, 864065051, 864028156, 864206851, 864365160, 864201725, 863909721, 863673866, 863035917, 861315727, 858572900, 855879545, 854644835, 855062306, 855940044, 856178105, 855473936, 853659749, 850623250, 846504152, 841967642, 839151025, 840397954, 845219970, 850686729, 854498446, 856536567, 857789099, 858503342, 858381450, 857690632, 857240319, 857474506, 858080387, 858716846]
1909.1H58716846P10427P01070M06206J75357K67744K91824J192k24709j21713k2888
1929.5H60901356k22981m63307l72052j23740j04665k77698l70980m07219n86509p50006
1949.9H57222199o61313n74231q53479j277030j301527q40127k90275J17719M83632
1968.3H52025568P59423P34866N10037M35412N33044M95672K94090K34186L69549L29077
1988.7H56720924L2425j58727j37746k05934m45485n31972l92377l94345o79671r15110
2009H52891982r33171j021862j267969j246274p30038j59800j967J96934J046241J667678
2029.4H50441754J350760R23634Q88944Q08656L93450n96k7955L4512j62364l50236
2049.8H54300559j56105J49131J03593j33336j26839L636j23560l68178l17872j34229
$$ y = [858716846, 859427273, 860128343, 860534549, 860709906, 860977650, 861269474, 861270666, 861045957, 860924244, 860901356, 860678375, 860215068, 859843016, 859719276, 859614611, 859336913, 858965933, 858558714, 857972205, 857222199, 856560886, 855986655, 855133176, 853856146, 852554619, 851714492, 851424217, 851541936, 852025568, 852784991, 853519857, 854029894, 854465306, 854998350, 855494022, 855788112, 856022298, 856391847, 856720924, 856753349, 856594622, 856456876, 856250942, 855805457, 855273485, 854881108, 854486763, 853807092, 852891982, 851958811, 850936949, 849668980, 848422706, 847692668, 847532868, 847530901, 847727835, 848774076, 850441754, 851792514, 852716148, 853605092, 854413748, 854807198, 854806602, 854778647, 854813159, 854650795, 854300559, 854144454, 854293585, 854397178, 854263842, 854137003, 854140639, 854017079, 853648901, 853331029, 853196800]
2070.2H53196800k31803m69684l95894j14859j41620l85404l23295l6180J3113n1797
2090.6H51059377J97947N73099N26011J58429L6061J74761P6115k66135k75671J24156
2111H52384150L34084J29700L4392K55108L07440O6459k861J90080J81436j51574l06786
2133.5H53421628p8618k1160l75986o03020m19378k61724l62218k97248R7930L04461
2153.9H51404667Q6546n1320J67907L05295N2630j91986o6221J02818r0539l56377
2174.3H51363420k78234j28031k32219l00527n3167J57475k6524k54631p6473K10345
2194.6H50381434J40071j4305J57058L48330J36196j54912o0320J20401p2717l72172
2215H50609064l32296j83940l45826n76019l93748l815J11878P6294K10523L06964
$$ y = [853196800, 852964997, 852495313, 852099419, 851984560, 851842940, 851457536, 851134241, 851098061, 851111174, 851059377, 851257324, 851830423, 852356434, 852514863, 852550924, 852725685, 852801800, 852535665, 852259994, 852384150, 852718234, 852847934, 852882326, 853137434, 853444874, 853511333, 853508472, 853698552, 853879988, 853728414, 853421628, 853343010, 853321850, 852945864, 852342844, 851923466, 851661742, 851299524, 851002276, 851100206, 851404667, 851491213, 851439893, 851607800, 851913095, 851965725, 851773739, 851707518, 851810336, 851719797, 851363420, 851085186, 850957155, 850724936, 850424409, 850371242, 850528717, 850502193, 850247562, 850171089, 850381434, 850521505, 850507200, 850664258, 851012588, 851148784, 850993872, 850933552, 851053953, 850981236, 850609064, 850276768, 850092828, 849747002, 849170983, 848777235, 848773420, 848885298, 848961592, 849172115, 849479079]
2235.4H49479079M6313k90990k88665j20282j55568k49863p0751J85311R4116k02060
2255.8H48426640k06590J5259j8597k68101k84553r0480j35243m09782m74393l24905
2276.2H46229255l54171n81204o01590l04640j07526k40088m16696m59254m57227k86281
2296.6H42420578K07186O56247N68092P0572k42412j47760m1306j73450l12567l33786
2317H42671394m34160o32703o05285k91348p2420j64568k62678r4235q94j44183j83881
2339.5H39785039M7207L52562N60224M94182J04785l50475p45297j022756r38356n79357
2359.9H37707758l65794k24411J30296M89950N53429M25994L60608L60728K52425J08004
2380.2H39798987J67668L53396L19838M3094j66356k41161l76582n28514m30167r5904
$$ y = [849479079, 849525392, 849234402, 848945737, 848825455, 848669887, 848420024, 848349273, 848534584, 848628700, 848426640, 848220050, 848235309, 848216712, 847948611, 847664058, 847573578, 847438335, 847028553, 846554160, 846229255, 845875084, 845293880, 844692290, 844387650, 844280124, 844040036, 843623340, 843164086, 842706859, 842420578, 842627764, 843284011, 843852103, 843922675, 843680263, 843532503, 843491197, 843317747, 843005180, 842671394, 842237234, 841604531, 840999246, 840707898, 840635478, 840470910, 840208232, 840113997, 840113103, 839968920, 839785039, 839832246, 840184808, 840745032, 841239214, 841343999, 840993524, 840248227, 839225471, 838287115, 837707758, 837341964, 837117553, 837247849, 837737799, 838291228, 838717222, 839077830, 839438558, 839690983, 839798987, 839966655, 840320051, 840639889, 840682983, 840516627, 840275466, 839898884, 839370370, 838940203, 838844299]
2400.6H38844299Q8692l0756j34051m3928L3676J2815Q3506K44856K52605Q1062j2517
2423.1H39420259O3837N1736j49488k67744j51754k4914j03176k24471j81973j61290
2443.5H38271022l56615n53965n46038m84944n35309n66125m22835l02136m11213n02407
2463.9H33589435k87831P5817K78175L48866M41849M38511K56956J91510M32253N97477
2484.3H36363018L57568j4305j52111j66655l31998n00202m00186j69575r1910j20521
2504.7H34773123m1723Q4341M4047q5711p3195j2159j59740m28856n07355l99291l95596
2527.1H32797885m77016l72648j77205j98841l35991k35141M4048J40965N2035P4327
2547.5H31312418J95384J17540j56343k92778k22861k26379l45826l30329j76549j56462
$$ y = [838844299, 838932991, 838902235, 838768184, 838724256, 838757932, 838770747, 838854253, 839099109, 839351714, 839432776, 839420259, 839484096, 839535832, 839386344, 839118600, 838966846, 838941932, 838838756, 838614285, 838432312, 838271022, 837914407, 837360442, 836814404, 836329460, 835794151, 835228026, 834805191, 834503055, 834091842, 833589435, 833301604, 833377421, 833655596, 834004462, 834446311, 834884822, 835141778, 835333288, 835765541, 836363018, 836720586, 836706281, 836554170, 836387515, 836055517, 835555315, 835155129, 834985554, 834893644, 834773123, 834731400, 834815741, 834859788, 834774077, 834700882, 834688723, 834528983, 834100127, 833592772, 833193481, 832797885, 832320869, 831948221, 831771016, 831572175, 831236184, 831001043, 831045091, 831186056, 831238091, 831312418, 831507802, 831625342, 831468999, 831176221, 830953360, 830726981, 830381155, 830050826, 829874277, 829717815]
2567.9H29717815k18093k7478L48389M48525J56939j05858j29759j99676m26054m51445
2588.3H29113305j27614J54972J67251J26958J51574M4465k60114n01037n43177n70119
2608.7H27756464o87122p04944n08964l45707m02927m24207j25587K55704L85762M16398
2629.1H25614870N84364P19070O08623M46260M05848L15666Q3804p3194n7519j02460
2649.5H28545332k96354m32492l71217k76387l47257m33266l75152l29256m35173n34177
2669.9H24714601m82023m46498m89056l57986J5676L53933M55558M58717N27859N01931
2690.3H25252712K23338m8697p0333n2691k28405m14311l93272l61443n23388p16090
2710.7H22667420p49886o88613n79655l23057R298J05739j73092n68747p97511r47237
$$ y = [829717815, 829499722, 829472244, 829820633, 830269158, 830426097, 830320239, 830190480, 829990804, 829564750, 829113305, 828985691, 829140663, 829307914, 829434872, 829586446, 829630911, 829370797, 828869760, 828326583, 827756464, 827069342, 826364398, 825855434, 825509727, 825106800, 824682593, 824557006, 824812710, 825198472, 825614870, 826199234, 826918304, 827526927, 827973187, 828379035, 828694701, 828778505, 828705311, 828647792, 828545332, 828248978, 827816486, 827445269, 827168882, 826821625, 826388359, 826013207, 825683951, 825248778, 824714601, 824232578, 823786080, 823297024, 822939038, 822954714, 823308647, 823764205, 824222922, 824750781, 825252712, 825476050, 825427353, 825357020, 825304329, 825075924, 824661613, 824268341, 823906898, 823383510, 822667420, 821917534, 821228921, 820649266, 820326209, 820335507, 820441246, 820268154, 819699407, 818901896, 817954659]
2731.1H17954659j111626j046837p01427l30746L2484M71831Q07821P53582L42071
2749.4H17171812q1718k83182l65793n23985o69479o40512o03258p76172j060128j285613
2769.8H10881972j400709j285136q29100k50936k5332k87831o93202r79721j222789
2788.2H03907216j583696j975536k181888k198279k141773j951516j449406p24852
2804.5G89700270j2279O22630J137197J456023J549065J435637J167834Q09073M42505
2822.8G98307955J02461k05696m97103q56399j256526j523435j660287j898349k221167
2841.2G88291454k405226k494514k465188k052725j359761r70959j248598j829803
2857.5G73464680k109707j749456p60078J94251K21611o60658j723528k656758l452122
$$ y = [817954659, 816843033, 815796196, 815094769, 814764023, 814796507, 815268338, 816076159, 816829741, 817171812, 817090094, 816806912, 816441119, 815917134, 815247655, 814607143, 814003885, 813227713, 812167585, 810881972, 809481263, 808196127, 807367027, 807116091, 807090759, 806802928, 806109726, 805130005, 803907216, 802323520, 800347984, 798166096, 795967817, 793826044, 791874528, 790425122, 789700270, 789687991, 790310621, 791447818, 792903841, 794452906, 795888543, 797056377, 797865450, 798307955, 798410416, 798204720, 797707617, 796851218, 795594692, 794071257, 792410970, 790512621, 788291454, 785886228, 783391714, 780926526, 778873801, 777514040, 776543081, 775294483, 773464680, 771354973, 769605517, 768845439, 769039690, 769261301, 768600643, 766877115, 764220357, 760768235]
2875.9G60768235l815711l476620k469301j068532L84211J761198K980948L714144
2892.2G58778572L627777K763212J542747M11153m75228j272976k247811l459036m618704
2910.5G55049706n275608n260706n000114n276203o483257p856905p554114l869653
2926.8G08473146K566397Q197308R952426Q097589N047559L275872L956496N835116
2943.2G55401909O288231M449367J836837n4598j031041j463175j649857j781642j800418
2961.5G60195613j571059j354695j783371l343224n986273r573699j3755559j6204238
2977.8G06623495j2867391l196419O185532Q544564O246746O357431R823620J2033463
2994.2G39751041J0946453Q298814N740523L730834K222717J164257O04987M40359
$$ y = [760768235, 756952524, 753475904, 751006603, 749938071, 750322282, 752083480, 755064428, 758778572, 762406349, 765169561, 766712308, 767123461, 766648233, 765375257, 763127446, 759668410, 755049706, 749774098, 744513392, 739513278, 734237075, 727753818, 719896913, 712342799, 708473146, 711039543, 719236851, 729189277, 737286866, 742334425, 745610297, 749566793, 755401909, 761690140, 766139507, 767976344, 767921746, 766890705, 765427530, 763777673, 761996031, 760195613, 758624554, 757269859, 755486488, 752143264, 746156991, 736583292, 722827733, 706623495, 693756104, 690559685, 696745217, 705289781, 711536527, 717893958, 727717578, 739751041, 750697494, 758996308, 764736831, 768467665, 770690382, 771854639, 772459626, 772899985]
3010.5G72899985M10736L42607K46644J31071l7432k73347o00993r59337j259088j524032
3030.9G69376814j799225k131701k555788k954602l127575k980232k701938k585113
3047.2G48540640k592981k590597k634227k667487k586245k440095k277672k068758
3063.5G28682578j781524j503527j263022p78675K20895J555204K736330L512144L925026
3081.9G35305429L867805L212809K203643J141668N5969j039923j906812k042293j039446
3100.2G39758849O31035J725316J536786M66764p32422j576841j978576k203345k551496
3118.6G35076070l086329l601372l773808l471673k684236j382708K67804J856386
3134.9G19200134K944947L311872L037572K450764J847446J289010P93934L98099m0531
$$ y = [772899985, 773310721, 773653328, 773899972, 774031043, 773993611, 773720264, 773119271, 772159934, 770900846, 769376814, 767577589, 765445888, 762890100, 759935498, 756807923, 753827691, 751125753, 748540640, 745947659, 743357062, 740722835, 738055348, 735469103, 733029008, 730751336, 728682578, 726901054, 725397527, 724134505, 723355830, 723576725, 725131929, 727868259, 731380403, 735305429, 739173234, 742386043, 744589686, 745731354, 745787323, 744747400, 742840588, 740798295, 739758849, 740389884, 742115200, 743651986, 744118750, 743386328, 741809487, 739830911, 737627566, 735076070, 731989741, 728388369, 724614561, 721142888, 718458652, 717075944, 717343748, 719200134, 722145081, 725456953, 728494525, 730945289, 732792735, 734081745, 734875679, 735273778, 735233247]
3153.2G35233247m58002n89073o20663q05199j043916j239061j422763j630962j843452
3171.6G25580156k052128k286792k550483k786517k923548k934039k821267k522766
3187.9G04702616j885951q35061M21107J456261J876056J568198Q83162K78950j29700
3206.3G08335638m05312n68509p35819j014352j336634j638472j901329k110600k343774
3224.6F96280837k638161k919972l170431l513097m064620m600942m866958m923880
3240.9F65582776m827201m593373m345417m066229l422498k241194q71897O7413J76608
3259.3F41458988m75347j411259k022445k019167j645386j456976j672924k075672
3275.6F28679812k377272k377987k132177j705944r61662J26660J388490K624154L644169
$$ y = [735233247, 734775245, 734186172, 733565509, 732760310, 731716394, 730477333, 729054570, 727423608, 725580156, 723528028, 721241236, 718690753, 715904236, 712980688, 710046649, 707225382, 704702616, 702816665, 701981604, 702402711, 703858972, 705735028, 707303226, 708186388, 708465338, 708335638, 707930326, 707361817, 706625998, 705611646, 704275012, 702636540, 700735211, 698624611, 696280837, 693642676, 690722704, 687552273, 684039176, 679974556, 675373614, 670506656, 665582776, 660755575, 656162202, 651816785, 647750556, 644328058, 642086864, 641214967, 641282380, 641458988, 640983641, 639572382, 637549937, 635530770, 633885384, 632428408, 630755484, 628679812, 626302540, 623924553, 621792376, 620086432, 619124770, 619251430, 620639920, 623264074, 626908243]
3294F26908243M328370M658997M706681M597008M432440M248440M049778L857732L702700
3312.3F65490389L535211L300548L076672K921999K796530K607286K313674K029180
3328.6F88071489J795292J543045J333118J201153R71496O44147L94404K15232J22369
3347F96291745J11580p2182m25815o08802n97060o25133p89225q99554p78198p12633
3367.4F90894723r77457j338064j403988j215398j094282j107216j155078j114190
3383.7F81489050r80794p97689n78701o23465r53257r80079n65291l52382p45655j175701
3404.1F73736036r91762n73397m70757n70834o74009o67870m72367l07083k94626k35975
3424.5F68477356m7802J17242J09315J31488K58743J61589p0155m0531J95384M18424
$$ y = [626908243, 631236613, 635895610, 640602291, 645199299, 649631739, 653880179, 657929957, 661787689, 665490389, 669025600, 672326148, 675402820, 678324819, 681121349, 683728635, 686042309, 688071489, 689866781, 691409826, 692742944, 693944097, 694915593, 695559740, 695954144, 696169376, 696291745, 696403325, 696331143, 695905328, 695296526, 694699466, 694074333, 693285108, 692385554, 691607356, 690894723, 689917266, 688579202, 687175214, 685959816, 684865534, 683758318, 682603240, 681489050, 680508256, 679710567, 679131866, 678508401, 677555144, 676575065, 676009774, 675657392, 674911737, 673736036, 672744274, 672170877, 671700120, 671129286, 670455277, 669787407, 669315040, 669007957, 668713331, 668477356, 668429554, 668546796, 668656111, 668787599, 669046342, 669207931, 669137776, 669097245, 669292629, 669711053]
3444.9F69711053N41509M96208M64320N88894P39694Q35001Q52883P72834Q10742J094461
3465.3F76907599J204789Q32677M41074N16057P90059J001478J065731Q52585P22050
3483.6F84334099Q78752R46700Q81612R16541J014054J084745J068175J050651J097083
3502F93272412R78529Q07643Q72493J067102J248181J235962J058042J024723J215696
3520.4G02780783J420140J295388J009107J035929J252472J372516J460850J483083
3536.7G13110268J377523J433373J628637J632988J381874J174927J231611J351118
3553G24322319J374483J370669J442849J553476J477480J381397J598239J718760J495659
3571.3G37735331J400411J534581J681447J858473J969874J841784J655519J628041
$$ y = [669711053, 670252562, 670748770, 671213090, 671801984, 672541678, 673376679, 674229562, 675002396, 675813138, 676907599, 678112388, 678945065, 679386139, 679902196, 680692255, 681693733, 682759464, 683612049, 684334099, 685212851, 686159551, 687041163, 687957704, 688971758, 690056503, 691124678, 692175329, 693272412, 694250941, 695058584, 695931077, 696998179, 698246360, 699482322, 700540364, 701565087, 702780783, 704200923, 705496311, 706505418, 707541347, 708793819, 710166335, 711627185, 713110268, 714487791, 715921164, 717549801, 719182789, 720564663, 721739590, 722971201, 724322319, 725696802, 727067471, 728510320, 730063796, 731541276, 732922673, 734520912, 736239672, 737735331, 739135742, 740670323, 742351770, 744210243, 746180117, 748021901, 749677420, 751305461]
3587.7G51305461J643121J568079J658321J909494J949191J773298J669288J639902
3604G65116155J594246J668393J760185J695573J534820J301527J363039J620710J381755
3622.3G79036403R62794Q61823J273275J501917J017034Q13723Q70764Q05319P17759
3640.7G87860811O94453O95408P42733R59695Q85248L16441J58370N23328N98610K71380
3661.1G93706477N6386J3113k4557N2690R0122j42395n2452K08199J07884P7129K03430
3683.5G94296026M10378P23779P09832K57075Q6307J64927J71601R7812O2882L6896
3703.9G97017515l8743k6226J52170L67940K53379K980l6120J8656K8014o795N0188
3726.4G97782958J28984J11401J53542K83301L39925O5148m29154n24819M5956K24769
$$ y = [751305461, 752948582, 754516661, 756174982, 758084476, 760033667, 761806965, 763476253, 765116155, 766710401, 768378794, 770138979, 771834552, 773369372, 774670899, 776033938, 777654648, 779036403, 779999197, 780861020, 782134295, 783636212, 784653246, 785466969, 786337733, 787143052, 787860811, 788555264, 789250672, 789993405, 790953100, 791838348, 792154789, 792313159, 792836487, 793435097, 793706477, 793762863, 793775976, 793751419, 793804109, 793894231, 793751836, 793699384, 793907583, 794015467, 794092596, 794296026, 794706404, 795430183, 796140015, 796397090, 796483397, 796648324, 796819925, 796917737, 796980619, 797017515, 796978772, 796952546, 797104716, 797472656, 797726035, 797729015, 797692895, 797711551, 797739565, 797732770, 797782958, 797911942, 798023343, 798176885, 798460186, 798800111, 798865259, 798436105, 797911286, 797957242, 798182011]
3746.7G98182011j14143j8358R2029q3923j14024L4988Q2850q6605j53899p3314O735
3769.2G97754347J0550j01268j05262O8605J11878j29402k48372j12713m7743r0658
3789.6G97109962j04428j00791l8207m6253r9421P8142l58j92821o2823q9824k63691
3812G96189487k51114J8239J10089l5345n2869j55747j97471j40428j13607Q047J16110
3834.4G95495391N7220q7678j82748j24872n4657j60158k82526l16918j35183J95265
3854.8G94403136J5199k28047j89841j8001P2837j00195j68860%k5273j23679k45512
3877.3G93391764k72751m9174N7817M8935q3267k25544m0651O3539j33634k19047j54316
3899.7G92383671j16110n5552l7133j53244k04861j47700j05083n7161k6822j17719
$$ y = [798182011, 798067868, 798049510, 798141539, 798057616, 797943592, 797978580, 798061430, 797974825, 797820926, 797747612, 797754347, 797764897, 797663629, 797558367, 797626972, 797738850, 797609448, 797361076, 797248363, 797200620, 797109962, 797005534, 796904743, 796866536, 796820283, 796720862, 796799004, 796798646, 796605825, 796543002, 796453178, 796189487, 795938373, 795956612, 796066701, 796031356, 795978487, 795822740, 795625269, 795484841, 795371234, 795379281, 795495391, 795552611, 795464933, 795282185, 795157313, 795102656, 794942498, 794659972, 794343054, 794207871, 794403136, 794418335, 794190288, 794000447, 793982446, 794055283, 793955088, 793786228, 793786228, 793760955, 793637276, 793391764, 793119013, 793069839, 793127656, 793176591, 793093324, 792867780, 792827129, 792890668, 792757034, 792537987, 792383671, 792267561, 792212009, 792174876, 792021632, 791816771, 791669071, 791563988, 791506827, 791480005, 791362286]
3920.1G91362286k39611k17319j23858j40309j52588n2154j1802n8055n1677k2114
3940.5G90292799L1353P8201O8545Q2910N6565m5955j22368j55509j74403j84238j91271
3962.9G89736629j48237m7624p212j9372r596k8074p2479r8944r6738r8288j67132
3985.4G88942933k30968k04384j17362j7404K2411k9564
3997.6G88365662
$$ y = [791362286, 791122675, 790905356, 790781498, 790641189, 790488601, 790436447, 790424645, 790366590, 790314913, 790292799, 790324152, 790402353, 790470898, 790553808, 790610373, 790564418, 790442050, 790286541, 790112138, 789927900, 789736629, 789588392, 789540768, 789533556, 789514184, 789504588, 789476514, 789404035, 789305091, 789208353, 789110065, 788942933, 788711965, 788507581, 788390219, 788372815, 788395226, 788365662]
##END=$$ End of the data block
