##TITLE=B8M - Breno 1 $$ Begin of the data block
##JCAMP-DX=5.00 $$ ACD/SpecManager v 10.08
##SPECTROMETER/DATA SYSTEM=Alpha
##DATE=22 Jun 2015 10:50:00
##DATA TYPE=INFRARED SPECTRUM
##DATA CLASS=XYDATA
##ORIGIN=
##OWNER=
##NPOINTS=1765
##FIRSTX=399.76428223
##LASTX=3997.64306641
##MAXX=3997.64306641
##MINX=399.76428223
##MAXY=0.86839050
##MINY=0.49766502
##XFACTOR=1.0000000000
##YFACTOR=1.000000000000000e-9
##FIRSTY=0.83765286
##DELTAX=2.03961372
##XUNITS=1/CM
##YUNITS=ARBITRARY UNITS
##XYDATA=(X++(Y..Y))
399.8H37652862L06606L192544j4543m742623m102647L03388K470851P25090q64863
418.1H34926665J533091K603233j276374m474640j717925K660990J494884l389358
434.4H32360566l725231J104832K541780j976430m946590j528620K021908l71873n062819
452.8H20417523m822254j231611j942336o918609o823600J321555Q611381P110059
469.1H15722108J245260J38044L084422K389431k368629m385650j253725R67324k333820
487.5H13204765o550789o030142l748178p079602j7220497k9084086l1925261p839918
503.8G03726292K8501391L6754370J7416596l067255k2401809l9636553l1456590Q416236
520.1F98252678M3941080M5904696K5360525R531617N475879K732754k412915m565895
$$ y = [837652862, 837959468, 841152012, 841137469, 836394846, 832292199, 832595587, 835066438, 835791528, 834926665, 836459756, 839062989, 837786615, 833311975, 831594050, 834255040, 835749924, 832360566, 828635335, 829740167, 832281947, 830305517, 825358927, 823830307, 825852215, 825480342, 820417523, 815595269, 814363658, 812421322, 805502713, 798679113, 800000668, 808612049, 815722108, 816967368, 817105412, 820189834, 822579265, 820210636, 815824986, 814571261, 815538585, 813204765, 806653976, 800623834, 796875656, 789796054, 772575557, 743491471, 711566210, 703726292, 732227683, 768982053, 786398649, 783331394, 760929585, 721293032, 689836442, 698252678, 742193758, 788098454, 813458979, 822990596, 828466475, 831199229, 828786314, 824220419]
536.4H24220419j128078J997054j39058l738999k634942J336395J470745k551854m196465
554.8H14635217r38773J807570l79502l910363k946913Q44717J128077k552926m115224
573.1H03571880j180291J362383q31187m430890l837883m32313j15216l810763o226301
591.5G84069419m437685k852082o224513j2094260j3123572m048764J1121571J9178092
607.8G71588206J4651299P147133K875567j681447p035256q863628o824255l965795
624.1G67891824l68833M301071P612109P294595L117383k159715l908217j728296p27475
642.5G81324446l775060o744206l834248L187538N287587K20359l956259l159523k033710
660.8G66516924l989756n790353n883455n592823n296052p019222q585929p086635
$$ y = [824220419, 823092341, 825089395, 824950337, 821211338, 818576396, 819912791, 821383536, 818831682, 814635217, 813696444, 815504014, 815124512, 811214149, 808267236, 809111953, 810240030, 807687104, 803571880, 802391589, 803753972, 802922785, 798491895, 794654012, 794221699, 794106483, 790295720, 784069419, 779631734, 776779652, 770555139, 758460879, 745337307, 741288543, 752410114, 771588206, 786239505, 793386638, 796262205, 794580758, 787545502, 778681874, 771857619, 767891824, 767522991, 771824062, 779436171, 786730766, 789848149, 787688434, 783780217, 782051921, 781324446, 777549386, 770805180, 766970932, 770158470, 775446057, 775666416, 771710157, 768550634, 766516924, 762527168, 756736815, 750853360, 745260537, 739964485, 732945263, 724359334, 717272699]
677.2G17272699n139768n519629o102443l335475K084910O061614O855428P232964
693.5G19410300R395421J1134743R250224M872561J711428n84841o490231j3273179
709.8G35426426j2090921l460408N098939Q428455N917132K434313J956820K251208
726.1G45961964O84977q57771N76020L951072N600214M659355M315138O537556Q717955
744.5G80146480P663548M760980L925979N494356N851865L337622J111329K045214
760.8H14337373L985226L196001M38035m01021J446307K403200K10643k377153k148092
779.1H21090519p18653k133488o616831j0785461j3847112j8719435k3754597j8368184
795.4G26146758J135110J7625511J2094855j3291180l6025464k7157843J2446880M1659772
$$ y = [717272699, 712132931, 706613302, 700510859, 697175384, 699260294, 705321908, 712177336, 719410300, 728805721, 739940464, 749190688, 754063249, 755774677, 755189836, 748699605, 735426426, 723335505, 719875097, 724974036, 733402491, 739319623, 741753936, 743710756, 745961964, 746646941, 745789170, 746365190, 750316262, 755916476, 760575831, 764890969, 771428525, 780146480, 787810028, 792571008, 796496987, 801991343, 807843208, 811180830, 812292159, 814337373, 818322599, 821518600, 821956635, 821555614, 823001921, 825405121, 825615764, 823238611, 821090519, 820371866, 818238378, 811621547, 800836086, 786988974, 768269539, 744514942, 726146758, 727281868, 744907379, 757002234, 743711054, 707685590, 680527747, 692974627, 734634399]
811.8G34634399L8514376K3406208J4050543Q396268K104223l450156o330311r496629
828.1H01828921j8100917l2635332m2187392l0193031L603875L6803008M6713531L5219609
844.4H01052272K0658970J0364473J480520n722821q336008l778338N767524J1855185
860.7H33341777J1182428Q771836O509245L073156L46362O99461K291500J651109p28727
879.1H67138147j328051N79238J757443K43724j687348j105130R29356J049876j018822
897.4H66558433k029539m73678R54926j46687k020001j631320M58837J038074p12990
915.8H61996055k118945j547754p52688j149952j282573K75076K199709K109051j33932
934.1H59594047j926541j235783M71532K68698j723230k645314j547038r06706k086163
$$ y = [734634399, 773148775, 796554983, 810605526, 819001794, 821106017, 817655861, 811325550, 801828921, 783728004, 751092672, 708905280, 678712249, 682316124, 719119132, 765832663, 801052272, 821711242, 832075715, 833556235, 827833414, 819497406, 815719068, 821486592, 833341777, 844524205, 853296041, 859805286, 862878442, 863224804, 863924265, 866215765, 867866874, 867138147, 865810096, 866389334, 868146777, 868390501, 866703153, 865598023, 866527379, 867577255, 866558433, 864528894, 864055216, 865010142, 864863455, 862843454, 861212134, 861670971, 862709045, 861996055, 859877110, 858329356, 857576668, 856426716, 855144143, 855419219, 857618928, 859727979, 859594047, 857667506, 856431723, 856903255, 857171953, 855448723, 852803409, 851256371, 850349665, 848263502]
952.5H48263502l037155k691447k586186m802585j0092795j5123844j3582766k644539
968.8G93702185J1080206J6325891J1828959N973696K381146o56783k676368k327502
985.1H35631430j073241j422882l192485l920078k835512k078891l353297n329967
1001.4H12425077n739093m624009l962696n384862p464111o237149j245916L557205
1017.8G81324446N668223N872965N197704L118992k60413k524078j575649J339138
1034.1G98161328L063619K676606K141476K759993L220320K202451Q89897J149059
1050.4H16264749K412736K413392P30157n21600N1856R65774L58999j071752j291930
1068.8H20312381j73629L07799p53403j724958j090884P4088j41621j493871j990139
$$ y = [848263502, 845226347, 842534900, 839948714, 835146129, 825053334, 809929490, 796346724, 793702185, 804782391, 821108282, 832937241, 838910937, 841292083, 840635300, 837958932, 835631430, 834558189, 833135307, 829942822, 826022744, 823187232, 821108341, 817755044, 812425077, 806685984, 802061975, 798099279, 792714417, 785250306, 779013157, 777767241, 781324446, 786992669, 792865634, 798063338, 801182330, 800921917, 798397839, 796822190, 798161328, 801224947, 803901553, 806043029, 808803022, 812023342, 814225793, 815115690, 816264749, 818677485, 821090877, 821821034, 821299434, 821351290, 822317064, 822676063, 821604311, 820312381, 820138752, 820446551, 819693148, 817968190, 816877306, 816951394, 816809773, 815315902, 813325763]
1087.1H13325763j130820o86943j901209l657163m423976m970193p468760j1942803
1103.4G77143896j3707757o654442O976486J5545785J3374031O888866K449274O3360
1119.8H02079499j168132l73006J987994L551781K805889P38859m97461k48909J7941
1138.1H08894455q75771j994967j944959j114428j157522k313078l045857k424002
1154.4G94023871j678109k341747l997207n168915o070852r218335j5922010j6265273
1170.7G33361423K597749K3170591K0296275N575776j983404k963304k761543l417611
1187.1G73875952m359663m511177m186631m651546o105244p411778p856369q263767
1203.4G26529777r501755j0932923j1545240j1544824j1779845j2376845j3498783
$$ y = [813325763, 812194943, 811508000, 809606791, 805949628, 801525652, 796555459, 789086699, 777143896, 763436139, 756781697, 763758183, 779303968, 792677999, 799566865, 802016139, 802079499, 800911367, 800538361, 802526355, 806078136, 808884025, 809622884, 809125423, 808876514, 808894455, 808018684, 806023717, 804078758, 802964330, 801806808, 799493730, 796447873, 794023871, 792345762, 790004015, 786006808, 780837893, 774767041, 765548706, 749626696, 733361423, 735959172, 759129763, 779426038, 785001814, 783018410, 780055106, 777293563, 773875952, 769516289, 765005112, 760818481, 756166935, 750061691, 742649913, 734793544, 726529777, 717028022, 706095099, 694549859, 683005035, 671225190, 658848345, 645349562]
1217.7F45349562j5728533j8308401j7796576j0699511J721144J3477266J8431842
1231.9F16446793J3413608J686692p590949r401262n072355L624618J1570513J2186885
1248.2F36864543N890548l510952j4326334k3300886k1377623k41101L1047821M9233735
1264.6F60279751M5919418L3158243K1807909J3743341Q412063M986882K965987L057599
1280.9G94331193M404426M581809L293097J297235j134693l228903m203618m375875
1297.2G94964671m230738l309249j446963l3259p22528l336370o279528q345365r674430
1315.6G57586241j0957539j2104631j2965739j3793826j2190640l285408J2041509
1329.8G04329967K3756505K4374485J7378807R286105L094435m73440k437710m469932
$$ y = [645349562, 629621029, 611312628, 593516052, 582816541, 584537685, 598014951, 616446793, 629860401, 631547093, 623956144, 614554882, 609482527, 613107145, 624677658, 636864543, 642755091, 639244139, 624917805, 601616919, 580239296, 579998195, 611046016, 660279751, 706199169, 739357412, 761165321, 774908662, 783320725, 788307607, 791273594, 794331193, 798735619, 803317428, 806610525, 807907760, 806773067, 803544164, 799340546, 794964671, 790733933, 787424684, 785977721, 785944462, 785221934, 781885564, 775606036, 767260671, 757586241, 746628702, 734524071, 721558332, 707764506, 695573866, 692288458, 704329967, 728086472, 752460957, 769839764, 779125869, 782220304, 781746864, 779309154, 774839222]
1346.2G74839222o780326q302748q695960q982301j0019660j1122405j1379838j1084736
1362.5F98471248j0851741j0675490q998215m407167J049220N456508R007573J2443542
1378.8F91495478J4916778J4761984J2714028J0370195P486165M483938K161384M8935
1395.1G58438885j512289k044499k226472l084182m669786n617380n983651o989300
1411.4G26311326q633018j0161221j2272536j5213430j5620649j5646637j6004681
1425.7F32759154j4902532j4223755j2945473j0573149r644746q450389n060554r62376
1442E55996180M870951J3183594K2244930K6848376K5834620K3181855K3892403K2974372
1458.3G19027281J3936221Q123815O532491N167722L022492J223386J87218k44677
$$ y = [774839222, 768058896, 759756148, 751060188, 742077887, 732058227, 720935822, 709555984, 698471248, 687619507, 676944017, 667945802, 663538635, 664587855, 670044363, 679051936, 691495478, 706412256, 721174240, 733888268, 744258463, 751744628, 756228566, 758389950, 758438885, 756926596, 754882097, 752655625, 749571443, 744901657, 739284277, 733300626, 726311326, 717678308, 707517087, 695244551, 680031121, 664410472, 648763835, 632759154, 617856622, 603632867, 590687394, 580114245, 570469499, 562019110, 556958556, 555996180, 560867131, 574050725, 596295655, 623144031, 648978651, 672160506, 696052909, 719027281, 732963502, 741087317, 747619808, 752787530, 755810022, 757033408, 757220626, 756975949]
1474.7G56975949j026392k636910m651367n985797o596982p971049j1053323j3879836
1491G03174293j4374971j7440141k5700867l1690657l2156944l0909538k7959466r177268
1507.3E13764441J5060842J4282525M635334M944741K0297110L7172616M5770705L6749899
1523.6F92678213K1837354J3646364P737398M132390J922846l50177k741754o044627
1539.9G32818007q521556r424627j1020124j2557745j4613688j6610801j8737138k0572722
1556.2F20759606k7585625l0533076j5147924l530562O820083K0366370L2044828L1203151
1572.6F34396851K8791308L0591131K3939550J5962124J2072265Q280575M696190J749277
1588.9G60479271j560568n698741j0482967j4901936j8615901k2599519k7825653l3002019
$$ y = [756975949, 755949557, 753312647, 748661280, 742675483, 736078501, 728107452, 717054129, 703174293, 688799322, 671359181, 645658314, 613967657, 581810713, 550901175, 522941709, 513764441, 528825283, 543107808, 547743142, 552687883, 572984993, 610157609, 655928314, 692678213, 714515567, 728161931, 735899329, 740031719, 741954565, 741604388, 738862634, 732818007, 724296451, 714871824, 703851700, 691293955, 676680267, 660069466, 641332328, 620759606, 593173981, 562640905, 547492981, 543962419, 550782502, 571148872, 603193700, 634396851, 663188159, 693779290, 717718840, 733680964, 745753229, 754033804, 758729994, 760479271, 758918703, 753219962, 742736995, 727835059, 709219158, 686619639, 658793986, 625791967]
1605.2F25791967l4200251k5917173q054137R099484K0900488K5614678J6900719O970584
1621.5F37106359K645612J935839J662493o56068l475368n451143p442415p486701
1637.8F18838608p186711q762955j1960566j9480706k5715529k1315575j7309487r442061
1654.1D97665018N986124J5476227K3029685L0052662L1057715K5446713K3134589
1668.4F51848733K2160650J7176151J5027821J4500618J1267126Q959591Q972824J0350287
1684.7G60263801Q154630N626440N422831M965305M798651M381537L657878M028141
1701.1H01299214L463745K579332K361178K129913K243042K276659J984834K052486
1717.4H20390403K166033J773536J088679L75033J42335P52569J202762J073420N58495
$$ y = [625791967, 591591716, 565674543, 557620406, 566719890, 587620378, 613235056, 630135775, 637106359, 639751971, 641687810, 643350303, 642694235, 639218867, 633767724, 626325309, 618838608, 611651897, 602888942, 590928376, 571447670, 545732141, 524416566, 507107079, 497665018, 503651142, 519127369, 542157054, 572209716, 603267431, 628714144, 651848733, 674009383, 691185534, 706213355, 720713973, 731981099, 740940690, 749913514, 760263801, 768418431, 774044871, 779467702, 784433007, 789231658, 793613195, 797271073, 801299214, 804762959, 807342291, 809703469, 811833382, 814076424, 816353083, 818337917, 820390403, 822556436, 824329972, 825418651, 825793684, 825936019, 826688588, 827891350, 828964770, 829523265]
1735.7H29523265K89381P60436J214504J276732J542449K140045K446771J863420P67350
1754.1H41824353N05328J101255J494110J424074J133800J326024J943529K023816
1770.4H52776289J508117J046061Q71718P88152L82543o2406J53601P91609R65298
1788.8H59220982O44922N68807P46548Q23140O11604K26676J18017L05593L72887J45197
1809.2H63784373l9756N9664J87039n5492n03242o67572l60071J7106n8174k25604
1829.6H62138271J01447N67198O38306L29137n4657k11299k95400r07243j990676k157926
1850H58157158n74768J446784K120852J548350Q67844L45588l23177j091182j539409
1868.3H60958040j655996j962245k258241j689255j57058J456558K314151K236008
$$ y = [829523265, 829812646, 830573082, 831787586, 833064318, 834606767, 836746812, 839193583, 841057003, 841824353, 842329681, 843430936, 844925046, 846349120, 847482920, 848808944, 850752473, 852776289, 854284406, 855330467, 856202185, 856990337, 857372880, 857310474, 857464075, 858255684, 859220982, 859865904, 860434711, 861181259, 862004399, 862616003, 862842679, 862960696, 863266289, 863639176, 863784373, 863744617, 863804281, 863991320, 863935828, 863432586, 862765014, 862404943, 862422049, 862363875, 862138271, 862239718, 862806916, 863445222, 863774359, 863719702, 863508403, 863213003, 862305760, 860315084, 858157158, 857582390, 859029174, 861150026, 862698376, 863566220, 863911808, 863588631, 862497449, 860958040, 859302044, 857339799, 855081558, 853392303, 853235245, 854691803, 857005954, 859241962]
1884.6H59241962J639128J062393O13213n1498q93057j630545k064585j743973l90112
1903H55782926J215875K054036K069890J557231P74980J93179J57177L15666Q0824
1921.3H64201784k62618k38299M2081J74522m2617l34263l04640m5716q822k46048
1941.7H62935364l81708k57492j12355j83701l53754l02911n4836J19k77042n67854
1962.1H60443830n64217l22461j34766j80841k65837j75476q9287j93239l07977j35839
1982.5H58073890J96040K81751O9797q3446N1617J78397l159k88189l56197k26915
2002.9H57893586j45376k51650l91364l65258l00348m64856q06153r46283p43270n67377
2023.3H52911651n46396l41773j32918j48296j53721p6473R9242L73364N04672K51889
$$ y = [859241962, 860881090, 861943483, 862556696, 862505198, 861612141, 859981596, 857917011, 856173038, 855782926, 856998801, 859052837, 861122727, 862679958, 863454938, 863648117, 863805294, 864120960, 864201784, 863939166, 863700867, 863742948, 863917470, 863874853, 863540590, 863235950, 863190234, 863181412, 862935364, 862553656, 862296164, 862183809, 862000108, 861646354, 861343443, 861288607, 861288726, 861011684, 860443830, 859879613, 859557152, 859422386, 859241545, 858975708, 858800232, 858710945, 858517706, 858209729, 858073890, 858269930, 858551681, 858621478, 858538032, 858589649, 858768046, 858764887, 858476698, 858120501, 857893586, 857748210, 857496560, 857105196, 856739938, 856439590, 855974734, 855168581, 854222298, 853479028, 852911651, 852365255, 852023482, 851890564, 851742268, 851588547, 851512074, 851611316, 851984680, 852489352, 852741241]
2043.7H52741241j82867l51309j47224R7692J48952J65641L16024M48466L25501J4543
2064.1H53576660j93357j65642j26838k45631l51429k31683P808J34885J17004Q4698
2084.5H52606475K02835L85225L55124J05858n1260N484Q3446l755j97053l12626l25620
2106.9H52854133l64006m93228n21958k57492J28627K78592J83284J26064K14755L01719
2127.3H52450490K30253O1631j609R0599J40011K6345j03354p2479K1100l6836k08557
2149.8H52597594k68459j35362j7882r4533k23517j94371p3909q1301k21610k70546
2170.2H51016104j65283q2911j61945l16024k99752r0599O7055J3411j21653j11580
2190.6H49746823J2994J6868j66952l09110k77281k10762k54631l61144l01898o0976
$$ y = [852741241, 852558374, 852207065, 852059841, 852157533, 852306485, 852472126, 852788150, 853236616, 853562117, 853576660, 853383303, 853217661, 853090823, 852845192, 852493763, 852262080, 852269888, 852404773, 852521777, 852606475, 852809310, 853194535, 853549659, 853655517, 853604257, 853609741, 853693187, 853689432, 853492379, 853179753, 852854133, 852490127, 851996899, 851474941, 851217449, 851346076, 851624668, 851807952, 851934016, 852148771, 852450490, 852680743, 852742374, 852740765, 852831364, 852971375, 852997720, 852894366, 852821887, 852842987, 852806151, 852597594, 852329135, 852193773, 852175891, 852081358, 851857841, 851663470, 851589561, 851508260, 851286650, 851016104, 850850821, 850767910, 850605965, 850289941, 849990189, 849899590, 849966645, 849980056, 849858403, 849746823, 849759817, 849776685, 849609733, 849300623, 849023342, 848812580, 848557949, 848196805, 847894907, 847833931]
2211H47833931P4923r894r0003J7524J47819P0274j45972k27928j03175k4319j59204
2233.4H47383976l17633k66373q3506m0949j78873k19345l4690J12056J4902j46091
2253.8H46223474j45197k3783j6987k00868l37958k59817j01268j20878l37184m55200
2274.2H44224334l18587j72854k30133k95878j96814q7857j20342k36571k19405L9339
2294.6H42385232K64883K14220N5670M6790J93000K92361K20954J08480J25051K10822
2315H44117463J75416J1385p8023q7380j93775l23594l51607l80516m03524l09884
2335.4H42175961k53320j86265O4910J91211k06828o60479m48048K35856O64592M51803
2355.8H42029393P0691k30789m01855m29988m05788l48926k86400l04580m38273n96642
$$ y = [847833931, 847908854, 847898960, 847808957, 847826481, 847974300, 848044574, 847898602, 847670674, 847567499, 847543180, 847383976, 847066343, 846799970, 846716464, 846675515, 846496642, 846277297, 846242607, 846354663, 846369565, 846223474, 846078277, 846054494, 846037507, 845836639, 845498681, 845238864, 845137596, 845016718, 844679534, 844224334, 843905747, 843732893, 843502760, 843206882, 843010068, 842922211, 842801869, 842565298, 842345893, 842385232, 842650115, 842864335, 842920005, 842966795, 843159795, 843452156, 843673110, 843781590, 843906641, 844117463, 844292879, 844304264, 844226241, 844138861, 843945086, 843621492, 843269885, 842889369, 842485845, 842175961, 841922641, 841736376, 841801286, 841992497, 841785669, 841125190, 840677142, 840912998, 841577590, 842029393, 842100084, 841869295, 841467440, 841037452, 840631664, 840282738, 839996338, 839691758, 839253485, 838656843]
2376.2H38656843o64890o51419o51300o58691o16372n08308m03106m22359n06699m81367
2396.6H33092332l69728l36289m43816n57721n23269m02332l33189l19422k68936j27554
2417H29410076L5346N6028p4506j47879j14202j36078k79367m73141o00160o28411
2437.4H27047706o95646q49843r28343q56637p44880o73949o26982n52475m35174l74436
2457.8H20309341m45843n23567m59611l55363l73721n02468o05106n68390m47631l83079
2478.1H15644562l58164k48611r6500o1572j73628l10779k76207N4359N52952R61423
2498.5H15687835J132727J088142Q81553N27084J65641Q643P3552K03133K71737K32637
2518.9H20272684P9155j63436m65393p44343q34465o99997n19454m38929m33028m22775
$$ y = [838656843, 837991953, 837340534, 836689234, 836030543, 835414171, 834905863, 834502757, 834080398, 833573699, 833092332, 832722604, 832386315, 831942499, 831384778, 830861509, 830459177, 830125988, 829806566, 829537630, 829410076, 829445422, 829501450, 829426944, 829279065, 829164863, 829028785, 828749418, 828276277, 827676117, 827047706, 826352060, 825502217, 824573874, 823717237, 822972357, 822298408, 821671426, 821118951, 820683777, 820309341, 819863498, 819339931, 818880320, 818524957, 818151236, 817648768, 817043662, 816475272, 816027641, 815644562, 815286398, 815037787, 814941287, 814879715, 814706087, 814395308, 814119101, 814173460, 814726412, 815687835, 816820562, 817908704, 818790257, 819317341, 819482982, 819491625, 819565177, 819768310, 820040047, 820272684, 820351839, 820188403, 819723010, 818978667, 818144202, 817444205, 816924751, 816485822, 816052794, 815630019]
2539.3H15630019m50790o47962r63748j166224j133263r66788q65459q94964r43839
2557.7H07596982r39787r45747r91583r84728q85069p92087q26120r75072j077116
2576G99179673r97722p84576o07490m87745k81632L9816L35395M90665N79656P51316
2596.4G98217356R59754J020909R18328Q05915P56621O67512M44770K09391J66715
2614.8H04167271L10301M14908L52323K58565K39134K04087O7055j57535l36588l87728
2635.2H05131793m71115p06136r36449r67026q66949q86023j055718j171291j152813
2653.5G96918273j123428j192451j262665j110971p22050l42727j06275J17779M04894
2671.9G91580379N90563N46157L63350K32458J96874R2566j31249l25263l80873l79682
$$ y = [815630019, 815179229, 814531267, 813567519, 812401295, 811268032, 810301244, 809435785, 808540821, 807596982, 806657195, 805711448, 804719865, 803735137, 802850068, 802057981, 801231861, 800256789, 799179673, 798181951, 797397375, 796789885, 796302140, 796020508, 796060324, 796395719, 796886384, 797466040, 798217356, 799177110, 800198019, 801116347, 801922262, 802678883, 803346395, 803791165, 804000556, 804167271, 804477572, 804892480, 805244803, 805503368, 805742502, 805946589, 806013644, 805856109, 805519521, 805131793, 804660678, 803954542, 803018093, 802051067, 801184118, 800298095, 799242377, 798071086, 796918273, 795794845, 794602394, 793339729, 792228758, 791506708, 791163981, 791057706, 791175485, 791580379, 792170942, 792717099, 793080449, 793312907, 793509781, 793602347, 793471098, 793145835, 792764962, 792385280]
2692.3G92385280m62472n95689o29783n27024m24981m35829m68433l90113k60591j88470
2712.7G88001895j42276o676K39968M75288N65111N14627M68910M97877N32866M89056
2733.1G91636646L95596L26633K46227R4473q4936j51515q4818q7440k96414n70774
2753.5G91423678p46250q76665j058161j259148j388967j408637j394093j454651j570046
2771.8G80267060j628757j654982j731158j798749j790463j717568j583040j385688
2788.2G66976655j154781q10981k12192N00560J025557J307845J466751J524389J474142
2806.5G72097945J341820J125157Q91626P16030N37694L26156J37628l5286k53916
2824.9G76884854n27501p61211q20399o99341n21540l88623l89695n82874r52780j458108
$$ y = [792385280, 791922808, 791327119, 790697336, 790170312, 789745331, 789309502, 788841069, 788450956, 788190365, 788001895, 787859619, 787852943, 788092911, 788568199, 789133310, 789647937, 790116847, 790614724, 791147590, 791636646, 792032242, 792358875, 792605102, 792699575, 792614639, 792463124, 792378306, 792290866, 791994452, 791423678, 790677428, 789800763, 788742602, 787483454, 786094487, 784685850, 783291757, 781837106, 780267060, 778638303, 776983321, 775252163, 773453414, 771662951, 769945383, 768362343, 766976655, 765821874, 765010893, 764798701, 765299261, 766324818, 767632663, 769099414, 770623803, 772097945, 773439765, 774564922, 775456548, 776172578, 776710272, 777036428, 777174056, 777138770, 776884854, 776357353, 775596142, 774775743, 774076402, 773554862, 773166239, 772776544, 772193670, 771240890, 769782782]
2845.3G69782782j911223j945377j465738q82327n83172n48840o33478q50022j194596
2863.6G59768009j511991j708746j770794j692474j517117j251280q46386l52204J07705
2882G49224722M68552P17402Q36015Q05974O82056N05328K14398j65761n27441q60274
2902.4G51900971j209974j609683k037764k459407k921581l359676l445804k952277
2918.7G31904805k129555j375496p54893j20938N43415J071036J415670J609981J597464
2937G33761489J442790J238048R44257N22793L4332l93033p12454j056254j404882
2955.4G34377086j533627j509548j537263j579881j492917j291991j135647j049697
2971.7G23246515r56416q33810o30557m29273m07755m41015l91245l61681m05073m97282
$$ y = [769782782, 767871559, 765926182, 764460444, 763578117, 762994945, 762446105, 761812627, 760962605, 759768009, 758256018, 756547272, 754776478, 753084004, 751566887, 750315607, 749469221, 749117017, 749224722, 749693274, 750410676, 751246691, 752052665, 752734721, 753240049, 753454447, 753288686, 752761245, 751900971, 750690997, 749081314, 747043550, 744584143, 741662562, 738302886, 734857082, 731904805, 729775250, 728399754, 727644861, 727523923, 728067338, 729138374, 730554044, 732164025, 733761489, 735204279, 736442327, 737386584, 737909377, 737943709, 737550676, 736838222, 735781968, 734377086, 732843459, 731333911, 729796648, 728216767, 726723850, 725431859, 724296212, 723246515, 722290099, 721456289, 720825732, 720396459, 719988704, 719547689, 719156444, 718794763, 718389690, 717892408]
2992.1G17892408n92291n84960n35369n78880o16908n60999n41866o51479p87675q97825
3012.5G11544156j064777j342058j676500j961172k150834k315104k545297k744078
3028.8F95744336k692163k200485j171589J90676J281500J497209P81893l73959j318038
3047.2F91739380j697480j739443j826107k024651k284407k401770k117157j542091
3063.5F76106274r53674o30498p47264j137554j534581j771450j876831k045930k278626
3081.9F63129866k469241k628029k712011k755821k867460k902508k752244k660156
3098.2F41382396k931833l403306l399968k566099j334012k98142M40895R50575J091063
3116.5F29931569Q30174L66807q9944m35293o68764q90076j156449j414657j620829
$$ y = [717892408, 717300117, 716715157, 716179788, 715600908, 714984000, 714423001, 713881135, 713229656, 712441981, 711544156, 710479379, 709137321, 707460821, 705499649, 703348815, 701033711, 698488414, 695744336, 693052173, 690851688, 689680099, 689870775, 691152275, 692649484, 693431377, 693057418, 691739380, 690041900, 688302457, 686476350, 684451699, 682167292, 679765522, 677648365, 676106274, 675152600, 674522102, 673774838, 672637284, 671102703, 669331253, 667454422, 665408492, 663129866, 660660625, 658032596, 655320585, 652564764, 649697304, 646794796, 644042552, 641382396, 638450563, 635047257, 631647289, 629081190, 627747178, 627449036, 627889931, 628840506, 629931569, 630761743, 631128550, 631038606, 630603313, 629934549, 629044473, 627888024, 626473367, 624852538]
3134.9F24852538j764715j910150k115547k269745k298534k317786k367497k441585
3151.2F07366979k629042k805829k635419j986921r49919K35200J211405J732409J806438
3169.6F01345301J620471J359642J107156Q91685O97792M90606L12626J95801O7890
3187.9F08088970j40369l29852m20868n03123n68092m89533k20120J85669O72578J185179
3208.3F07460439J629353J942098K114713K148092K062619J909494J707673J441300
3224.6F22415781J140416Q94844P63953O66618M48466J83463K3603q2910k14040l75450
3245F25864744n76913q01742r27866r10163p96854n25236m1008M95434R17375J191198
3265.4F23888969J301349J272618J042486O08444J58489k52664p06673j228333j706719
$$ y = [624852538, 623087823, 621177673, 619062126, 616792381, 614493847, 612176061, 609808564, 607366979, 604737937, 601932108, 599296689, 597309768, 596359849, 596595049, 597806454, 599538863, 601345301, 602965772, 604325414, 605432570, 606324255, 607022047, 607512653, 607825279, 608021080, 608088970, 607948601, 607618749, 607197881, 606694758, 606126666, 605637133, 605417013, 605602682, 606275260, 607460439, 609089792, 611031890, 613146603, 615294695, 617357314, 619266808, 620974481, 622415781, 623556197, 624451041, 625214994, 625881612, 626330078, 626513541, 626537144, 626454234, 626240194, 625864744, 625287831, 624486089, 623558223, 622648060, 621851206, 621325970, 621284962, 621780396, 622697771, 623888969, 625190318, 626462936, 627505422, 628113866, 628272355, 628019691, 627313018, 626084685, 624377966]
3283.8F24377966j944304j881837j591146j163543o92963l16024k68221o74188j401484
3302.1F14444256k249241l175736m245758n406439o521761p489384q238017q581042
3318.4E68536878q124531o520331l759265j91152L618837O984532R317279J0495066
3334.8E80357313J0696650J0056197Q925677P787823O741763N760788M905761M047215
3351.1F39279187L160357K494872K056062J605451J102150P56800O56783M97163O2525
3369.4F51671350l98755n40137m30286l98696m55916m67360m16040l48687k55823r1613
3389.8F47868037j12533m15802m99905j69575L4094k83003o50942n19872k05397q6964
3410.2F44958138r9003j84417k32517j11223K5332N4419J15276K85506M44651M46558
$$ y = [624377966, 622433662, 620551825, 618960679, 617797136, 617104173, 616788149, 616519928, 615845740, 614444256, 612195015, 609019279, 604773521, 599367082, 592845321, 585355937, 577117920, 568536878, 560412347, 553892016, 550132751, 549941599, 553560436, 560544968, 569862247, 580357313, 591053963, 601110160, 610035837, 617823660, 624565423, 630326211, 635231972, 639279187, 642439544, 644934416, 646990478, 648595929, 649698079, 650454879, 651111662, 651608825, 651671350, 651272595, 650732458, 650302172, 649903476, 649447560, 648980200, 648564160, 648215473, 647959650, 647868037, 647755504, 647339702, 646839797, 646670222, 646704316, 646421313, 645770371, 645250499, 645045102, 644958138, 644859135, 644674718, 644442201, 644330978, 644356310, 644410729, 644526005, 644811511, 645256162, 645702720]
3430.6F45702720M72605O05643N49555L73125M36782O56963Q04305R26733J004159
3449F51532590J019121J054227J124382J240611J342714J286864J260102J508057J666367
3467.3F63035035J360595R61662R65297J235723J457692J481950J308203J209736J297473
3485.7F74313366J332581J273752J285791J383603J475453J409114J307487J412690
3502F85193837J420319J217544J253605J490533J608074J533389J417756J416981J495421
3520.4F98047459J633048J616240J457691J501679J632095J660406J742602J759171
3536.7G11050391J586437J593650J816034J896262J683176J444161J545548J778186
3553G24393845J774609J715302J795590J801193J548886J557171K214551K448500J966655
$$ y = [645702720, 646175325, 646780968, 647330523, 647703648, 648140430, 648797393, 649601698, 650528431, 651532590, 652551711, 653605938, 654730320, 655970931, 657313645, 658600509, 659860611, 661368668, 663035035, 664395630, 665357292, 666322589, 667558312, 669016004, 670497954, 671806157, 673015893, 674313366, 675645947, 676919699, 678205490, 679589093, 681064546, 682473660, 683781147, 685193837, 686614156, 687831700, 689085305, 690575838, 692183912, 693717301, 695135057, 696552038, 698047459, 699680507, 701296747, 702754438, 704256117, 705888212, 707548618, 709291220, 711050391, 712636828, 714230478, 716046512, 717942774, 719625950, 721070111, 722615659, 724393845, 726168454, 727883756, 729679346, 731480539, 733029425, 734586596, 736801147, 739249647, 741216302]
3571.3G41216302J782596J931846K061665K234936K316892K106786J993060K372026
3587.7G58016109K507031K091885K024591K246916K289474K286673K229154J900852
3604G75592685J661479J959682K191961K041101J908183J649439J879573K468586J946390
3622.3G93299079R50992P24852J850486K466440J343072R33647J097917J032591R54092
3640.7H04653168P21872L09526M01974J491249J859367N68688R6380Q39115Q57234
3659H11798573K25544J4007m6134j54615K72095N31733p5101L60310Q91566K05696
3679.4H14023674n9128p1883j47284L70980J087844P85291K55227J28329J5438M3571
3699.8H16432059M09007L65078k09868m17769k2769N92292M13656j86622k95520r0718
$$ y = [741216302, 742998898, 744930744, 746992409, 749227345, 751544237, 753651023, 755644083, 758016109, 760523140, 762615025, 764639616, 766886532, 769176006, 771462679, 773691833, 775592685, 777254164, 779213846, 781405807, 783446908, 785355091, 787004530, 788884103, 791352689, 793299079, 794250071, 794974923, 796825409, 799291849, 800634921, 801568568, 802666485, 803699076, 804653168, 805375040, 805684566, 806086540, 807577789, 809437156, 810005844, 810102224, 810941339, 811798573, 812024117, 812038124, 811991990, 811837375, 812109470, 812641203, 812566102, 812926412, 813817978, 814023674, 813964546, 813892663, 813745379, 814116359, 815204203, 815989494, 816244721, 816373050, 816388488, 816432059, 816841066, 817206144, 816996276, 816578507, 816555738, 817148030, 817561686, 817375064, 817079544, 816988826]
3720.2H16988826R7036K00689K49982r4772m77731k32637L56138O81996J79172q63910
3740.6H17084789r49084L11791K79308m97043L27110P50005j97172n78463q9288J14143
3761H16556096k95162l38495j18554J08600K16603j93536m92096k32756J90735O5446
3781.4H15466881k83063j60992J9789M589j27553k76387j11401j25289k41459L14415
3801.8H14479530J53243k08556K97248O1870o67632o51359O7651K5391j96099L76523
3822.2H13737810N8651l77417l08931l43084k66731k11835r4950J72675K8967q1956
3842.6H12313199N1975k27451q08835j049161J12653J451432K89262o99997n73933
3861H10859144j28806O5148k90930j59443L76106J41382j61112m25040l97504J2398
$$ y = [816988826, 817085862, 817286551, 817536533, 817441761, 816964030, 816731393, 817087531, 817769527, 817948699, 817084789, 816135705, 816447496, 816726804, 816229761, 816556871, 817306876, 817109704, 816531241, 816441953, 816556096, 816260934, 815922439, 815803885, 815912485, 816129088, 815935552, 815443456, 815210700, 815401435, 815466881, 815183818, 815022826, 815042615, 815047204, 814919651, 814643264, 814531863, 814406574, 814165115, 814479530, 814632773, 814424217, 814721465, 814783335, 814115703, 813464344, 813531995, 813557386, 813361287, 813737810, 813796461, 813419044, 813110113, 812767029, 812500298, 812288463, 812193513, 812366188, 812395155, 812313199, 812365174, 812137723, 811328888, 810279727, 810392380, 811843812, 812133074, 811433077, 810859144, 810730338, 810795486, 810504556, 810345113, 810721219, 810862601, 810701489, 810276449, 809878945, 809891343]
3881.4H09891343o4313J1146q7440m99606j37866K1875n41627o41466j47760K31803
3901.8H08036089L82125L12448n9188l03208l63946m27127l16739o5863m8817k38120
3922.1H06907654k06411n2273j63854j90079Q1182J28150q7083j75714j15395l993
3942.5H06122184n0545j19686Q4698J76966n483r1255k9624j1742p748K861l1293j8716
3967H06020617O021l7671o7710l1531k0504n7698q3506r9063j19924j44363j62124
3989.5H05202544j67728j60873j45614j52409
3997.6H04575920
$$ y = [809891343, 809827030, 809838176, 809750736, 809251130, 809113264, 809135139, 808593512, 807952046, 807804286, 808036089, 808418214, 808730662, 808671474, 808368266, 808004320, 807577193, 807260454, 807194591, 807145774, 806907654, 806701243, 806648970, 806485116, 806295037, 806376219, 806504369, 806417286, 806241572, 806126177, 806122184, 806071639, 805951953, 806036651, 806213617, 806208134, 806116879, 806087255, 806075513, 806067765, 806070626, 806039333, 806020617, 806026638, 805988967, 805921257, 805889726, 805869222, 805811524, 805728018, 805628955, 805509031, 805364668, 805202544, 805034816, 804873943, 804728329, 804575920]
##END=$$ End of the data block
