##TITLE=B8M - Breno - Chalcona $$ Begin of the data block
##JCAMP-DX=5.00 $$ ACD/SpecManager v 10.08
##SPECTROMETER/DATA SYSTEM=Alpha
##DATE=13 Apr 2015 15:31:48
##DATA TYPE=INFRARED SPECTRUM
##DATA CLASS=XYDATA
##ORIGIN=
##OWNER=
##NPOINTS=1765
##FIRSTX=399.76428223
##LASTX=3997.64306641
##MAXX=3997.64306641
##MINX=399.76428223
##MAXY=0.84046876
##MINY=0.51778936
##XFACTOR=1.0000000000
##YFACTOR=1.000000000000000e-9
##FIRSTY=0.83199281
##DELTAX=2.03961372
##XUNITS=1/CM
##YUNITS=ARBITRARY UNITS
##XYDATA=(X++(Y..Y))
399.8H31992805M63247J696647K257823l79383j550019J80662m54188l228962k595782
418.1H28382850Q32081Q2433j055479j35303j405895l007590o32346J872003J373708
436.5H26306462J299262J880408N50270p59959K56955Q74639n81563j120984l04997
454.8H28400493q68023j184940J80244J34528j650870k244472r44555q8096L38733
473.2H22073042J533747J836896M71294o85692m35173j69576p37786q91626o18636
491.5H22376490j201630k219915k394438k565742l824115m963278o032169r378612
507.9G89796591j5239597j8970012j3595045p29263P472515N163730J183748J593947
524.2G56676614K025843j477659o762147r154081k264679J3509572K4515510K2462189
$$ plain form
399.8 831992805 832456052 834152699 836410522 836031139 834481120 834661782 834207594 830978632 828382850
418.1 828382850 829214931 829297364 828241885 828106582 826700687 823693097 823060751 824932754 826306462
436.5 826306462 827605724 829486132 830036402 829276443 829533398 830408037 829826474 828705490 828400493
454.8 828400493 827532470 826347530 826527774 826662302 825011432 822766960 821822405 821734309 822073042
473.2 822073042 823606789 825443685 825914979 825229287 824794114 824624538 823886752 822995126 822376490
491.5 822376490 821174860 818954945 816560507 813994765 810170650 805207372 799175203 789796591
507.9 789796591 774556994 755586982 741991937 741262674 748735189 753898919 755082667 756676614
524.2 756676614 758702457 757224798 750462651 741308570 739043891 752553463 777068973 799531162
540.5G99531162J4564931P438421K099216J80662N93484l49641j373828N71251K440155
558.9H25695813J233220J65760Q53658L58284j027823m16756M18187p60973j307547
577.2H25211823P3850L41475p04408k41279P20918m62472j498580J669P41601o93918
597.6H23490679p34746J021981R10461l42131K75076P51376r30131k153098j421273
616H20868194l12030O91175J689255J459539l63707j310885o43015j676440l843606
634.3H16558480j552820L127575K908111N4001m83810q08418k728641l815651m747868
652.7H08510959r604394j7954588j5188515Q963525K5907338J5446066j38521n146324
669H10795546k915919l378332n399048p960737j1495292j5375138k1476328k9645145
$$ plain form
540.5 799531162 814096093 821534514 823633730 823814392 824407876 824058235 822684407 823255658 825695813
558.9 825695813 826929033 827094793 827948451 828306735 827278912 826862156 827280343 826519370 825211823
577.2 825211823 825285673 825627148 824922740 824681461 825402379 824939907 823441327 823442996 824184597 823490679
597.6 823490679 822755933 823777914 824688375 824346244 824621320 825372696 824442565 822289467 820868194
616 820868194 820556164 821247339 822936594 824396133 824032426 822721541 822078526 820402086 816558480
634.3 816558480 815005660 818133235 821041346 821095347 820611537 819803119 817074478 813258827 808510959
652.7 808510959 798906565 780951977 765763462 774726987 800634325 816080391 815941870 810795546
669 810795546 807879627 804501295 799102247 791141510 779646218 764271080 742794752 713149607
685.3G13149607l0420899j2416721J5127480L1395376L3475697K8662443K0080209
699.6G99053192J2256146Q351624N678177K169072p77840k919913o775915j3690830
715.9H03343713k3999870k9573977j3087987J8532812L5972595K8748095J2308419
730.2H32243800K696991K61068o92546j518428j220048j172900l282189n857587n490124
748.5H15968037j302481K940237L474892J285731j529157l666222m030943m084229
764.9H09055865n959869r415030j5204847k6641369m2700052m9592078k6144206K4486482
781.2F57884896O1545789N7829022L2692433J2824237L953338J026034j303673l662347
797.5H22789729m034579l767610m771650n800187o970823j1186957j7611981j7316162
$$ plain form
685.3 713149607 682728708 670311987 685439467 716834843 750310540 778972983 799053192
699.6 799053192 811309338 819660962 825339139 827508211 826730371 823810458 817034543 803343713
715.9 803343713 779343843 749769866 736681879 755214691 791187286 819935381 832243800
730.2 832243800 834940791 835201859 834509313 832990885 831770837 830597937 827315748 821458161 815968037
748.5 815968037 814665556 817605793 821080685 822366416 820837259 817171037 813140094 809055865
764.9 809055865 803095996 793680966 778476119 751834750 709134698 659542620 633398414 657884896
781.2 657884896 719430685 777259707 809952140 822776377 826729715 827755749 826452076 822789729
797.5 822789729 818755150 814987540 810215890 804415703 797444880 786257923 768645942 751329780
813.8G51329780o504655j501680j8564701m3955505m3734133o127655L8346707N4669857
830.1G23958015M3255210K5502324J4011682P836520K852559q0466J850545N575002
846.4H24761391N916774L843129K402246Q26656j262962j030743J426041K135753R02593
864.8H39920878L46899K00987m28796o42240k21729k86877p63535o87123n35607j125276
885.2H35777581j618088j149296o74486r52125r83119l02017P1049q1182m5597q4996
905.6H29957724p79927j267076p31051k97188p81000j166880j046181j374602k031923
923.9H20481896j980245k033293l347814l721118r16779K157450K189755Q48651L00467
942.3H13978970j85549j069784j364828j148283j479328k110004k118588j813531k097785
$$ plain form
813.8 751329780 744825125 743323445 724758744 680803239 637069106 630941451 669288158 723958015
830.1 723958015 767213225 792715549 806727231 814563751 817416310 817335844 819186389 824761391
846.4 824761391 830678165 834521294 836923540 837750196 836487234 835456491 836882532 839018285 839920878
864.8 839920878 840267777 840468764 840039968 839397728 839175999 838889122 838125587 837438464 836902857 835777581
885.2 835777581 834159493 833010197 832335711 831383586 830400467 830098450 830169499 830088317 830042720 829957724
905.6 829957724 829177797 827910721 827179670 826882482 826101482 824934602 823888421 822513819 820481896
923.9 820481896 818501651 816468358 813120544 809399426 808482647 810640097 812829852 813678503 813978970
942.3 813978970 813793421 812723637 811358809 810210526 808731198 806621194 804502606 802689075 800591290
960.7H00591290k629638k959251l885567n402506o521582p758200j0686279j6056537
977G44691730k4635971l5502374l6628187j0709226K9888213M7034680L3265889J4053166
993.3G61457920K505541n041838r867728j0193645q265734q003712j1739015k0542682
1009.6F90309107k9285073k8437316j7966271n808830R605706L1244218M3058097K9899776
1025.9G22619414M550636p147848L238022J8711626K2323490J7447292J2705505R336412
1042.2H03784549O719411M739701K664864P77662J19031R5188l53396p02500m93586
1060.6H17350924o91593j642286k324284k383411k179265j378297j82808K8253r86457
1079H05610776j625121r32395j5438P3731j81198l64602r07063j567543j793801j930237
$$ plain form
960.7 800591290 797961652 795002401 791116834 785714328 779192746 771434546 760748267 744691730
977 744691730 720055759 684553385 647925198 637215972 667104185 714138865 747404754 761457920
993.3 761457920 763963461 758921623 749053895 738860250 730594516 722590804 710851789 690309107
1009.6 690309107 661024034 632586718 614620447 608811617 618417323 649661541 692719638 722619414
1025.9 722619414 727170050 720022202 723260224 741971850 764295340 781742632 794448137 803784549
1042.2 803784549 810503960 815243661 817908525 818686187 818805218 818900406 818547010 817844510 817350924
1060.6 817350924 816659331 815017045 812692761 810309350 808130085 806751788 806568980 806597233 805610776
1079 805610776 803985655 803053260 803037822 803111553 802930355 802565753 801658690 800091147 798297346 796367109
1099.4G96367109k287984l061235n173385q555591r885252m483521O230474J2310505
1115.7G81461120R162843L507852M43161p14064r91583p84397p50124j114011j466513
1134G88754284j637458j904667k246618k412796k773106l626168m359066m323602m057288
1152.4G61413515m217089m885256o445765r149254j3344109j9359588k5325835k6865304
1168.7F51821315j5677690J0375082K9639066K1698355K327442Q51334J7863512K7762293
1185G46660709J9905091P101834j319468n599201p735729r457171j1542261j3793469
1201.3G24220335j6286373j9055009k0503819j8946230j4209926o553531L071130J3026475
1217.7F44763052K1416069K5209903K3138643J8474519J4829933J2222112R052992
$$ plain form
1099.4 796367109 794079125 791017890 785844505 777288914 767403662 762920141 769150615 781461120
1115.7 781461120 790623963 794131815 794574976 793860912 792869329 792084932 791334808 790220797 788754284
1134 788754284 787116826 785212159 782965541 780552745 777779639 774153471 769794405 765470803 761413515
1152.4 761413515 757196426 752311170 745865405 736716151 723372042 704012454 678686619 651821315
1168.7 651821315 636143625 646518707 676157773 697856128 700183570 701034904 718898416 746660709
1185 746660709 766565800 773667634 772348166 766748965 759013236 749556065 738013804 724220335
1201.3 724220335 707933962 688878953 668375134 649428904 635218978 628665447 631736577 644763052
1217.7 644763052 666179121 691389024 714527667 733002186 747832119 760054231 769107223
1231.9G69107223M852771N13316l007472n912006q668125j0392964j0149955r440542
1248.2G26902246j0447859j2708009j4918565j7770171k1622539k3020089j5841543
1262.5F10573471K133727K4552643L9668679M0179730K9616415J7001152P474780R95517
1278.8G72196114l027081l930808k722322l635943q930266j3170541j0718345n989790
1295.2G20071018o098628j0426164j1629939p231772l69430J1768699K3899794K0954728
1311.5G40938306M226148j1714339j4523387j194298J3850927J4360189M015088n230367
1327.8G44728267r622454j1689961j2366414j0465146n914330R59456J0262966J9302547
1344.1G25194931K2753358J9209087J4065862J1127114R615242Q204758O285310L911853
$$ plain form
1231.9 769107223 773959994 774473310 771465838 765553832 756885707 746492743 736342788 726902246
1248.2 726902246 716454387 703746378 688827813 671057642 649435103 626415014 610573471
1262.5 610573471 612707198 637259841 676928520 717108250 746724665 763725817 771200597 772196114
1278.8 772196114 769169033 765238225 762515903 758879960 749949694 736779153 726060808 720071018
1295.2 720071018 713972390 703546226 691916287 684684515 684315085 696083784 719983578 740938306
1311.5 740938306 745164454 733450115 718926728 717732430 731583357 745943546 749958634 744728267
1327.8 744728267 735105813 723415852 711049438 700584292 694669962 695629418 705892384 725194931
1344.1 725194931 747948289 767157376 781223238 792350352 801965594 810170352 816455662 820367515
1360.4H20367515K336681K168596J681626M35948m59015r08912q33034l64542o37353
1378.8H23787510j452982k024829j910687j193702l98457o22392j806855k190650j404464
1397.1H10782492r64641r68874j615584k580762l029942m076958n736947p667184j1005878
1415.5G73135722j3948500o711007Q565247J4349580J1027277M472911j710653o557286
1431.8G82623291q984923o837070o6221l53873j0717630k2009731j4265418J7492712
1448.1G36881137L3100784J6888797r98199j2219727j4340580l980577J726687J626969
1464.5G58685291K123475N373239P542789P175506M433333J893640L21269j278341
1480.8G86270201k557337l450036m914165o251573n338431m035055o349266j0784745
$$ plain form
1360.4 820367515 822704196 824872792 826554418 826990366 826531351 825622439 824789405 824424863 823787510
1378.8 823787510 822334528 820309699 818399012 817205310 816806853 816184461 814377606 812186956 810782492
1397.1 810782492 809817851 808848977 807233393 804652631 801622689 797545731 791808784 784141600 773135722
1415.5 773135722 759187222 752476215 761041462 775391042 786418319 790891230 789180577 782623291
1431.8 782623291 773638368 766801298 766735077 766381204 755663574 733653843 719388425 736881137
1448.1 736881137 769981921 786870718 785872519 773652792 759312212 755331635 757058322 758685291
1464.5 758685291 760808766 766182005 773724794 780900300 785333633 787227273 787548542 786270201
1480.8 786270201 783712864 780262828 775348663 769097090 763758659 759723604 753374338 742589593
1497.1G42589593j2219369j1864961j3413846k3682535m4902325m2458355k1398127
1511.4E72650075Q372426M7613502O9456756N3802907K9559374J3553023M276097L78728
1527.7G99662888j098573l055751m658044l381193l727376o975889n775035k580106
1544G68410921k703488m538774o829679p553280q040070r459973j4346838j4144420
1560.3G00794399o497979p094741j1064351j8055260k3189068j4234006o895840l474951
1576.6F10288203J3890266K5331736J1917889j3020218k4823546k2694051k0829499
1590.9E80060780k2798657k0888448j3519168n065143O466210K1946609L3851206L7338138
1607.2F17391527L4648716K8823495K1735609J6359090J3493836J0152996P389426
$$ plain form
1497.1 742589593 730370224 718505263 705091417 681408882 636506557 594048202 572650075
1511.4 572650075 581022501 628636003 698092759 751895666 781455040 795008063 799284160 799662888
1527.7 799662888 798564315 795508564 790850520 787469327 783741951 776766062 770991027 768410921
1544 768410921 765707433 761168659 754338980 746785700 738745630 729285657 714938819 700794399
1560.3 700794399 694296420 687201679 676137328 658082068 634893000 620658994 613763154 610288203
1576.6 610288203 624178469 649510205 661428094 648407876 623584330 600890279 580060780
1590.9 580060780 557262123 536373675 522854507 517789364 524255574 546202183 580053389 617391527
1607.2 617391527 652040243 680863738 702599347 718958437 732452273 742605269 749994695
1621.5G49994695N767226L647507J046896j026869k624929n002797p478416n021870
1637.8G39301443k161205k605259n486786j2688578j8531084j8235624l3804774n7135582
1654.1E88652551l1728923l043473K1531284M8434794N5437088L8426638K4100899
1668.4G41810858J6455710J0366380P673741N839228J426757k034068n13614P176877
1684.7G88201869J0292291P327497N785525M423797K401710J066267P72178J525700
1701.1H21796834K320409J230419P55012J078844M18961q30650j755536j004219J526773
1719.4H25536847K221823J241028N27919k88427j084745j493097j769185n5551J044094
1737.8H25880706J33276l24845k01106m61280r45628j095116m6075N03242m38571r45508
$$ plain form
1621.5 749994695 755761921 759409428 760456324 759429455 756804526 751801729 744323313 739301443
1637.8 739301443 737140238 734534979 729048193 716359615 697828531 679592907 645788133 588652551
1654.1 588652551 556923628 553880155 575411439 623846233 679283321 717709959 741810858
1668.4 741810858 758266568 768632948 776306689 782145917 783572674 781538606 781024992 788201869
1684.7 788201869 798494160 805821657 811607182 816030979 818432689 819498956 820271134 821796834
1701.1 821796834 824117243 825347662 826102674 827181518 827600479 826769829 825014293 824010074 825536847
1719.4 825536847 827758670 828999698 829527617 829239190 828154445 826661348 824892163 824836612 825880706
1737.8 825880706 826013982 825689137 825488031 825026751 824081123 822986007 822939932 823443174 823004603 822059095
1758.2H22059095o13630j82629L85523j04844j073361j440465j119971N73635J487136
1776.5H19970489P29918l9101L8743J65940K5868m49836j238167q55625M35233M81129
1796.9H19264591k59340m89414l5465J80066l10063j111567j289606n35012m530Q047
1817.3H15417707K23517L22521j74403m69506k31862r6679M40836P31290K42829o9678
1837.7H16336572k59340q91327j327813l13699P45356P96318M93884r597l67820l65615
1858.1H14836919l21746m45306o38723j060069j333058m90665L83258K7835q13186
1876.5H10145259j339972j623154k080381k745688l188073k906025q97109J817524
1892.8G97182381L014922K575040J362801M15742K22743L29494K81632L49343O02543
$$ plain form
1758.2 822059095 821445465 821262836 821648359 821543515 820470154 819029689 817909718 818483353 819970489
1776.5 819970489 820700407 820661306 820700049 820865989 820891857 820442021 819203854 818348229 818783462 819264591
1796.9 819264591 819005251 818515837 818480372 818660438 818350375 817238808 815949202 815414190 815409660 815417707
1817.3 815417707 815641224 815963745 815789342 815319836 815087974 814991295 815432131 816163421 816406250 816336572
1837.7 816336572 816077232 815185905 813858092 813544393 814289749 815086067 815579951 815570354 815202534 814836919
1858.1 814836919 814515173 814069867 813431144 812371075 811038017 810547352 810930610 810958445 810145259
1876.5 810145259 808805287 807182133 805101752 802356064 799167991 796261966 795364857 797182381
1892.8 797182381 800197303 802772343 804135144 804550886 804773629 805103123 805384755 805734098 806336641
1911.1H06336641M47512k19464n93067j69515J10805O6876L86060M85539J74403L934
1931.5H07029724l4690j99616m60446o99341q42988n25117n3525k444j88470m35829
1951.9H03587258n66483n16593o00040q68499j025141j080155r56595k24233P01785
1970.3G98451304R13382M79758M3034j32262k48134l80576l50475k43664k78235l64065
1990.7G97890067j43468J80840N3644k15113k69234l65496n42283n03480k53201j66833
2011.1G95665443l11554l74555l10958m07576o71029q98123p52926R9719J001298J200438
2031.5G94240177Q89480M64678J88589N9j79112j46269L9219K0147k21849l28123k30551
2053.9G94736445j86026j36197J02222K19643k682j54436p5995j45317l27706k38001
$$ plain form
1911.1 806336641 806784153 806564689 805971622 805802107 805912912 805979788 806365848 806851387 807025790 807029724
1931.5 807029724 806995034 806795418 806334972 805635631 804792643 804267526 804214001 804211557 804023087 803587258
1951.9 803587258 803020775 802504182 801904142 801035643 800010502 798930347 797973752 797749519 798451304
1970.3 798451304 799364686 799844444 799887478 799755216 799507082 799126506 798776031 798532367 798254132 797890067
1990.7 797890067 797746599 797927439 797981083 797765970 797496736 797131240 796588957 796085477 795832276 795665443
2011.1 795665443 795353889 794979334 794668376 794260800 793589771 792691648 791938722 792038441 793039739 794240177
2031.5 794240177 795129657 795594335 795782924 795782983 795603871 795457602 795496821 795516968 795295119 794966996 794736445
2053.9 794736445 794550419 794414222 794516444 794736087 794733405 794578969 794502974 794357657 794029951 793791950
2074.3G93791950K7299Q5294J5259O3717M5538j59562k27391o1155l7014k01047k01463
2096.8G93141425r7335j82867k81453j60992n6148j15633r7632N7697Q7202r54L4452
2119.2G92327762J16944K6226q8036k2054Q703j34707j66178k6941k9981j55807j50144
2141.6G91705787j05321j94669k20656o7711j6213j50561j92642j01984j16288j87457
2162G90352285j38581j26362k72095k78890n7995J9133j15514j55270o9440q3387j67906
2184.5G88905978j24454l8326r6858j74939j40310j08003j31965j24574j00195j49608
2204.8G87716746k04384j58191r8824j42992j80006j31488j51991k51830k35558j14977
2225.2G86046505j01924j87993j78754r3878j08599j74702j48415j05977j51873j91748
$$ plain form
2074.3 793791950 793819249 793904543 793919802 793983519 794029057 793869495 793642104 793580949 793543935 793342888 793141425
2096.8 793141425 793044090 792861223 792579770 792418778 792362630 792246997 792149365 792207062 792294264 792293310 792327762
2119.2 792327762 792444706 792470932 792382896 792360842 792369545 792234838 792068660 792041719 792011738 791855931 791705787
2141.6 791705787 791600466 791405797 791185141 791117430 791101217 790950656 790758014 790656030 790539742 790352285
2162 790352285 790213704 790087342 789815247 789536357 789478362 789497495 789381981 789226711 789157271 789073884 788905978
2184.5 788905978 788781524 788743198 788646340 788471401 788331091 788223088 788091123 787966549 787866354 787716746
2204.8 787716746 787512362 787354171 787255347 787112355 786932349 786800861 786648870 786397040 786161482 786046505
2225.2 786046505 785944581 785756588 785577834 785483956 785375357 785200655 785052240 784946263 784794390 784602642
2245.6G84602642j76609k32279l54826l81887l06428k56657j86801k4140N6982n0724
2266G82689273j54793j36316j66237k89559l11792k05875j05500m6968l3260j18315
2286.4G81120658k39849k66195k28226k71856m06385m93884n24998o20186p73311q80718
2306.8G76415050r93907j118184j031577q25942r49681j340806j418948j043499o57439
2325.2G67035067n80132o26147m86552l18587l46482l46065k77578k69533L3856J089751
2345.6G64907598J809299Q03769j212180k606451k584934j816571p88152K7060M74751
2363.9G59014189R32575J388311J609683J727223J848162J872301J813769J743376
2380.2G71949589J520157J049161N59330K71261R7155o7412j43290j40488j85490k40564
$$ plain form
2245.6 784602642 784426033 784193754 783838928 783457041 783150613 782893956 782707155 782683015 782739997 782689273
2266 782689273 782534480 782398164 782231927 781942368 781630576 781424701 781319201 781272233 781238973 781120658
2286.4 781120658 780880809 780614614 780386388 780114532 779708147 779214263 778689265 778069079 777295768 776415050
2306.8 776415050 775421143 774302959 773271382 772445440 771495759 770154953 768736005 767692506 767035067
2325.2 767035067 766454935 765828788 765342236 765023649 764677167 764331102 764053524 763783991 763817847 764907598
2345.6 764907598 766716897 767520666 766308486 763702035 761117101 759300530 758512378 758539438 759014189
2363.9 759014189 759946764 761335075 762944758 764671981 766520143 768392444 770206213 771949589
2380.2 771949589 773469746 774518907 775078237 775349498 775446653 775379241 775235951 775095463 774909973 774669409
2400.6G74669409k01404j51635j96278k60472k71439k89858l12090k71916k18034k21968
2421G72274315k16066j04964M8458J30773J39534J02997K2531o4254j31130j61529
2441.4G72040665j52051j31369j33574j79410k24590k52187l19422l86715l24130j67846
2461.8G69769371p0692m6968l9220n6505q2553m3988K682l3020q1599q7381q6426j01149
2486.3G69042552j25230j40071j62422j90556j94192k33591l26216l65615l26693k94030
2506.7G66683936k75135k07543j66416j78397o5088J73509K81810K06471J19388L6240
2527.1G66608775r5010j89006k16008k70843l61324l74317l14176l57091m98235n42820
2547.5G63389945n04553m77553l93033k27451j22607j15275p2897J9133Q7858J36673
$$ plain form
2400.6 774669409 774468005 774316370 774120092 773859620 773588181 773298323 772986233 772714317 772496283 772274315
2421 772274315 772058249 771953285 772001743 772132516 772272050 772375047 772397578 772333324 772202194 772040665
2441.4 772040665 771888614 771757245 771623671 771444261 771219671 770967484 770648062 770261347 769937217 769769371
2461.8 769769371 769698679 769651711 769612491 769555986 769473433 769429445 769432127 769399107 769317508 769230127 769143701 769042552
2486.3 769042552 768917322 768777251 768614829 768424273 768230081 767996490 767670274 767304659 766977966 766683936
2506.7 766683936 766408801 766201258 766034842 765856445 765791357 765964866 766246676 766453147 766572535 766608775
2527.1 766608775 766513765 766324759 766108751 765837908 765476584 765102267 764788091 764431000 763932765 763389945
2547.5 763389945 762885392 762407839 762014806 761787355 761664748 761549473 761476576 761495709 761583567 761720240
2567.9G61720240J41263K027k40922l48926k11477n5015p4923j34588j40607j57773
2588.3G60499299j74106j83582k42829k69830j17481J31786K61962K40922K00152J65761
2608.7G60512054Q6307L5584N1022K8908m6968p9274o8009p1228q1241q1897j05619
2631.1G60179639j51575j27613j9670L0875m291l457K2292o437m0234l4451l4332o9261
2655.6G59741485p8082o5625j16229j60277j32680j09791j20521j25289j18613j15574
2676G58598804j07944j12175j56820k19882k72691k86460k51412k61844l14653k88844
2696.4G56326079k13086j55747j09911q6963r8825j40607j97172k37942k29776j91629
2716.8G54664421j55032j19030j06752j28686k24352l37541l26276k66314k25246k05397
$$ plain form
2567.9 761720240 761861503 761863530 761622608 761273682 761062205 761007190 760932267 760797679 760657072 760499299
2588.3 760499299 760325193 760141611 759898782 759628952 759511471 759643257 759905219 760146141 760346293 760512054
2608.7 760512054 760598361 760633945 760684967 760713875 760666907 760587633 760519624 760448396 760367155 760285258 760179639
2631.1 760179639 760028064 759900451 759880781 759911656 759907365 759903908 759926200 759919763 759879529 759845078 759810746 759741485
2655.6 759741485 759663403 759597778 759481549 759321272 759188592 759078801 758958280 758832991 758714378 758598804
2676 758598804 758490860 758378685 758221865 758001983 757729292 757442832 757191420 756929576 756614923 756326079
2696.4 756326079 756112993 755957246 755847335 755760372 755661547 755520940 755323768 755085826 754856050 754664421
2716.8 754664421 754509389 754390359 754283607 754154921 753930569 753593028 753266752 753000438 752775192 752569795
2737.2G52569795k66552l17872k47538j14500r7991k49147l55661k70069j07228R656
2757.6G50552893P3909J8359j19925j44660p7725o1273n1439j7047j29223l39508l67940
2780G49336421k74717k58088k19465j07646j60753l75510m15206k38657j97887l72171
2800.4G46716321m06504k53737j53840j10686j16229j89125k05577j55985j79112l22103
2820.8G44623423n31197p45594r80676j337051j753032k060890k281726k433538k368808
2839.1G30130911j485706O43015K695501K973795J837552P25806K47061J97887K97606
2857.5G38263428L24309K17199J27674L9458r9778j13011m6253k27094n59032n97417
2877.9G37329483m26292m16279n31614o52671q17239r80795j074910j230061j531660
$$ plain form
2737.2 752569795 752303243 751985371 751737833 751623333 751525342 751276195 750920534 750650465 750543237 750552893
2757.6 750552893 750626802 750645161 750525236 750380576 750302851 750241578 750190139 750173092 750043869 749704361 749336421
2780 749336421 749061704 748803616 748584151 748476505 748315752 747940242 747525036 747286379 747088492 746716321
2800.4 746716321 746309817 746056080 745902240 745791554 745675325 745486200 745280623 745124638 744945526 744623423
2820.8 744623423 744092226 743346632 742365956 741028905 739275873 737214983 734933257 732499719 730130911
2839.1 730130911 728645205 729288220 731983721 734957516 736795068 737520874 737767935 737965822 738263428
2857.5 738263428 738587737 738804936 738932610 738972068 738872290 738759279 738713026 738485932 737926900 737329483
2877.9 737329483 736903191 736486912 735955298 735302627 734485388 733504593 732429683 731199622 729667962
2896.3G29667962j689792j375496p23780j61528R7930J41740P6115q6307l71576p50839
2916.6G24824429j027883r77277o25015l22699k28703k01285k88785m41849m54724
2935G20256209l94523l43859l8028O28352J032114N29707n09381j178503j132369l09229
2955.4G18540490J072764K060950K020419J321077P04110M80830M30644M25279M29332
2973.8G27485895K64704j8179k85864o40750j011669j105130q17418k83540R1076j907
2994.2G23677218l11494o31988p85351m39465l9935k59399r08077j457632j536071
3012.5G17307806o86645J241087L089726L265024J890838N16474J5557n3108k86162
3030.9G26300597n21838m83931j39057N63621J066923O14107n30779j546324k124548
$$ plain form
2896.3 729667962 727978170 726602674 725878894 725717366 725815296 725957036 726033151 725946844 725575268 724824429
2916.6 724824429 723796546 722819269 722194254 721871555 721642852 721441567 721152782 720710933 720256209
2935 720256209 719861686 719517827 719479799 720108151 721140265 721669972 721160591 719982088 718849719 718540490
2955.4 718540490 719613254 721674204 723694623 725015700 725719810 726200640 726631284 727056563 727485895
2973.8 727485895 727750599 727732420 727446556 726805806 725794137 724689007 723871589 723588049 723679125 723677218
2994.2 723677218 723365724 722733736 721948385 721508920 721468985 721209586 720301509 718843877 717307806
3012.5 717307806 716621161 717862248 720951974 724216998 726107836 726624310 726639867 726586759 726300597
3030.9 726300597 725778759 725294828 725155771 725719392 726786315 727400422 726869643 725323319 723198771
3049.2G23198771k639234l058433k568424r96053J078904K846360L308713K417505
3065.5G23588109J011252k08318o25610r7513P20560R75430L85940m93347j092077
3083.9G24164426j231432n46217Q29935J701355J457215P48694K36571J3470K384J62900
3104.3G27539301L37303K98142K9147j43707q6665r9540k79903n02587o31273n41448
3124.7G25918770l67582k78592l17037m40598m68909l77000l59416m84526n47349m41611
3145.1G21836150l43860l16619k89381l16679m08709m54903m28796l83556l90231m60923
3165.5G18042493n03421m90367m68731m28856l88980m24623m97639n41389n34296m68314
3185.9G13295877l98874l88205m54486n20468m94539m31597m34876n18024o22451o99342
$$ plain form
3049.2 723198771 720559537 717501104 714932680 713936627 715015531 717861891 721170604 723588109
3065.5 723588109 724599361 724391043 723765433 723667920 724388480 725363910 725749850 725256503 724164426
3083.9 724164426 722932994 722386777 723216712 724918067 726375282 727123976 727360547 727374017 727376401 727539301
3104.3 727539301 727876604 728174746 728203893 728060186 727973521 727873981 727594078 727091491 726460218 725918770
3124.7 725918770 725551188 725272596 724955559 724514961 724046052 723669052 723309636 722825110 722277761 721836150
3145.1 721836150 721492290 721175671 720886290 720569611 720160902 719705999 719277203 718893647 718503416 718042493
3165.5 718042493 717539072 717048705 716579974 716151118 715762138 715337515 714839876 714298487 713764191 713295877
3185.9 713295877 712897003 712508798 712054312 711533844 711039305 710607708 710172832 709654808 709032357 708333015
3206.3G08333015p61389p85768p72000q00967q48949q82685r12905r18031q84413p98583
3226.7F99967325o62446m79758l71516n37157p81715q00431o96897o03080n09500n14269
3247.1F94010556o71447p56561o40571n26607n74828o52432o12557n50270n01454l25620
3267.5F88198209j15991k20060n28574o70314o62088o06895n76496o12855o22213n62429
3287.8F83020294n07534n74469p38621q93116j045466j101791j001418r50933j082599
3306.2F75124347j194775j032114p23421n37038n66006p59840j020968j208901j271189
3324.6F66810095j413822j600623j600742j509250j450419j412034j494527j660287
3340.9F54668391j758099j849472j817406j611292j703441k082348k155125j933038
$$ plain form
3206.3 708333015 707571626 706785858 706013858 705212891 704363942 703481257 702568352 701650321 700765908 699967325
3226.7 699967325 699304879 698825121 698453605 697916448 697134733 696334302 695637405 695034325 694524825 694010556
3247.1 694010556 693339109 692582548 691941977 691415370 690840542 690188110 689575553 689025283 688523829 688198209
3267.5 688198209 688082218 687862158 687333584 686663270 686001182 685394287 684817791 684204936 683582723 683020294
3287.8 683020294 682512760 681938291 681199670 680306554 679261088 678159297 677157879 676206946 675124347
3306.2 675124347 673929572 672897458 672174037 671636999 671070993 670311153 669290185 668081284 666810095
3324.6 666810095 665396273 663795650 662194908 660685658 659235239 657823205 656328678 654668391
3340.9 654668391 652910292 651060820 649243414 647632122 645928681 643846333 641691208 639758170
3357.2F39758170j830280j942575k017617j824618j669347j940966k379119k413094
3373.5F23740554k065003j863420j869738j866877j811147j661003j389563j104593
3389.8F10109210j162529j521409j554489j077652p59661j162588j641453j430809
3406.1E99798620r93192q71480r31799j038134j072169r29773p56263n97418m06384
3424.5E92202008k32518j50740k36213k15769K7418j5616l74496m66764j77503J12712
3444.9E90472519K22683L33369M97580N46038M96447N66542P29024O72281O27280R31382
3465.3E96095145J101076P19726K57850L15905O70910R31859Q94069N85437N85377
3483.6F02157354Q46029Q18014P23779Q28207R06169R25660Q89003P85411P35760P18474
$$ plain form
3357.2 639758170 637927890 635985315 633967698 632143080 630473733 628532767 626153648 623740554
3373.5 623740554 621675551 619812131 617942393 616075516 614264369 612603366 611213803 610109210
3389.8 610109210 608946681 607425272 605870783 604793131 604033470 602870882 601229429 599798620
3406.1 599798620 598805428 597933948 597002149 595964015 594891846 593962073 593205810 592608392 592202008
3424.5 592202008 591969490 591818750 591582537 591366768 591394186 591378570 591004074 590537310 590359807 590472519
3444.9 590472519 590695202 591028571 591526151 592072189 592568636 593135178 593864202 594536483 595163763 596095145
3465.3 596095145 597196221 597915947 598173797 598489702 599160612 600092471 600986540 601571977 602157354
3483.6 602157354 603003383 603821397 604545176 605373383 606279552 607205212 608094215 608879626 609615386 610333860
3504F10333860P62343Q40664R79185J255393J262248R45866Q03471R09030J019061
3522.4F19111121R37998P87497Q95857J220584J438141J442254J285195J166105J238287
3540.8F29523039J190781Q90851P79212J080871J246690J148641J239002J321674J200080
3559.1F39620841J042008O93619K05040O04630K020657K477169J846790J412749J447559
3577.5F51371062J586497J643538J426339P88093N13494J565158K191425J609802J356244
3595.8F64051652J736641J802027J718164J640498J071573N74708R36746J343668J401424
3614.2F76277101J374841J053631J288951J986384J665831M25934o88433N48482K313733
3632.5F86246455K123356J414597R87112P03454N51939P6294j084328j566648M85301
$$ plain form
3504 610333860 611096203 611936867 612916052 614171445 615433693 616379559 617183030 618092060 619111121
3522.4 619111121 620049119 620836616 621732473 622953057 624391198 625833452 627118647 628284752 629523039
3540.8 629523039 630713820 631604671 632383883 633464754 634711444 635860085 637099087 638420761 639620841
3559.1 639620841 640662849 641356468 641561508 642166138 644186795 646663964 648510754 649923503 651371062
3577.5 651371062 652957559 654601097 656027436 656815529 657329023 658894181 661085606 662695408 664051652
3595.8 664051652 665788293 667590320 669308484 670948982 672020555 672595263 673532009 674875677 676277101
3614.2 676277101 677651942 678705573 679994524 681980908 683646739 684072673 683384240 683932722 686246455
3632.5 686246455 688369811 689784408 690771520 691474974 692026913 692103207 691018879 689452231 689937532
3650.9F89937532K251029J680851P74920J106083J104355L88980m5597o51241j659691
3669.2F94887221j160383o8069o88910J25527J808584J607656R09508L49581o37770
3687.6F97132945j233935J68085J496494J223325M06444k17318m90427L5643M25995
3706F98947251l53038j362980r47177Q05080J333713L73304n50985p51615m79281r1254
3726.4F96923018L34799L2246j221001j655638j36137J367986J306116l16262j927197
3744.7F94707930m93586N07772m21822M85718J741946J133084J63853K81990O11782
3763.1F98718667O9976l27051k93255K6763O76334O06894j25527o09636k99335M6730
3783.5F98490560k682K02596K98798j9908m19199q58784q01921p24971j055598N0008
$$ plain form
3650.9 689937532 692188561 693869412 694644332 695750415 696854770 697243750 697198153 696546912 694887221
3669.2 694887221 693726838 693658769 692969859 693095386 694903970 696511626 697421134 697770715 697132945
3687.6 697132945 695899010 696067095 697563589 698786914 699193358 698976040 698485613 698521256 698947251
3706 698947251 698594213 697231233 696284056 697089136 698422849 698796153 698245168 697493553 697014272 696923018
3726.4 696923018 697257817 697290063 696069062 694413424 694277287 695645273 696951389 696635127 694707930
3744.7 694707930 694214344 694722116 694300294 694786012 696527958 697661042 697824895 698106885 698718667
3763.1 698718667 698788643 698461592 698168337 698195100 698871434 699478328 699352801 698743165 698443830 698490560
3783.5 698490560 698487878 698690474 698989272 698969364 698550165 697691381 696889460 696164489 695108891 695158899
3803.9F95158899P07149K28286O89566P72774l94642j547336r99988n10811l70622
3822.2F93733275R10878R93371K36035j71841n21898m73320p44403j209140j83344
3840.6F92569613R08971R58979P31886J71006j070619k773464j547992J642168J867652
3858.9F93458200M21941p45416p11143q0883l81709n23448M03941Q08597O56068k38359
3879.3F93067789p89285j5258K086L4868L13879k55704n5015M62770k95877j254738
3899.7F91215515j094639k30611P64490J302003R07898K34843j62184n49257o57022
3918.1F91731036j76847J54793k0385o0618O8724j70648k71678J77145L81232N4478
3938.5F91867232l31402m67181j79767q047k03431p9691J83642J01507m6671o1035
$$ plain form
3803.9 695158899 695866048 696094334 696783900 697556674 697162032 695614696 694614708 694103897 693733275
3822.2 693733275 694644153 695637524 695873559 695701718 695179820 694706500 693962097 692752957 692569613
3840.6 692569613 693478584 694437563 695169449 695340455 694269836 691496372 689948380 691590548 693458200
3858.9 693458200 693880141 693134725 692423582 692342699 691960990 691437542 691841483 692650080 693306148 693067789
3879.3 693067789 692278504 692263246 692265332 692300200 692614079 692358375 692303360 692766130 692470253 691215515
3899.7 691215515 690120876 689890265 690654755 691956758 692864656 693099499 692937315 692388058 691731036
3918.1 691731036 691554189 691708982 691688597 691627979 691696703 691526055 691254377 691431522 691812754 691867232
3938.5 691867232 691535830 691068649 690888882 690880835 690677404 690597713 690781355 690882862 690836191 690775156
3958.9F90775156r5785r3877j1206k6464n8174k2114l6418n5552j5497k2351k6882
3981.3F90310836j8120j27315k23279j73510p6532p4744j37270j28090
3997.6F89351976
$$ plain form
3958.9 690775156 690679371 690585494 690574288 690547824 690489650 690467536 690431118 690375566 690360069 690337718 690310836
3981.3 690310836 690292716 690165401 689942122 689768612 689692080 689617336 689480066 689351976
3997.6 689351976
##END=$$ End of the data block
