##TITLE=B8M - Amanda 2 $$ Begin of the data block
##JCAMP-DX=5.00 $$ ACD/SpecManager v 10.08
##SPECTROMETER/DATA SYSTEM=Alpha
##DATE=23 Jun 2015 08:35:04
##DATA TYPE=INFRARED SPECTRUM
##DATA CLASS=XYDATA
##ORIGIN=
##OWNER=
##NPOINTS=1765
##FIRSTX=399.76428223
##LASTX=3997.64306641
##MAXX=3997.64306641
##MINX=399.76428223
##MAXY=0.87591869
##MINY=0.54529458
##XFACTOR=1.0000000000
##YFACTOR=1.000000000000000e-9
##FIRSTY=0.86028856
##DELTAX=2.03961372
##XUNITS=1/CM
##YUNITS=ARBITRARY UNITS
##XYDATA=(X++(Y..Y))
399.8H60288560N09501j15037J426041k30551o57797J134813r36031k430022p63237
$$ 860288560 860798061 860683024 862109065 861878514 861220717 862355530 861419499 858989477 858226240
418.1H58226240j136661p06077Q02577j688361k798855n9247L81171R75073L168821
$$ 858226240 857089579 856383502 857186079 855497718 852698863 852639616 853020787 853995860 857164681
436.5H57164681J190662l16739J746595L43919j158953J060546K48074q68439J187086
$$ 857164681 858355343 858038604 859785199 860129118 858970165 860030711 860278785 859410346 860597432
454.8H60597432j33038j444578J384556M98831j431465O66082J64211j730204Q20220
$$ 860597432 860464394 859019816 860404372 860903203 859471738 860137820 860302031 858571827 859392047
473.2H59392047R81510j230002M35233L25203j849234R7633N89489j633763j84595
$$ 859392047 860373557 859143555 859578788 859903991 858054757 858152390 858741879 857108116 856923521
491.5H56923521L34262j896739o75141P7903k157033j225829k34663k213896j101493
$$ 856923521 857257783 855361044 854685903 854763806 852606773 851380944 851146281 848932385 847830892
509.9H47830892K91347j928687j610100K02417j353800j245141J70886j682639k000034
$$ 847830892 848122239 846193552 844583452 844785869 843432069 842186928 842357814 840675175 838675141
528.3H38675141o49094k627313l567577k099871l308654l940702k065956k757311l625512
$$ 838675141 838026047 835398734 831831157 829731286 826422632 822481930 820415974 817658663 814033151
546.6H14033151j771152j759172j640975K564609O061315P599056R540975Q368373
$$ 814033151 812261999 810502827 808861852 811426461 817487776 825086832 834627807 842996180
562.9H42996180M637897L500640K502025L54588P67350J007259n23389P2956Q19087
$$ 842996180 847634077 851134717 853636742 853991330 854758680 855765939 855242550 855315506 856134593
581.3H56134593n94556j58012R89437k85327m37617O51776l74019o00576P30634k4736
$$ 856134593 855540037 855382025 856371462 856086135 855648518 856300294 855926275 855325699 856056333 856031597
601.7H56031597n06521O18041j19090j009107j2755q90732j926482O34134J890302
$$ 856031597 855525076 856143117 856024027 855014920 855002165 854111433 852184951 852819085 854709387
620H54709387N02586O44624O31392o18696l8147K51651j197338j313031j886427n472064
$$ 854709387 855211973 855856597 856487989 855869293 855831146 856082797 854885459 853572428 851686001 846213937
640.4H46213937q976996j1865139j0822654K123296J4498771J0513365J715064j480639
$$ 846213937 837236941 825371802 814549148 816672444 831171215 841684580 843399644 841919005
656.8H41919005m331410q631825j3876737j9869566k0869851M091442L1396449K7153790
$$ 841919005 837587595 828955770 815079033 795209467 774339616 778431058 809827507 836981297
673.1H36981297J1572599k149463j2228131j9392848j6047418J701414J7350197J4374256
$$ 836981297 848553896 846404433 834176302 814783454 798736036 800437450 817787647 832161903
689.4H32161903K361596n117714j0303617j8429458k8517783m3154359o2587440o4102828
$$ 832161903 834523499 829405785 819102168 800672710 772154927 729000568 666413128 602310300
705.7F02310300k8742552J9975364N1291108O0497284N1596701L4930885K3278237
$$ 602310300 573567748 593543112 644834220 705331504 756928205 791859090 815137327
720H15137327J6141355J0235488P263601N349040K961278K352715K064287L29972j63794
$$ 815137327 831278682 841514170 848777771 854126811 857088089 859440804 861505091 861835063 861671269
738.3H61671269K56419p87258j005352j70946q03291r91405P8261l41653q65698R8049
$$ 861671269 861927688 861140430 860135078 859964132 859160841 858169436 858247697 857906044 857040346 857138395
758.7H57138395k82049j314342p88748r55641j913786j278341q80778j502037q17597
$$ 857138395 856856346 855542004 854753256 853797615 851883829 850605488 849724710 848222673 847405076
777.1H47405076j43886j92165J590490L353417K450347J668990J393735n22792k113819
$$ 847405076 847261190 847069025 848659515 852012932 854463279 856132269 857526004 857003212 854889393
795.4H54889393k870023n090595o560146m919291k768874k333820k184689K096236
$$ 854889393 852019370 846928775 840368629 835449338 832680464 830346644 828161955 830258191
811.8H30258191R188294J1314452P894039M774034M046917K926886R11057P65860J153946
$$ 830258191 839446485 850760937 858654976 863429010 867475927 870402813 871313870 872079730 873233676
830.1H73233676K72334M41432J077950K10404N9783O23107l00884o58393Q1301p42018
$$ 873233676 873506010 873947442 875025392 875235796 875295579 875918686 875617802 874959409 875040710 874298692
850.5H74298692j425803k50339L21090L29494Q69155J88887r01997l61621k99275j179814
$$ 874298692 872872889 872622550 872943640 873273134 874142289 874331176 873429179 873067558 872768283 871588469
870.9H71588469p43032n00083j404226j077950n68270j444996j450240j002729j917184
$$ 871588469 870845437 870345354 868941128 867863178 867294908 865849912 864399672 863396943 861479759
889.3H61479759k105713j451909k192915k642035k043009k714872l542245l231287
$$ 861479759 859374046 857922137 855729222 853087187 851044178 848329306 844787061 841555774
905.6H41555774l853977m824638m519343m819572n621732n005478m562319m999280
$$ 841555774 837701797 832877159 828357816 823538244 817916512 812911034 808348715 803349435
921.9H03349435m599154m770815o488800p147908o320060m350185R58145P238924Q046866
$$ 803349435 798750281 793979466 787490666 780342758 774022698 769672513 770630658 777869582 785916448
940.3G85916448N142629M406094N262435O399929P855416P769704O824851O676077
$$ 785916448 791059077 795465171 800727606 807127535 814982951 822752655 829577506 836253583
956.6H36253583N573810L770232L342390K781629J517415J588703J618564K40624p0632
$$ 836253583 841827393 845597625 848940015 851721644 853239059 854827762 856446326 856686950 856616318
974.9H56616318O31750L24726J86384L75449o21915q53836P5400o98924k108932k067446
$$ 856616318 857248068 857572794 857759178 858134627 857512712 856658876 856734276 856035352 853926420 851858974
995.3H51858974l294945m209221P79868N319595L409028Q79645k27153j306236j240551
$$ 851858974 848564029 844354808 845134676 850454271 853863299 854742944 854515791 853209555 851969004
1013.7H51969004j351178k641082m061818q064866j5236855j3875126L538906J8143118
$$ 851969004 850617826 847976744 843914926 835850060 820613205 806738079 810276985 828420103
1030H28420103J4738917N656838J029492k15352J30654k37406q07941l40938l71039
$$ 828420103 843159020 848815858 849845350 849629998 849760652 849523246 848715305 848374367 848003328
1048.4H48003328q96573m11749k95460j052678j145899j592875l544450n805015q622527
$$ 848003328 847106755 846695006 846399546 845346868 844200969 842608094 839063644 833258629 824636102
1066.7H24636102j1398673r646237q52525J0972082J6983390J3309479N923867J521587
$$ 824636102 813237429 803591192 802738667 813710749 830694139 844003618 849927485 851449072
1083H51449072L42369p20202j889885k104044k748072l910601l894091k717137k69413
$$ 851449072 851791441 851071239 849181354 847077310 844329238 840418637 836524546 833807409 833537996
1101.4H33537996K499401K167821j092612l381253l839552l909230l299177k683342
$$ 833537996 836037397 838205218 837112606 833731353 829891801 825982571 822683394 820000052
1117.7H20000052l577947m453063m612863n020380j506806P801354J4003396J2033284
$$ 820000052 816422105 811969042 807356179 802335799 800828993 808630347 822633743 834667027
1134H34667027P485747M008711J478493N83291L37780m10617m89175k76983j113236
$$ 834667027 842152774 846161485 847639978 848223269 848561049 848150432 847661257 847384274 846271038
1152.4H46271038j773238j733303k116442k234697k023876l164530m815399n748928
$$ 846271038 844497800 842764497 840648055 838413358 836389482 833224952 828409553 822660625
1168.7H22660625p908940j1016786j1404932q213639k002001N220532O811083K946555
$$ 822660625 814751685 803734899 792329967 784116328 782114327 787334859 794145942 797092497
1185G97092497M326284J1932910J4642298J0177612M778445Q03351j413643k243459
$$ 797092497 801418781 813351691 827993989 838171601 842950046 843753397 842339754 840096295
1201.3H40096295l549278m959941n553067o543695p540048p208645o922066p079303
$$ 840096295 836547017 831587076 826034009 819490314 811950266 804741621 797819555 790740252
1217.7G90740252o034375m522443l848969l538073m294991n794227l248334N403995
$$ 790740252 784705877 780183434 776334465 772796392 768501401 762707174 759458840 764862835
1234G64862835J3734758J5377403J1291444N656779J837909M01795p14898j800537
$$ 764862835 778597593 793974996 805266440 810923219 812761128 813162923 812448025 810647488
1250.3H10647488j863480j946866k431214k415717k876997m378617n618155p068753
$$ 810647488 808784008 806837142 804405928 801990211 799113214 794734597 789116442 782047689
1266.6G82047689r513140j1291444j1230052r538412o749928n255997p362842j1436820
$$ 782047689 772534549 761243105 750013053 740474641 733724713 728468716 721105874 709669054
1282.9G09669054j5141845j8079460j8035591j2313663k175808Q727371J6333163J7398775
$$ 709669054 694527209 676447749 658412158 646098495 643922687 652650058 668983221 686381996
1299.2F86381996J4046788J3373971J8300950K3008347K0382702J0274589j816868
$$ 686381996 700428784 713802755 732103705 755112052 775494754 785769343 783952475
1313.5G83952475j0316253j5456081k1897733k7141034k3802281j1443317O526768
$$ 783952475 773636222 758180141 736282408 709141374 685339093 673895776 680422544
1327.8F80422544K4836302L4142256L1310022K3227513J5888691J0569453P258594
$$ 680422544 705258846 739401102 770711124 793938637 809827328 820396781 827655375
1342.1H27655375M904568K788186J655400J325250Q97169Q25047P89225m58061k098382
$$ 827655375 832559943 835348129 837003529 838328779 839225948 840050995 840840220 840382159 838283777
1360.4H38283777l024161l799498m832029n637705o153822o421566n736947m759789
$$ 838283777 835259616 831460118 826628089 820990384 814836562 808414996 802678049 797918260
1376.7G97918260m963934n578578n281389l141582J087308M504383M348636L220498
$$ 797918260 792954326 787375748 782094359 778952777 780040085 784544468 788893104 792113602
1393.1G92113602L353357L457368L002643K397359P26879j546741l491998n806744
$$ 792113602 795466959 798924327 801926970 804324329 805051208 803504467 800012469 794205725
1409.4G94205725q510291j0264874j1209071j2353956j1813164p363141k928078Q10206
$$ 794205725 785695434 775430560 764221489 751867533 740054369 732691228 729763150 730573356
1425.7G30573356N499065J1677980J7380894J8982291J8756032J6411602J0124088
$$ 730573356 736072421 747750401 765131295 784113586 802869618 819281220 829405308
1440H29405308L728986k989352j2804628k6541173l4302890k5504768j263321K9945910
$$ 829405308 833134294 830144942 817340314 790799141 756496251 730991483 729728162 759674072
1456.3G59674072M1019857K2140145R762466P459105P257461N192101K820730K037943
$$ 759674072 800693929 822834074 832596540 840055645 847313106 852505207 855325937 857363880
1472.6H57363880J996278J606286J268387N42700l90768j092315k412021m626632o121873
$$ 857363880 859360158 860966444 862234831 862777531 862386763 861294448 858882427 854255795 848133922
1491H48133922n862177m393458J024544P652640P228256K956390l06785j259208J61708
$$ 848133922 842271745 837878287 838902831 846555471 853783727 856740117 856433332 855174124 855335832
1509.3H55335832N08308o11067j727104j806319j743495j993179q88765k1160R239
$$ 855335832 855844140 855233073 853505969 851699650 849956155 847962976 847074211 847053051 847062290
1527.7H47062290J93178k40028q26180n92529j101852k414524j477480j31071m65989
$$ 847062290 847255468 847015440 846189260 845596731 844494879 842080355 840602875 840471804 840005815
1546H40005815j035035j072764j005769j255393j559973k068162o36577Q08418k67446
$$ 840005815 838970780 837898016 836892247 835636854 834076881 832008719 831372142 832180560 831913114
1564.4H31913114j611054k105356k140343k583325m633665p901311r842395j2123406
$$ 831913114 830302060 828196704 826056361 823473036 818839371 810938060 801095665 788972259
1580.7G88972259j2366891j487851J6150474K1531761J0483861k281964q995712j2605548
$$ 788972259 776605368 775117517 791267991 812799752 823283613 821001649 812005937 799400389
1597G99400389j4755904j3463855o428004N237043J4375687J4456153P759631J194298
$$ 799400389 784644485 771180630 764752626 769989669 784365356 798821509 806581140 807775438
1613.4H07775438l582418n519271k062857P41839N22852k54214o51478j175642j458466
$$ 807775438 804193020 798673749 796610892 797352731 797875583 797621369 796969891 795794249 794335783
1631.7G94335783j763583k011656j148046o35921j274825k372026l312886k959609
$$ 794335783 792572200 790560544 789412498 788776577 787501752 785129726 781816840 778857231
1648G78857231k286434l655136m157900k191008k385377l763080n572319o973326q188010
$$ 778857231 776570797 772915661 768757761 766566753 764181376 760418296 754845977 747872651 739684641
1666.4G39684641j1930704j5896737j6084671j8616855k1718801k0805180k0788192
$$ 739684641 727753937 711857200 695772529 677155674 655436873 634631693 613843501
1680.7F13843501k3375154k4927258j5270293m976213P83980M354954N930781N386174
$$ 613843501 590468347 565541089 550270796 545294583 546078563 550433517 556364298 561750472
1697E61750472J741290k132178k479136L865540J8434942K9820681K7984321J9119441
$$ 561750472 563491762 561359584 558880448 562745988 581180930 611001611 638985932 658105373
1713.3F58105373J2497008J1550725J2613415J3091386J5467524J7798484J7738282
$$ 658105373 670602381 682153106 694766521 707857907 723325431 741123915 758862197
1727.6G58862197J6238511J3650119J2279809J0719299P193923M999757L936529K867460
$$ 758862197 775100708 788750827 801030636 811749935 818943858 823943615 827880144 830747604
1743.9H30747604J946569J338124J676262K380371K342343K023399J739740J185894
$$ 830747604 832694173 834032297 835708559 838088930 840431273 842454672 844194412 845380306
1760.2H45380306R02057Q70883K24591k71499m11034l05653L13819M32789k42531o81281
$$ 845380306 846282363 847153246 847377837 847106338 846695304 846389651 846703470 847136259 846893728 846212447
1780.6H46212447o34551p23303n86986l30329k86103K78295J184105J148940P53998
$$ 846212447 845577896 844854593 844267607 843937278 843651175 843929470 845113575 846262515 847016513
1799H47016513R34482J251519J047671O91115M84050L57508M38035L36647m8637k93732
$$ 847016513 847950995 849202514 850250185 850941300 851425350 851782858 852220893 852557540 852508903 852215171
1819.4H52215171l23117k99990J01149O13689P82609J112104J211285P91610M54306
$$ 852215171 851892054 851592064 851693213 852306902 853089511 854201615 855412900 856204510 856658816
1837.7H56658816L73125J789k79308L08275P60019N56410L18527J24693j19865j85907
$$ 856658816 857031941 857033730 856754422 857062697 857822716 858379126 858697653 858822346 858702481 858516574
1858.1H58516574j48356k20776l85880o21259o76573j37746K89977O4432j76310j62661
$$ 858516574 858368218 858147442 857761562 857140303 856463730 856325984 856615961 856680393 856504083 856341422
1878.5H56341422j67609k27809j87814k13623l18587j81615p3612k30789k55644k01106
$$ 856341422 856173813 855946004 855758190 855544567 855225980 855044365 854970753 854739964 854484320 854283214
1898.9H54283214l26097m70162o37412r71079j307726j401603j232445p45177N5611
$$ 854283214 853957117 853486955 852849543 851878464 850570738 849169135 847936690 847191513 847247124
1917.3H47247124P36952Q26299P79092Q72254O86825K93016J3530J04189N94855J005590
$$ 847247124 847984076 848810375 849589467 850461721 851148546 851441562 851455092 851559281 852154136 853159726
1937.7H53159726R28402O41048N24818M01497J68026J5020n4836p9572q226O3777M9413
$$ 853159726 854088128 854729176 855253994 855655491 855823517 855838537 855783701 855704129 855695903 855759680 855809093
1960.1H55809093l3021l13700q48949j202583q83341l6776O77347Q28803O11782L07620
$$ 855809093 855776072 855462372 854613423 853410840 852527499 852490723 853168070 853996873 854608655 854916275
1980.5H54916275k6465m32193p62403o78718j26005N48840R11415Q26776N45025L38435
$$ 854916275 854889810 854457617 853695214 853016496 852890491 853439331 854350746 855177522 855722547 856060982
2000.9H56060982K13980N8830m6849l6001n8890p9810l5346q8870k34366k98679m07636
$$ 856060982 856274962 856333792 856286943 856250942 856192052 856112242 856076896 855988026 855753660 855454981 855047345
2023.3H55047345l42250L36886Q28564N39184K06768J08063M173J549R7931P4982L815
$$ 855047345 854705095 855041981 855870545 856409729 856616497 856724560 856728733 856730282 856828213 856903195 856907010
2045.8H56907010j9073r4295j18136m6194o3837j42335j63973k32518l27527k85447
$$ 856907010 856887937 856793642 856675506 856629312 856565475 856423140 856259167 856026649 855699122 855413675
2066.2H55413675k87890m30465m82499n36621o83367o90282o33776o70850o10054m16219
$$ 855413675 855125785 854695320 854212821 853676200 852992833 852302551 851668775 850997925 850387871 849971652
2086.6H49971652k14219P0155M17828N88119N77152N31256M04120K55286K05815J21415
$$ 849971652 849757433 849827588 850245416 850833535 851410687 851941943 852346063 852601349 852807164 852928579
2106.9H52928579K9504J00613J28209J0848o318P5043R2983J08182J11223N1379J15156
$$ 852928579 852958083 853058696 853186905 853197753 853191435 853266478 853359461 853467643 853578866 853630245 853745401
2129.4H53745401K32398J34349p033o0l2842o6995K0802J0669j22309j86264k40386
$$ 853745401 853977799 854112148 854105115 854105055 854072213 854005218 854026020 854036689 853914380 853728116 853487730
2151.8H53487730k91347j92523j16289j92404k11298j99378l04341l21865j65820r0659
$$ 853487730 853196383 853003860 852887571 852695167 852483869 852284491 851980150 851658285 851492465 851401806
2172.2H51401806j09792j16289j89065k08498r0956o4433q4758J4365O6519J9848J8895
$$ 851401806 851292014 851175725 850986660 850778162 850687206 850622773 850538015 850552380 850618899 850638747 850657642
2194.6H50657642j0371q0765n6505p1227j79172j81496j38044j90258j80722r2804
$$ 850657642 850647271 850566506 850510001 850438774 850259602 850078106 849940062 849749804 849569082 849476278
2215H49476278j09613j29163p2718r7334j51158j63913k56300l41594l10957l08812
$$ 849476278 849366665 849237502 849164784 849067450 848916292 848752379 848496079 848154485 847843528 847534716
2235.4H47534716l56078l52740l70026l88503k84016j84357j73390j12474o2227j30117
$$ 847534716 847178638 846825898 846455872 846067369 845783353 845598996 845425606 845313132 845250905 845120788
2255.8H45120788j41204o3777m8220n0247m1067j04726j68383j62184k01166k78175
$$ 845120788 844979584 844915807 844867587 844817340 844776273 844671547 844503164 844340980 844139814 843861639
2276.2H43861639k92539k96116l03268k70904k63929k86698k59221k46584l13282l61026
$$ 843861639 843569100 843272984 842969716 842698812 842434883 842148185 841888964 841642380 841329098 840968072
2296.6H40968072l50058l39865l25323l18765l80159m35292m08173l96907m28140n19634
$$ 840968072 840618014 840278149 839952826 839634061 839253902 838818610 838410437 838013530 837585390 837065756
2317H37065756p14004q26478p16269n67198n54978n48184m50313m49717n63622o02484
$$ 837065756 836351752 835525274 834809005 834241807 833686829 833138645 832688332 832238615 831674993 831072509
2337.4H31072509n57124m43817j99377K47776N49496K71201l21090p43688q08358p07507
$$ 831072509 830515385 830071568 829872191 830119967 830669463 830940664 830619574 829875886 829067528 828360021
2357.8H28360021n39899l03030j10268K38J60992L31938L92557L70800L44038L02434
$$ 828360021 827820122 827517092 827406824 827407062 827568054 827899992 828292549 828663349 829007387 829309821
2378.2H29309821K07722P8142q5950k37763l10421l50714m00900m34280m56869m61102
$$ 829309821 829517543 829595685 829509735 829271972 828961551 828610837 828209937 827775657 827318788 826857686
2398.6H26857686m15921l79145l98219m38869m75705m85599m47809l89874l63171l83079
$$ 826857686 826441765 826062620 825664401 825225532 824749827 824264228 823816419 823426545 823063374 822680295
2419H22680295m37975m94600m88400m24028l79681l91603m25279m48823m66168m56035
$$ 822680295 822242320 821747720 821259320 820835292 820455611 820064008 819638729 819189906 818723738 818267703
2439.4H18267703m44949m75883n16772n53668n93901o13331n84722n33581m94718m59194
$$ 818267703 817822754 817346871 816830099 816276431 815682530 815069199 814484477 813950896 813456178 812996984
2459.8H12996984m29035m10020m18246m72188n19931n30422n33044n12898m67360m41969
$$ 812996984 812567949 812157929 811739683 811267495 810747564 810217142 809684098 809171200 808703840 808261871
2480.2H08261871m39822m69506n38707o08981o70194p33972p99179q50618q79347q47220
$$ 808261871 807822049 807352543 806813836 806204855 805534661 804800689 804001510 803150892 802271545 801424325
2500.6H01424325p39098o33717n89668o05226o59168p16805p71880q52824r28819r75370
$$ 801424325 800685227 800051510 799461842 798856616 798197448 797480643 796708763 795855939 794927120 793951750
2521G93951750j034498j092256j112759j124799j169145j222849j254916j282632j301170
$$ 793951750 792917252 791824996 790712237 789587438 788418293 787195444 785940528 784657896 783356726
2539.3G83356726j289427j266420j215696j116693j028419r36568p87496o25193m41850
$$ 783356726 782067299 780800879 779585183 778468490 777440071 776503503 775716007 775090814 774648964
2557.7G74648964k11954k2471J37925L96967P58708J180053J662075K105415K380610
$$ 774648964 774437010 774414539 774552464 774949431 775708139 776888192 778550267 780655682 783036292
2576G83036292K480447K359569J980662J490772R50039L11017k87772p57336j157344
$$ 783036292 785516739 787876308 789856970 791347742 792297781 792608798 792321026 791563690 790406346
2594.4G90406346j414954j451910j347422j080156n69284M0114O17087J134455J372218
$$ 790406346 788991392 787539482 786192060 785111904 784542620 784582734 785199821 786334276 787706494
2612.8G87706494J225114R52125O63578L06130k0623l31641o86109r39369j040995
$$ 787706494 788931608 789883733 790547311 790853441 790832818 790501177 789815068 788875699 787834704
2631.1G87834704j097858j070321r33408q42810q01981o68346m94898m26471m86672
$$ 787834704 786736846 785666525 784733117 783890307 783088326 782419980 781925082 781498611 781011939
2649.5G81011939o49273q19505q69453q56339q67188q16763p32183p14660o61612n22315
$$ 781011939 780362666 779543161 778673708 777817369 776950181 776133418 775401235 774686575 774024963 773502648
2669.9G73502648m06027k91705j10746O3420K39074M81069P37012J032292J412034
$$ 773502648 773096621 772804916 772694170 772757590 772996664 773477733 774214745 775247037 776659071
2688.2G76659071J746953K020180K359152K650559K716362K585710K246618J710415
$$ 776659071 778406024 780426204 782785356 785435915 788152277 790737987 792984605 794695020
2704.5G94695020J173317O56307J05739k89917m95613o96302q05258p10130n58615
$$ 794695020 795868337 796524644 796630383 796340466 795844853 795148551 794343293 793633163 793074548
2722.9G93074548l47435m7207J87695M04000O76274P87020O39081M18842J64032j52588
$$ 793074548 792727113 792679906 792867601 793271601 793947875 794734895 795373976 795792818 795956850 795804262
2743.3G95804262l76999n40436p54952q33988p12216n95272n56588n50866n57363m95374
$$ 795804262 795427263 794886827 794131875 793297887 792585671 791990399 791433811 790882945 790325582 789830208
2763.7G89830208l51489k82168l75748n58495p93100j038849j089275q76665n76735
$$ 789830208 789478719 789196551 788820803 788262308 787469208 786430359 785341084 784464419 783887684
2782G83887684l70919l81768n84662q88527j205205j372993j346589j352846j500547
$$ 783887684 783516765 783134997 782550335 781661808 780456603 779083610 777737021 776384175 774883628
2800.4G74883628j583338j560390j575410j575709j539349j573444j561284j395762
$$ 774883628 773300290 771739900 770164490 768588781 767049432 765475988 763914704 762518942
2816.7G62518942j248836j199365j140654j056433r60827q21411o88076n95510m67479
$$ 762518942 761270106 760070741 758930087 757873654 756912827 756091416 755403340 754807830 754340351
2835.1G54340351l06011k84254l96192m02987k95937j76549P927L11196O78062R83179
$$ 754340351 754034340 753750086 753353894 752950907 752654970 752478421 752486348 752797544 753475606 754458785
2855.5G54458785J053631P50304K04026l44872p81596j013398r53674p13230o22034
$$ 754458785 755512416 756262720 756466746 756121874 755340278 754326880 753373206 752659976 752037942
2873.8G52037942p16030o88434n32627m53591m66824m30941k25425J1861J56403L18646
$$ 752037942 751321912 750633478 750100851 749647260 749180436 748749495 748524070 748535931 748692334 749010980
2894.2G49010980M21405L73900L78609M31120L24249J12832p5758k23338l11315m14431
$$ 749010980 749432385 749806285 750184894 750616014 750940263 751053095 750977337 750753999 750442684 750028253
2914.6G50028253n86868o75201n73397l33726k9624L39508N70178L87967Q4102l6597
$$ 750028253 749441385 748766184 748192787 747859061 747829437 748168945 748739123 749127090 749211192 749174595
2935G49174595j36614k63691k57909k26796l88026o42061p08878n10693l73900m32014
$$ 749174595 749037981 748774290 748516381 748289585 747901559 747259498 746550620 746039927 745666027 745234013
2955.4G45234013m17531k90692k35200l08633l43859k48611j50561p7069j15275l74317
$$ 745234013 744816482 744525790 744290590 743981957 743638098 743389487 743238926 743161857 743046582 742672265
2975.8G42672265n47588n26369n77867o26683n90325o37412o80208p34925r61781j074493
$$ 742672265 742124677 741598308 741020441 740393758 739803433 739166021 738485813 737750888 736789107 735714614
2996.2G35714614j007497j004815r79245q91506q27194o50167k99037j10685k58565
$$ 735714614 734707117 733702302 732723057 731831551 731004357 730354190 730055153 729944468 729685903
3014.5G29685903m35532m86075n28753m90785m22239n21839n85854m53830k98082k24770
$$ 729685903 729250371 728764296 728235543 727744758 727322519 726800680 726214826 725760996 725462914 725238144
3034.9G25238144J9133N65827Q63374O09934R5427l90351o86466j028002j567960k036810
$$ 725238144 725257277 725823104 726686478 727296412 727391839 727001488 726315022 725287020 723719060 721682250
3055.3G21682250k443373k693355k309203j418233r63747j578749k321600j294375
$$ 721682250 719238877 716545522 714236319 712818086 711854339 710275590 707953990 706659615
3071.7G06659615K029479N508542O350696M613816K615691J438915P35879M10080L22461
$$ 706659615 708689094 714197636 720548332 725162148 727777839 729216754 729952633 730362713 730685174
3090G30685174K40446M60803R46879J137376R46403O73354N27262O16431P60258O76691
$$ 730685174 730925620 731386423 732333302 733470678 734417081 735090435 735617697 736234128 736994386 737671077
3110.4G37671077P02381J029313J067519P28667M19557K26557K45929N06818O83546
$$ 737671077 738373458 739402771 740470290 741198957 741618514 741845071 742091000 742597818 743281364
3128.8G43281364N54562M04716M76181O06477N80848L35693J15931J78933L67701M86493
$$ 743281364 743835926 744240642 744716823 745323300 745904148 746239841 746355772 746534705 746902406 747388899
3149.2G47388899N41866M22657J35600L6180J67430K04742J51932K44319L86656M19676
$$ 747388899 747930765 748353422 748489022 748525202 748692632 748897374 749049306 749293625 749680281 750099957
3169.6G50099957M49538M50194L26574K54035L27885L66509L59297M24266M69804M86552
$$ 750099957 750549495 750999689 751326263 751580298 751908183 752274692 752633989 753058255 753528059 754014611
3189.9G54014611N38886M85718L72470M15503M67122L96013M11153M83513M57466M46617
$$ 754014611 754553497 755039215 755411685 755827188 756294310 756690323 757101476 757584989 758042455 758489072
3210.3G58489072M27187L25739L30985L93033K90751K03193K38537K09034K26557M01497
$$ 758489072 758916259 759241998 759572983 759966016 760256767 760459960 760698497 760907531 761134088 761535585
3230.7G61535585L99351J05739r1255o6638K1875J84297L18349K25246L9875n662Q2016
$$ 761535585 761934936 762040675 761949420 761882782 761904657 762088954 762407303 762632549 762672424 762666762 762748778
3253.2G62748778J86920J50919K9087N0366J54257J87695K87473M41074K67029p3671
$$ 762748778 762935698 763086617 763115704 763166070 763320327 763508022 763795495 764236569 764503598 764429927
3273.6G64429927j36674r0241o8545J0848m590j05381k7537J63734J54555k5928k13743
$$ 764429927 764293253 764203012 764134467 764145315 764140725 764035344 764007807 764171541 764326096 764300168 764086425
3296G64086425m03464l83019j09673K1935j41144m88043q45790r29176p46787o67095
$$ 764086425 763682961 763299942 763190269 763212204 763071060 762583017 761737227 760808051 760061264 759394169
3316.4G59394169p28548p13765o98090p63535q76546j018107j065374r79840r12607
$$ 759394169 758665621 757951856 757253766 756490231 755613685 754595578 753530204 752550364 751637757
3334.8G51637757r48370j085341j266539j369655j359105j291990j285196j415133
$$ 751637757 750689387 749604046 748337507 746967852 745608747 744316757 743031561 741616428
3351.1G41616428j588106j677275j623452j546740j664698j820147j776457j732707
$$ 741616428 740028322 738351047 736727595 735180855 733516157 731696010 729919553 728186846
3367.4G28186846j819730j880229j856446j818716j758278j689076j664818j570463
$$ 728186846 726367116 724486887 722630441 720811725 719053447 717364371 715699553 714129090
3383.7G14129090j412213j344859j281321j206219j248718j249849j074076r59397
$$ 714129090 712716877 711372018 710090697 708884478 707635760 706385911 705311835 704352438
3400G04352438j041293j061916r24945q18372p46607p27058q07762q24869p38978o51956
$$ 704352438 703311145 702249229 701324284 700505912 699759305 699032247 698224485 697399616 696660638 696008682
3420.4F96008682m87268k82943j90675j14084k2053L5941J10805J40787L5345r477
$$ 696008682 695521414 695238471 695047796 694933712 694911659 694947600 695058405 695199192 695234537 695225060
3440.8F95225060J91271L86954M30166N04554N90682N68509N83112P21037P99180P34329
$$ 695225060 695416331 695803285 696233451 696738005 697328687 697897196 698480308 699201345 700000525 700734854
3461.2G00734854P70151R80437J072765Q50081N08070M90963P92981J024961R70543
$$ 700734854 701505005 702485442 703558207 704408288 704916358 705407321 706200302 707225263 708195806
3479.6G08195806P67886P56681R09627R49621Q96811R03845R83715J066268J031100
$$ 708195806 708963692 709720373 710630000 711579621 712476432 713380277 714363992 715430260 716461360
3497.9G16461360J002968J082659J051008R47416R98199J217127J462698J447678J188576
$$ 716461360 717464328 718546987 719597995 720545411 721543610 722760737 724223435 725671113 726859689
3516.3G26859689J101017J280248J420677J300335J158475J283646J495540J583815
$$ 726859689 727960706 729240954 730661631 731961966 733120441 734404087 735899627 737483442
3532.6G37483442J568854J473248J412093J479328J463473J311242J224637J264036
$$ 737483442 739052296 740525544 741937637 743416965 744880438 746191680 747416317 748680353
3548.9G48680353J325011J375974J399159J387239J414001J356720J070917Q43525
$$ 748680353 750005364 751381338 752780497 754167736 755581737 756938457 758009374 758852899
3565.2G58852899J269519K009750K039730J686037J579821J654327J733839J747966
$$ 758852899 760122418 762132168 764171898 765857935 767437756 769092083 770825922 772573888
3581.5G72573888J598835J273752J277625J870811K051532J724065J689434J897156
$$ 772573888 774172723 775446475 776724100 778594911 780646443 782370508 784059942 785957098
3597.9G85957098J878977J798510J707495J370012J219631J478910J574695J532614
$$ 785957098 787836075 789634585 791342080 792712092 793931723 795410633 796985328 798517942
3614.2G98517942J422346J326740J689792J875519J320958M89712M14252J486063J810968
$$ 798517942 799940288 801267028 802956820 804832339 806153297 806643009 807057261 808543324 810354292
3632.5H10354292J382173J117348R30250P65622N50031K4140n70834j87158J123011
$$ 810354292 811736465 812853813 813784063 814549685 815099716 815123856 814553022 814365864 815488875
3650.9H15488875J347601P11501O50942R45866O58393K02179j2040l33428n38469j77323
$$ 815488875 816836476 817547977 818198919 819144785 819803178 820005357 819993317 819659889 819121420 818944097
3671.3H18944097k25604m26233M10974J008868Q71599N56827J36256j50561Q3685P40826
$$ 818944097 818718493 818292260 818703234 819712102 820583701 821140528 821276784 821126223 821209908 821950734
3691.7H21950734J072764Q29876K84433j69516j01804K87890J17421m82678o73831
$$ 821950734 823023498 823853374 824137807 823968291 823866487 824154377 824271798 823789120 823115289
3710H23115289K027P76648O15776J5676l14713l42667k08735J22964L17097r1851o64472
$$ 823115289 823117316 823893964 824509740 824525416 824210703 823868036 823659301 823782265 824099362 824007511 823343039
3732.5H23343039m77970M73380Q87036J34290r10402p94172J71006l1948k05517P05182
$$ 823343039 822865069 823338449 824225485 824359775 823449373 822655201 822826207 822794259 822588742 823293924
3752.9H23293924R03786K35259l7610L09705K85507j36495k60115q5950K57194M20571
$$ 823293924 824197710 824432969 824395359 824705064 824990571 824854076 824593961 824508011 824765205 825185776
3773.3H25185776J36912k14458k04444M2260O8307K7776J06036J11819l2187l44574
$$ 825185776 825322688 825108230 824903786 824946046 825014353 825042129 825148165 825259984 825227797 824883223
3793.7H24883223n61059m85718n59926l59059K90335K56002K29060N04613J14322o27041
$$ 824883223 824322164 823836446 823276520 822917461 823207796 823463798 823692858 824197471 824311793 823684752
3814.1H23684752p09653l13401l27289J14202O31988L21806j9670k35796l53694k80738
$$ 823684752 822975099 822661698 822334409 822448611 823080599 823402405 823382735 823146939 822793245 822512507
3834.4H22512507m04477m06027J14143N04792N46277K93553l32594j225174j495421
$$ 822512507 822108030 821702003 821816146 822320938 822867215 823160768 822828174 821603000 820107579
3852.8H20107579J36495J215219O07551j17183l78609k04742j65641l28243K9624M29332
$$ 820107579 820244074 821459293 822066844 821949661 821571052 821366310 821200669 820872426 820902050 821331382
3873.2H21331382L92854R6560l29376k43664J3114j1743R2388n2929k13087J46806
$$ 821331382 821724236 821820796 821491420 821247756 821260870 821249127 821341515 821288586 821075499 821222305
3893.6H21222305K12491l32177p29739n36502N2273O51956P16805K90037n6148k15411
$$ 821222305 821434796 821102619 820372880 819836378 819888651 820540607 821257412 821547449 821491301 821275890
3914H21275890l37541k22326M3393L9637o8605L1113K8313j85013j29044J53482J61886
$$ 821275890 820938349 820716023 820759416 820799053 820730448 820761561 820789874 820604861 820475817 820629299 820791185
3936.4H20791185k39j37090j78933n5492m1545q3267M3153J20163L9935j6987O795
$$ 820791185 820790946 820653856 820474923 820419431 820377886 820294619 820337772 820457935 820497870 820480883 820487678
3958.9H20487678j8239o2048m8638n9604o5268m3332q4460j11580n1558l4570l0339
$$ 820487678 820469439 820407391 820358753 820299149 820233881 820190549 820106089 819994509 819942951 819908381 819878042
3981.3H19878042L3498j7226j28687r9420m8936p4207j14322j40786
$$ 819878042 819911540 819894314 819765627 819666207 819617271 819543064 819428742 819287956
3997.6H19287956
$$ 819287956
##END=$$ End of the data block
