##TITLE=B8M - Amanda 1 $$ Begin of the data block
##JCAMP-DX=5.00 $$ ACD/SpecManager v 10.08
##SPECTROMETER/DATA SYSTEM=Alpha
##DATE=22 Jun 2015 10:50:00
##DATA TYPE=INFRARED SPECTRUM
##DATA CLASS=XYDATA
##ORIGIN=
##OWNER=
##NPOINTS=1765
##FIRSTX=399.76428223
##LASTX=3997.64306641
##MAXX=3997.64306641
##MINX=399.76428223
##MAXY=0.86036932
##MINY=0.30344132
##XFACTOR=1.0000000000
##YFACTOR=1.000000000000000e-9
##FIRSTY=0.85064447
##DELTAX=2.03961372
##XUNITS=1/CM
##YUNITS=ARBITRARY UNITS
##XYDATA=(X++(Y..Y))
399.8H50644469k70784l160298l87549K007008j339734k384245J374006J690328j885652
418.1H46287549k061666o51419m090726o996274m567981k377450j562357K744376O487310
436.5H33211362L211856n94854J219273J882851j902283k259671J443147Q25763k284408
454.8H34753036l07559J917660j429379k846062P52031J405716j754403r22799K272010
473.2H33840251M13895k094865P59125K747118m14729j358867J835704J174450k253950
491.5H34648132q13543J839399q13782l020227l27885M44591k800823k882421J5259
509.9H26288700j186430l957391k090275O4313k556801m180133j772702j745284n230009
528.3H03633988n834401m330039o457090r525538q399486o720841q072972q149088
$$ y = [850644469, 850373685, 847213387, 846825838, 848832846, 847493112, 845108867, 846482873, 848173201, 846287549, 844225883, 843574464, 839483738, 832487464, 827919483, 825542033, 823979676, 826724052, 833211362, 836423218, 835828364, 837047637, 838930488, 837028205, 834768534, 836211681, 837037444, 834753036, 834445477, 836363137, 834933758, 832087696, 832839727, 834245443, 832491040, 831568241, 833840251, 834254146, 832159281, 832918406, 835665524, 835250795, 833891928, 835727632, 836902082, 834648132, 833834589, 835673988, 834860206, 831839979, 831512094, 831956685, 829155862, 826273441, 826288700, 825102270, 821144879, 819054604, 819118917, 816562116, 812381983, 810609281, 808863997, 803633988, 797799587, 793469548, 787012458, 777486920, 769087434, 762366593, 754293621, 746144533]
544.6G46144533n639255n420327o773353l448486N017936J3419032J9595325K3022235
560.9G85917640K0763039J3092995P091522N654037L686309M47035L91066K053320
577.2H39096963O04093j299321J54257J511514l01659j079321P50601P57158j132250
595.6H39062035o73711J170039J54495j498818m62294M06146j517832k880991k332568
613.9H31426501j838207o76513J397312K187431N90384q51095l695R31620o13987j895428
634.3H30654323j243532j971721n855680j0099649j2938917j1051655J723707J3888001
650.6H03104877J0573090k40386p048190j1147260j9945801l7593960n1035106m5293510
667F41373754J4634132P2055697O2561989K9406190k878070k5701046m2946279l5709858
$$ y = [746144533, 740505278, 735084951, 728311598, 724863112, 729881048, 743300080, 762895405, 785917640, 806680679, 819773674, 826865196, 832519233, 836205542, 836652577, 837043643, 839096963, 839701056, 838401735, 838555992, 840067506, 839765847, 838686526, 839437127, 840194285, 839062035, 838388324, 839558363, 839712858, 838214040, 837751746, 838157892, 836640060, 833759069, 831426501, 829588294, 828911781, 830309093, 832496524, 833086908, 832235813, 832232118, 833163738, 832549751, 830654323, 829410791, 827439070, 821583390, 811483741, 798544824, 787493169, 789216876, 803104877, 813677967, 813437581, 806389391, 795242131, 775296330, 737702370, 686667264, 641373754, 656007886, 728063583, 790625572, 820031762, 817153692, 791452646, 748506367, 712796509]
683.3G12796509N016029L7326038K8240025K800584j4470041k5829315l8713992n8337927
699.6F48827910q5553526j06045843r2029631l7481665K8822392Q0737233J08942002
713.9E46218872J06054246P8277588M8875571K9316544J6866446R948313P133067M742860
730.2H47433507J604021K09212P51436K39194r35853n95450P0810r87649j682341m08232
750.6H45698655K15113r07302j082122Q9526k85745j729488j619101q86857j956642
768.9H37536037l122926k245188j307606j905918j902700N5850J597523J513422J390696
787.3H31609190J281082p85947l844082o060481r194791j4484287j7886579j4533520
803.6G66100585o684601l627539m316449P697046K4874985K4206460J4864921J1245311
$$ y = [712796509, 717812538, 755138576, 783378601, 786179185, 771709144, 745879829, 707165837, 648827910, 563274384, 457228541, 365198910, 327717245, 356539637, 437276870, 546218872, 652273118, 730550706, 779426277, 808742821, 825609267, 835557580, 842690647, 847433507, 849037528, 849246740, 849998176, 850237370, 849301517, 848706067, 848776877, 847789228, 846106887, 845698655, 845913768, 845006466, 843924344, 844013870, 843728125, 841998637, 840379536, 839492679, 837536037, 834413111, 832167923, 830860317, 828954399, 827051699, 827107549, 828705072, 830218494, 831609190, 832890272, 832104325, 828260243, 822199762, 813004971, 798520684, 780634105, 766100585, 759415984, 755788445, 751471996, 759169042, 784044027, 808250487, 823115408, 834360719]
819.9H34360719Q365035M381358K599240K002179Q68023O92069J936972K095521Q28505
838.3H58129621O38008J257836L43860j183629j231373j213371k514780k574801K28285
856.6H51879656K278984R98437n01573l88860p90656j968145j997054j429916k045273
875H46035600k876222k414942k010107k915740l565967l129542l307104m558921n081058
893.4H16175997m882097n644619p056535p653057q035541r437680j0897041j1361479
909.7G51207948j1828900j2935280j3282717j2376547j1425256j0920346j0464609
923.9F67974293j0835111j2827575j4525175j2938202o689608M233003J5639961J8155157
940.3F48186743J1998713Q605778J1693359J6174316J8682421J9099950J8516660J7241895
$$ y = [834360719, 842725754, 847107112, 849706352, 851708531, 852576554, 853268623, 855205595, 857301116, 858129621, 858767629, 860025465, 860369325, 859185696, 857954323, 856740952, 854226172, 851651371, 851879656, 854158640, 855157077, 854655504, 854266644, 853475988, 851507843, 849510789, 848080873, 846035600, 843159378, 840744436, 838734329, 835818589, 832252622, 829123080, 825815976, 821257055, 816175997, 811293900, 805649281, 798592746, 790939689, 782904148, 773466468, 762569427, 751207948, 739379048, 726443768, 713161051, 700784504, 689359248, 678438902, 667974293, 657139182, 644311607, 629786432, 616848230, 610158622, 614391625, 630031586, 648186743, 660185456, 668791234, 680484593, 696658909, 715341330, 734441280, 752957940, 770199835]
956.6G70199835J4557839J1271476R019197P630407N959154M536330L949166K831399
972.9H29954803J321852J702845L127396K620161P12633m71890k56002k7835j416326
991.3H37267637l751635n038798p682264q266568L302097J3620973Q678794J350224
1007.6H39480460n19276j272738k458930l322482m024386o892503j5604317l0459106
1023.9G74926722l1590462K339065L6713124L1190872R867370N9307j861871j885771
1040.2H19758356k157867k705157k643347k112865k118051k307773k248824k447426
1056.5H01017046l484249m976511o967664j0680497j6171991k1153033k1485687r473264
1072.8G06624150J5652180L2303989K5720835J0749459K075970r46343k186894l223777
$$ y = [770199835, 784757674, 796029150, 805048347, 812678754, 818637908, 823174238, 827123404, 829954803, 831276655, 832979500, 836106896, 838727057, 839439690, 838967800, 838711798, 838683963, 837267637, 833516002, 828477204, 820794940, 812528372, 815830469, 829451442, 838130236, 839480460, 838961184, 837688446, 835229516, 831907034, 827882648, 820990145, 805385828, 774926722, 743336260, 745675325, 782388449, 813579321, 823446691, 823505998, 821644127, 819758356, 817600489, 814895332, 812251985, 810139120, 808021069, 805713296, 803464472, 801017046, 797532797, 792556286, 785588622, 774908125, 758736134, 737583101, 716097414, 706624150, 722276330, 754580319, 780301154, 791050613, 793126583, 792180240, 789993346, 786769569]
1089.2G86769569m091621m729747n895615p522941o357252N46098P586479P536649
1105.5G73841619K870977j183748l530204m526913m797936n853235q297384j1496365
1121.8G37026811j5785337j8431246r250939J2821913K8762638K6389003J5564621
1136.1G77097464P556974L541232J365125J94251K1458K37405L5942n06342j069247
1154.4G88474262j718462k358854k739310l411650n147040p207990q555830j1118710
1170.7G46216416j6595840k1881163k1815300j2412012J481295N581796P41839P513106
1187.1F88830137K7720213L7245035K7596712J3344229M279792j50740k428949m239082
1203.4G92197347o004393p427156q432091q708298p742882o393253n840481n539536
$$ y = [786769569, 782677948, 777948201, 772052586, 764529645, 758172393, 758718491, 766304970, 773841619, 776712596, 775528848, 771998644, 767471731, 762673795, 756820560, 748523176, 737026811, 721241474, 702810228, 693559289, 706381202, 735143840, 761532843, 777097464, 784654438, 788195670, 789560795, 789755046, 789776504, 790013909, 790049851, 789543509, 788474262, 786755800, 784396946, 781657636, 778245986, 773098946, 765890956, 757335126, 746216416, 729620576, 707739413, 685924113, 673512101, 674993396, 680575192, 681317031, 688830137, 716550350, 753795385, 781392097, 794736326, 799016118, 798865378, 796436429, 792197347, 786192954, 778765798, 770333707, 761625409, 753882527, 747489274, 741648793, 736109257]
1219.7G36109257m504562l230095l086090m676580o357849m002750M506111J3550878
1236G28308320J5413463J0457337M334092K77460j837969l344834m893243n896509
1252.3G42818117o008863n996108o679118q208036j0575772j3866186j7790496k1650195
1268.6F52043343k4177134k2985101j7004192j0137558q534432j4039337k2652805
1282.9E32512784k9619634l2686800k9716700j9248307l319859J3193726K4768710
1297.2D55883920K8122693K5889725K6741028L6966383M8972667M6651065K7177811
1311.5F96405292L318369j5325248l2036960n1537455o2196254n0665558k3052752
1325.8D64909434R734303M1741639O2775255O4962744N3735733L9915979K8022826
$$ y = [736109257, 731604695, 728374600, 725288510, 720611930, 714254081, 710251331, 714757442, 728308320, 743721783, 754179120, 758513212, 758790672, 756952703, 753607869, 748714626, 742818117, 736809254, 730813146, 724134028, 715925992, 705350220, 691484034, 673693538, 652043343, 627866209, 604881108, 587876916, 577739358, 569204926, 555165589, 532512784, 502893150, 470206350, 440489650, 421241343, 417921484, 431115210, 455883920, 484006613, 509896338, 536637366, 573603749, 622576416, 669227481, 696405292, 699723661, 684398413, 652361453, 600823998, 538627744, 487962186, 464909434, 474643737, 516385376, 579160631, 644123375, 697859108, 737775087, 765797913]
1340G65797913J8341601J1808276Q050144N361259L536284L437042M336953M043222
1356.4H24712694K249360L59416j691282l983200n516529o308555o667793o564021
1372.7G96590090o171525n690694o073892p260143p116139m427493o74903J549542
1389G60724843J654088N97000r72867k172172k927065l680467n002022p995665j2351156
1407.3G27874517j7113030k1844744k5003016k5780142k6038050k4843514j6818464
1421.6E70433557o910026J020372J0456204K4189174L7623942M3888867M6472013M0277601
1437.9G67451704K3467719R581924k551258j9686937m5692802o9111824o3150883j3522803
1454.3E86784840N8995604Q4804177M6066285K1548450J7231881J5106023J1123299
$$ y = [765797913, 784139514, 795947790, 803997934, 809359193, 812895477, 816332519, 820669472, 824712694, 826962054, 827321470, 825630188, 821646988, 816130459, 809821904, 803154111, 796590090, 790418565, 784727871, 778653979, 771393836, 764277697, 759850204, 759175301, 760724843, 762378931, 762975931, 762003064, 759830892, 756903827, 753223360, 748221338, 740225673, 727874517, 710761487, 688916743, 663913727, 638133585, 612095535, 587252021, 570433557, 563523531, 564543903, 575000107, 599189281, 636813223, 680702090, 727174103, 767451704, 790919423, 800501347, 797950089, 778263152, 732570350, 663458526, 600307643, 586784840, 645780444, 730584621, 776650906, 798199356, 815431237, 830537260, 841660559]
1468.5H41660559Q084476N662859L037989J251638L40461j3470k39492j053393k895474
1486.9H55836153o611943j2581587j6627669j4254570m03107J5987158J6575814R069561
1503.2H46989810M629374J122773k342522k687812k132297k375483l274799l385424
1519.5H36543620l364623l192246j995385p87854r1195R179n30898n57602J81556m94540
1539.9H25720012k462864l222763l454268l070176k172112j461149j120865n69820
1556.2H08185995j278580m685998n540907m897833m878163n543351p351518q245587
1572.6G65764058j0681451j7828643k2544146k4249076k0758033K801478L7101328
1586.8G09605515M6345949K3353636l557562j9048632k7064204k9368222k3046732
$$ y = [841660559, 849745035, 855407894, 858445883, 859697521, 860037982, 860024512, 859785020, 858731627, 855836153, 849224210, 836642623, 820014954, 805760384, 805357277, 821344435, 837920249, 846989810, 851619184, 852741957, 850399435, 847711623, 845579326, 843203843, 839929044, 836543620, 833178997, 829986751, 827991366, 827203512, 827112317, 827121496, 826590598, 826032996, 826214552, 825720012, 823257148, 820034385, 816580117, 813509941, 811337829, 809876680, 808755815, 808185995, 806907415, 802221417, 796680510, 791782677, 786904514, 781361163, 774009645, 765764058, 755082607, 737253964, 714709818, 690460742, 669702709, 672504187, 709605515, 755951464, 779305100, 775747538, 756698906, 729634702, 700266480, 677219748]
1601.1F77219748p060527J3553917K7771592K7629197J6606450M454255n242944r722948
1617.4G45208740l403246L214717L033876J39535j654804l157973l564835l267944
1633.7G36548066m776835o597460o547391o157994o148756p817328r678483q264720
1650.1F80559099r307206j4179349j3258934j1836052j3235748j6503274j9695044
1664.3E82543492k1083355k5514602l1106472l0185491l0338019l1304002k7134746
1678.6C85876805k3463637k2417128k1586776j2707859k260089M717916R294957J2676895
1694.9C30131084J3089269R439856O101221M330277R252548K2461892L3736348L4414232
1711.3D62956727K8569608K4522931K5387049K5888800K5660932K9174447L1901718
$$ y = [677219748, 670159221, 683713138, 711484730, 739113927, 755720377, 760174632, 754931688, 745208740, 741805494, 745020211, 748054087, 748193622, 746538818, 743380845, 739816010, 736548066, 731771231, 725173771, 718626380, 712468386, 706319630, 698502302, 688823819, 680559099, 671251893, 657072544, 643813610, 631977558, 618741810, 602238536, 582543492, 561460137, 535945535, 504839063, 474653572, 444315553, 413011551, 385876805, 362413168, 339996040, 318409264, 305701405, 303441316, 308159232, 317454189, 330131084, 343220353, 352660209, 358761430, 363091707, 372344255, 394806147, 428542495, 462956727, 491526335, 516049266, 541436315, 567325115, 592986047, 622160494, 654062212]
1725.5F54062212L0703246K7235329K2496820J9452631J4838755R448290P217705N313278
1741.9G90768266L205120K438665K571940L080785L247261L404320L865599L685058
1758.2H16267014K816855J682759P58707M99964M90606K28703l94046j142443j260757
1776.5H19947362j153648j413584j916825k308667j944602o40452Q03113J300454J253188
1794.9H13926339J572848J989126K086580J955032J801669J578928J335024J002133
1811.2H27247679O45399L07322p9692m98950n57840k6762Q45968J698733K085507J768410
1831.6H33435774J394152J343132J096189Q60452R68516R04977L57628J94907M49241
1850H41004968M45723J59562r9003j75357l23832n00322l88503q6307k80381q82387
$$ y = [654062212, 684765458, 712000787, 734497607, 753950238, 768788993, 778237283, 785454988, 790768266, 793973386, 796412051, 798983991, 802064776, 805312037, 808716357, 812581956, 816267014, 819083869, 820766628, 821525335, 822025299, 822515905, 822744608, 822350562, 821208119, 819947362, 818793714, 817380130, 815463305, 813154638, 811210036, 810569584, 811372697, 812673151, 813926339, 815499187, 817488313, 819574893, 821529925, 823331594, 824910522, 826245546, 827247679, 827893078, 828200400, 828120708, 827621758, 827063918, 827037156, 827883124, 829581857, 831667364, 833435774, 834829926, 836173058, 837269247, 838129699, 839098215, 840003192, 840360820, 840555727, 841004968, 841450691, 841610253, 841511250, 841335893, 841012061, 840511739, 840123236, 840036929, 839756548, 838874161]
1870.3H38874161r06110n19871m03583m40955k85864j86682l07500l31820k25365l94880
1890.7H34871531n94140n00261m05848n27025p33137q23915j018464j634777k571702
1909.1H26062262l270864l032983j464247O76095J870811J828313J526713J455486
1925.4H25651586J297712O01173j24991K44617J537502K450586K563774K258778J497388
1943.8H37978125N53667O8784j133o5207o6638K62976N92470M77910o914o61016j755714
1966.2H37377310l040195k730846k63929J879513J974284J252056P39991K2769r89973
1984.6H36220980j592517j211167L577J310765K033055J983285J384199P92444N36203
2002.9H41460824L40104J4424j07705K4199l040j79946j91390j69933l19958m38690
$$ y = [838874161, 837968051, 837448180, 837044597, 836603642, 836317778, 836131096, 835823596, 835491776, 835266411, 834871531, 834277391, 833777130, 833371282, 832844257, 832111120, 831287205, 830268741, 828633964, 826062262, 822791398, 819758415, 818294168, 818970263, 820841074, 822669387, 824196100, 825651586, 826949298, 827550471, 827425480, 827670097, 829207599, 831658185, 834221959, 836480737, 837978125, 838531792, 838600576, 838599443, 838534236, 838467598, 838730574, 839323044, 839800954, 839794040, 839133024, 837377310, 834337115, 831606269, 831342340, 833221853, 835196137, 836448193, 837188184, 837210953, 836220980, 834628463, 833417296, 833420873, 834731638, 836764693, 838747978, 840132177, 840924621, 841460824, 841800928, 841815352, 841707647, 841731846, 841728806, 841548860, 841357470, 841187537, 840867579, 840428889]
2023.3H40428889j48773M79817O91175M42207L58224L18349R2625O795J19686O6519
2043.7H42855513j19090j13010l7432j75834l16024k01285j45494l87073n53370m89354
2064.1H40317547n97298r39667j109779j103461j325309j711071j801610j664578j670719
2082.5H28394055j626610j159788m26352K28584Q50141J446903J610279J244545Q67248
2100.8H31429005O98149M25994J05858J34766L69251K89500j4663l8564J58131J80244
2121.2H33737671J22071K52425L76404K82049K22921L01123J57058j35600j16289O6936
2141.6H35266769l7968k77221k80858k71379n14865o58751m53830l23295n11825o24419
2162H31312358m99129n38707p51614o12974k63036l03745n09381l99113k32995l07977
$$ y = [840428889, 840280116, 840759933, 841451108, 841893315, 842251539, 842569888, 842662513, 842669308, 842788994, 842855513, 842736423, 842623413, 842585981, 842410147, 842094123, 841892838, 841747344, 841360271, 840806901, 840317547, 839720249, 838780582, 837670803, 836567342, 835242033, 833530962, 831729352, 830064774, 828394055, 826767445, 825607657, 825181305, 825409889, 826260030, 827706933, 829317212, 830561757, 831429005, 832127154, 832553148, 832659006, 832793772, 833163023, 833452523, 833437860, 833399296, 833557427, 833737671, 833859742, 834112167, 834488571, 834770620, 834993541, 835294664, 835451722, 835316122, 835199833, 835266769, 835228801, 834951580, 834670722, 834399343, 833884478, 833225727, 832771897, 832448602, 831936777, 831312358, 830813229, 830274522, 829522908, 828909934, 828646898, 828343153, 827833772, 827434659, 827201664, 826893687]
2182.4H26893687l22222m3273J49786L4094k563J46091Q4579j50859j58787p7069k66910
2204.8H26286554n05447m35054l34323m63605m57942j60277m7803k75373l47198k15649
2225.2H23043883l59059o52551o29068n18322p39634r83774q61407p17699q19206p54774
2245.6H16008389l88205j89841k71737k09451j19m1843j83940j2934K07126N4896k02238
2268.1H14770103k49446l65496o87360q06690o43968o45817p82609n73813j95086j18673
2288.5H09701145j24097Q9824K14279M3928k4497J95801M02927N67198Q77738J149535
2308.9H13093781R93789M96089L43621Q28326J312315J219332P36773L58224L46840
2327.2H19729090N75602N05924n5671m28319k58386l8743n05626k003312l788591l184497
$$ y = [826893687, 826571465, 826528192, 826677978, 826712072, 826709509, 826855600, 826940179, 826789320, 826630533, 826553464, 826286554, 825781107, 825346053, 825011730, 824548125, 824090183, 823929906, 823882103, 823606730, 823259532, 823043883, 822684824, 822032273, 821403205, 820884883, 820145249, 819161475, 818300068, 817582369, 816763163, 816008389, 815620184, 815430343, 815158606, 814949155, 814949036, 814907193, 814723253, 814710319, 814917445, 814972341, 814770103, 814520657, 814155161, 813467801, 812661111, 812017143, 811371326, 810588717, 810014904, 809819818, 809701145, 809577048, 809666872, 809881151, 809925079, 809900582, 810096383, 810499310, 811066508, 811944246, 813093781, 814087570, 814583659, 814927280, 815755606, 817067921, 818287253, 819024026, 819382250, 819729090, 820304692, 820810616, 820754945, 820326626, 820068240, 820029497, 819523871, 817520559, 813731968, 810547471]
2347.6H10547471r477L300190M892647M255414K474070M47809j228928k551496l559351
2366H18568349m080892m295170m426479m359424m097045l916979l816902l409863k657711
2384.3G83507884j962722j521766j212895j010656r75907r80198q63374p66873q56102
2402.7G73357391r80258j001715j009882j048505r88782q20636p03514p07745p41184
2421G65355170p56800q20160q70943q09908p44403p92980q67724q96991r59634j066208
2441.4G56769419j117349j118243j150727j219809j288295j324355j329422j314760
2457.8G46906459j308798j323820j356601j396537j383603j308918j219988j140952
2474.1G36467242j080990j025021r73522r86576j077235j205623j360834j549721j742601
$$ y = [810547471, 810537994, 813838184, 818730831, 822986245, 825460315, 825908124, 824679196, 822127700, 818568349, 814487457, 810192287, 805765808, 801406384, 797309339, 793392360, 789575458, 786165595, 783507884, 781545162, 780023396, 778810501, 777799845, 776823938, 775843740, 774980366, 774213493, 773357391, 772377133, 771375418, 770365536, 769317031, 768328249, 767507613, 766804099, 766096354, 765355170, 764598370, 763778210, 762907267, 762097359, 761352956, 760559976, 759692252, 758795261, 757835627, 756769419, 755652070, 754533827, 753383100, 752163291, 750874996, 749550641, 748221219, 746906459, 745597661, 744273841, 742917240, 741520703, 740137100, 738828182, 737608194, 736467242, 735386252, 734361231, 733387709, 732401133, 731323898, 730118275, 728757441, 727207720, 725465119]
2492.4G25465119j890898j996279k012252j866639j644313j481772j397312j387119
2508.7G11788535j483798j654446j798689j899660k027810k219438k390146k438605
2525.1F95875943k440989k499283k572179k623140k686620k734363k720356k697706
2541.4F74901307k682150k610922k443552k223670j965165j601875j196504q29339
2557.7F59348130m33445N4837N88119J140475J884997K918422M031897N003035N730867
2576F80267334O047010N755544M902542L742575K406001R44794m51625j599431k477765
2594.4F99536979l076553l262103k980411k321064j287401J39415J676083K783716
2610.7F91208661L142118K862871K198338J347602N32269j61648q79407j651346k266586
$$ y = [725465119, 723574221, 721577942, 719565690, 717699051, 716054738, 714572966, 713175654, 711788535, 710304737, 708650291, 706851602, 704951942, 702924132, 700704694, 698314548, 695875943, 693434954, 690935671, 688363492, 685740352, 683053732, 680319369, 677599013, 674901307, 672219157, 669608235, 667164683, 664941013, 662975848, 661373973, 660177469, 659348130, 658914685, 658969522, 659557641, 660698116, 662583113, 665501535, 669533432, 674536467, 680267334, 686314344, 692069888, 696972430, 700715005, 703121006, 704065800, 703614175, 702014744, 699536979, 696460426, 693198323, 690217912, 687896848, 686609447, 686748862, 688424945, 691208661, 694350779, 697213650, 699411988, 700759590, 701291859, 701130211, 700250804, 698599458, 696332872]
2629.1F96332872k574027k624571k494335k206445j869440j625717j409530j105666
2645.4F80423141q87037j018762j388431j661539j774848j818597j771271j621842
2661.7F68480814j482666j401186j273155j056910q22544n46634j32442L32594P27773
2680.1F62825644J169980J782536K471089L166497L959596M853726N678057O239653
2696.4F92146778O415010O135761N369187M213512K887726J529097K38180p71105j367748
2714.7G16796398j674294j793146j656473j243353o95229j07824O07848J368463J832485
2733.1G13434875J892865J686036J214445M87804k77638r08494j409292j755536j774192
2751.4G12590873j454174j141489j097917j182497j186490j025558p25686n16951p03752
$$ y = [696332872, 693758845, 691134274, 688639939, 686433494, 684564054, 682938337, 681528807, 680423141, 679536104, 678517342, 677128911, 675467372, 673692524, 671873927, 670102656, 668480814, 666998148, 665596962, 664323807, 663266897, 662444353, 661897719, 661765277, 662097871, 662825644, 663995624, 665778160, 668249249, 671415746, 675375342, 680229068, 685907125, 692146778, 698561788, 704697549, 710066736, 714280248, 717167974, 718697071, 718935251, 718164146, 716796398, 715122104, 713328958, 711672485, 710429132, 709733903, 709626079, 710233927, 711602390, 713434875, 715327740, 717013776, 718228221, 718716025, 718438387, 717529893, 716120601, 714365065, 712590873, 711136699, 709995210, 708897293, 707714796, 706528306, 705502748, 704777062, 704260111, 703556359]
2769.8G03556359j311720j970112k331972k285302j792967j057982n94140p51078j368642
2788.2F90092444k046167k496362k694249k783656k871931k998173l128171l204346
2804.5F67869389l192723l115833l077507l023147k832174k623976k478480k312720
2820.8F45212829k102375j888215j667142j371801j038552p40051m10676k8968K61605
2839.1F36226654M07875N44428P65920J094997J559734K151668K684474K791822K305866
2857.5F50533438J391887K50519q86023j684964k002299j910269j563430j224279r92060
2875.9F41912520p78794o26386n40316m20272k01762K05338P43151J180589J414240
2894.2F42888308J512885J605034J717269J699984J516044J252115Q99315N40554L67165
$$ y = [703556359, 702244639, 700274527, 697942555, 695657253, 693864286, 692806304, 692212164, 691461086, 690092444, 688046277, 685549915, 682855666, 680072010, 677200079, 674201906, 671073735, 667869389, 664676666, 661560833, 658483326, 655460179, 652628005, 650004029, 647525549, 645212829, 643110454, 641222239, 639555097, 638183296, 637144744, 636404693, 635994017, 635965049, 636226654, 636634529, 637178957, 637944877, 639039874, 640599608, 642751276, 645435750, 648227572, 650533438, 651925325, 652175844, 651289821, 649604857, 647602558, 645692289, 644128859, 642904580, 641912520, 641133726, 640507340, 639967024, 639546752, 639344990, 639550328, 640293479, 641474068, 642888308, 644401193, 646006227, 647723496, 649423480, 650939524, 652191639, 653090954, 653631508, 653998673]
2912.6F53998673L82483M54903N59806P36177R05693Q85189P08878M30166j37329q37683
2933F58086956j283885j487731j631201j634717j446426j265883j177728r67801n65350
2951.3F46626234l66688m89354o23941o82235p61449q87692r23217p86602o40869n96166
2971.7F39868021o29485p87198r82344r92775p64311m85301m94480p95305j029014
2990.1F32907808j223087j493574j512527j318991j198769j069009r45688q81969o72341
3008.4F22591853k44081O7890J5378j38283r0778P7427K32398L22878L41535M19796
3028.8F23596013N22911N66244O60002J019300J671552K065480J782775J073301L15010
3047.2F33272588l08513r28045j703858k673566l859163m616081m097164k850294k613068
$$ y = [653998673, 654381156, 654836059, 655395865, 656132042, 657037735, 657922924, 658631802, 659061968, 658924639, 658086956, 656803071, 655315340, 653684139, 652049422, 650602996, 649337113, 648159385, 647191584, 646626234, 646259546, 645770192, 645146251, 644464016, 643702567, 642814875, 641891658, 641105056, 640464187, 639868021, 639238536, 638451338, 637468994, 636476219, 635711908, 635226607, 634732127, 633936822, 632907808, 631684721, 630191147, 628678620, 627359629, 626160860, 625091851, 624146163, 623264194, 622591853, 622347772, 622415662, 622431040, 622292757, 622201979, 622279406, 622511804, 622834682, 623176217, 623596013, 624118924, 624685168, 625345170, 626364470, 628036022, 630101502, 631884277, 632957578, 633272588, 632964075, 632036030, 630332172, 627658606, 623799443, 619183362, 615086198, 612235904, 609622836]
3065.5F09622836m216909n698026l457307L469884J0632694J2480020R305179N535484
3081.9F37673855L321767K089798J346171R84311R27746J367569K095163K458811K252698
3100.2F54517889J848519J662731J714885J728714J648783J785100K035975J970590
3116.5F68913186J714468J478195J272559J280010J501679J640797J543879J396001
3132.8F80740774J385033J414835J319349J112163R94742J032293J116931J234711
3149.2F90350831J307368J168072R52542R04441Q84115P57397O81162P71880R83298
3167.5F98761106J179158J229823J116812R50575Q49307Q55803R26852R82464J040458
3185.9G07892358J124680J159907J143574J124442J063168R54270Q81911R18031J037836
$$ y = [609622836, 605405927, 599707901, 596250594, 599720478, 610353172, 622833192, 632138371, 637673855, 640995622, 643085420, 644431591, 645415902, 646343648, 647711217, 649806380, 652265191, 654517889, 656366408, 658029139, 659744024, 661472738, 663121521, 664906621, 666942596, 668913186, 670627654, 672105849, 673378408, 674658418, 676160097, 677800894, 679344773, 680740774, 682125807, 683540642, 684859991, 685972154, 686966896, 687999189, 689116120, 690350831, 691658199, 692826271, 693778813, 694683254, 695567369, 696324766, 697005928, 697777808, 698761106, 699940264, 701170087, 702286899, 703237474, 704086781, 704942584, 705869436, 706851900, 707892358, 709017038, 710176945, 711320519, 712444961, 713508129, 714462399, 715344310, 716262341, 717300177]
3204.2G17300177J129150J160085J159072J086533R83596R20534Q74102Q37267Q08835
3222.6G26259351P70211P31170P21872P79271Q12948O64830N01573N47707O67990P22408
3243G33179331P54714P45296O76275O65962P51257Q01981P11918N86867N94676O70254
3263.4G40138531O84261O86407P09117O25252M55916L19183K35558K40802K51413J83344
3283.8G44529784J53541K29538L35753L37600J87636P331r9540j11222k7537L3915
3304.2G45576799j04785l91364n79477o07371o20901o46055o25849o03020o06239o37293
3324.6G40154445p31945q37266q65102q54850q96156j006841j132012j230299j324296
3342.9G31275678j401782j440049j506328j591265j643479j725376j853764j940906
$$ y = [717300177, 718429327, 719589412, 720748484, 721835017, 722818613, 723739147, 724613249, 725450516, 726259351, 727029562, 727760732, 728482604, 729261875, 730074823, 730739653, 731241226, 731788933, 732456923, 733179331, 733934045, 734679341, 735355616, 736021578, 736772835, 737574816, 738286734, 738873601, 739468277, 740138531, 740822792, 741509199, 742218316, 742843568, 743299484, 743618667, 743854225, 744095027, 744346440, 744529784, 744683325, 744912863, 745248616, 745586216, 745773852, 745781183, 745681643, 745570421, 745542884, 745576799, 745472014, 745080650, 744501173, 743893802, 743272901, 742626846, 742000997, 741397977, 740791738, 740154445, 739422500, 738585234, 737720132, 736865282, 735969126, 734962285, 733830273, 732599974, 731275678, 729873896, 728433847, 726927519, 725336254, 723692775, 721967399, 720113635, 718172729]
3359.2G18172729j972139k047062k181113k256572k196014k074599k025902k047718
3375.5G01371610k045333j988054j864254j732528j671851j635075j586735j493454
3391.9F87354326j365483j308977j351953j352370j204609j081407j067102j052380
3408.2F77570045j010656r29356q02934p03573o72222o57677o21081n60760m52101
3426.5F71159685k75553j03473K682Q1181J48297K02894K96950L99292M72486N36084
3446.9F72920525N52654O03736P20918P83265Q38458R62258J018583J036704J168370
3465.3F80605471J236081J045764Q17477Q57294J058102J226544J244485J058162R74476
3483.6F90123856J116633J180828J123309J149059J295924J400292J329541J292229
$$ y = [718172729, 716200590, 714153528, 711972415, 709715843, 707519829, 705445230, 703419328, 701371610, 699326277, 697338223, 695473969, 693741441, 692069590, 690434515, 688847780, 687354326, 685988843, 684679866, 683327913, 681975543, 680770934, 679689527, 678622425, 677570045, 676559389, 675630033, 674827099, 674123526, 673451304, 672793627, 672172546, 671611786, 671159685, 670884132, 670780659, 670783341, 670864522, 671012819, 671215713, 671512663, 671911955, 672384441, 672920525, 673473179, 674076915, 674797833, 675581098, 676419556, 677381814, 678400397, 679437101, 680605471, 681841552, 682887316, 683704793, 684562087, 685620189, 686846733, 688091218, 689149380, 690123856, 691240489, 692421317, 693544626, 694693685, 695989609, 697389901, 698719442, 700011671]
3500G00011671J354217J245320J136541J246691J356959J430631J453936J387298J420498
3518.3G12043762J610518J775860J641632J341641J272857J392066J544953J716315
3534.6G24339604J719952J591921J694798J925528J866043J471460J253605J416981
3551G37279892J519203J478732J584589J818359J969397K027571K077163J885652J430154
3569.3G53070712J285315J556396J885831K036393K091468K202034K400577K536535
3585.6G69065261K225459J756787J806855K055407K080679K081155K083481J916587
3601.9G85071671J861990K037644K065360J813591J669764J732290J802862J822531
3618.3G99877703J627445J396001J565873J939834J862704R63509L58046N00321P00772
$$ y = [700011671, 701365888, 702611208, 703747749, 704994440, 706351399, 707782030, 709235966, 710623264, 712043762, 713654280, 715430140, 717071772, 718413413, 719686270, 721078336, 722623289, 724339604, 726059556, 727651477, 729346275, 731271803, 733137846, 734609306, 735862911, 737279892, 738799095, 740277827, 741862416, 743680775, 745650172, 747677743, 749754906, 751640558, 753070712, 754356027, 755912423, 757798254, 759834647, 761926115, 764128149, 766528726, 769065261, 771290720, 773047507, 774854362, 776909769, 778990448, 781071603, 783155084, 785071671, 786933661, 788971305, 791036665, 792850256, 794520020, 796252310, 798055172, 799877703, 801505148, 802901149, 804467022, 806406856, 808269560, 809233069, 809591115, 810091436, 810792208]
3636.6H10792208P63178Q08417R49085J262188J483083J099586J19627l23117l3080
3655H16921175J95860J53244J59144L49880P56383J187384J196324O96838L90709J65045
3675.4H22171986l76820m53473P093N36561J024306J351357R28402M4107j50263J50978
3695.8H25234234M09544M51267J57952j83225k8491M33088M89771j54972o41883l45051
3716.2H25822234J86384M71175M27723K44855J62125K59519N33402Q03828N58078k81930
3736.5H29187393p39574l83079Q6248J6152k46226j19090k32697o40154n06520j26779
3756.9H26295674p6413k07186o6280J63078J30951p9632l42011m25219j75477J52946
3777.3H25370431J74880r5487k06828j63436j69217j14501L9339J51813J43528J42038
$$ y = [810792208, 811555386, 812363803, 813312888, 814575076, 816058159, 817157745, 817277372, 816954255, 816921175, 817117035, 817270279, 817429423, 817779303, 818535686, 819723070, 820919394, 821616232, 822006941, 822171986, 821795166, 821341693, 821348786, 821885347, 822909653, 824261010, 825189412, 825233519, 825083256, 825234234, 825643778, 826095045, 826252997, 826069772, 826041281, 826474369, 826964140, 826809168, 826167285, 825822234, 826008618, 826479793, 826907516, 827152371, 827314496, 827574015, 828107417, 828911245, 829469323, 829187393, 828447819, 828064740, 828150988, 828167140, 827920914, 827801824, 827569127, 826928973, 826422453, 826295674, 826219261, 826012075, 825945795, 826108873, 826239824, 826160192, 825818181, 825392962, 825217485, 825370431, 825545311, 825449824, 825242996, 825079560, 824910343, 824795842, 824835181, 824986994, 825130522, 825272560]
3797.7H25272560J55449k3365j65045j43528l13819l84569m1842K95221L24607K53201
3818.1H25228870R2626l99948n85675k81155p5698j0192J02102K81454K98977j9968
3838.5H24631393l57866n18859n85198l71456K36451P67768L96132p51436r52005l85046
3858.9H22109878J11044K72274Q5711l6001L57r4115k89977l58462j56224P0572L4153
3881.4H21749210N365l0935k25544k06411j70529k50995j4782L29793L55899Q9705
3901.8H21630776l43025o84678o05226l19123j00851Q3625J79768N0902j41680j47283
3922.1H19603205n9247o6996m5955N8412k4676k47657k61963q1837K9803j9193o9857
3944.6H18814039l814k8670j77622j62006l2067j7106q5116j00434r8049j28985j08540
$$ y = [825272560, 825428009, 825404644, 825239599, 825096071, 824782252, 824397683, 824355841, 824651062, 824975669, 825228870, 825321496, 824921548, 824335873, 824054718, 823979020, 823968828, 824070930, 824352384, 824651361, 824631393, 824273527, 823754668, 823169470, 822798014, 823034465, 823802233, 824198365, 823446929, 822494924, 822109878, 822220922, 822493196, 822578907, 822542906, 822543263, 822449148, 822159171, 821800709, 821644485, 821715057, 821749210, 821754575, 821723640, 821498096, 821291685, 821121156, 820870161, 820855379, 821185172, 821541071, 821630776, 821287751, 820603073, 819997847, 819678724, 819577873, 819661498, 819841266, 819892168, 819750488, 819603205, 819543958, 819476962, 819431007, 819489419, 819464743, 819217086, 818955123, 818873286, 818903089, 818883896, 818814039, 818810225, 818781555, 818603933, 818441927, 818409860, 818392754, 818307638, 818207204, 818109155, 817980170, 817871630]
3967H17871630n1915n4062o7234n5909q8811j19805q4520k7358l6001j07110j36197
3989.5H17042708j22368j62601k45989k65300
3997.6H16246450
$$ y = [817871630, 817819715, 817765653, 817698419, 817642510, 817553699, 817433894, 817349374, 817322016, 817286015, 817178905, 817042708, 816920340, 816757739, 816511750, 816246450]
##END=$$ End of the data block
