##TITLE=B8M - Amanda - Chalcona $$ Begin of the data block
##JCAMP-DX=5.00 $$ ACD/SpecManager v 10.08
##SPECTROMETER/DATA SYSTEM=Alpha
##DATE=16 Apr 2015 08:31:26
##DATA TYPE=INFRARED SPECTRUM
##DATA CLASS=XYDATA
##ORIGIN=
##OWNER=
##NPOINTS=1765
##FIRSTX=399.76428223
##LASTX=3997.64306641
##MAXX=3997.64306641
##MINX=399.76428223
##MAXY=1.00000000
##MINY=0.39008182
##XFACTOR=1.0000000000
##YFACTOR=0.000000010000000
##FIRSTY=1.00000000
##DELTAX=2.03961372
##XUNITS=1/CM
##YUNITS=ARBITRARY UNITS
##XYDATA=(X++(Y..Y))
399.8A00000000j79541%n37968k14141M87709k99979M42607o29449j64211L48318p1562
422.2I9181783o22731m75317Q2510J24145m64082q03703k72185N41306O07937l0750
442.6I7868913l45742J03050M21441q142n81753m26674K05487K66951m00364p12258
463I6390909k71851J95199m3308p00307r11951m88150l79861j055002j866478k247560
483.4H8621640k565199l275394l647393j994008K018529N319065N183232K902186J182192
501.7I3744850O92970M61250j96922q21077o57708J23584O55532M71962P8696J63299
522.1I4716436M49329K49249l52877n35024j16545J95253j03861n77837n65237j58250
542.5I3200636n0575n52761j083303j100760r96006j474774k590191l704655l930617
$$ y = [100000000, 99820459, 99820459, 99282491, 99068350, 99556059, 99256080, 99698687, 99069238, 98905027, 99253345, 99181783, 98559052, 98083735, 98166245, 98290390, 97826308, 97022605, 96750420, 97291726, 97899663, 97868913, 97523171, 97626221, 98047662, 98039520, 97457767, 97031093, 97236580, 97503531, 97103167, 96390909, 96119058, 96314257, 96270949, 95570642, 94658691, 94170541, 93790680, 92735678, 90869200, 88621640, 86056441, 82781047, 79133654, 77139646, 79158175, 84477240, 89660472, 92562658, 93744850, 94437820, 94899070, 94702148, 93881071, 93223363, 93346947, 94002479, 94474441, 94553137, 94716436, 95165765, 95415014, 95062137, 94527113, 94410568, 94605821, 94501960, 93924123, 93358886, 93200636, 93150061, 92597300, 91513997, 90413237, 89417231, 87942457, 85352266, 81647611, 77716994]
560.9G7716994k181977J560396M924387N676544M382920K669895J148879P9358j77837
579.3I5799559J20193J91826k19727n84775m38535q0860p3248l58689m03046n7966
599.6I3894732K27207L5280m02427m95791j99890j09506m91595q14450m75860M15725
620I1583425P74783J31118m84771l96800o0600r1594m66365o56080m32002j93757l58093
642.5H9349264p60847r25196p92706q85200j545078k554524l511715l239089q3685
660.8G5051224L312880K760834m3786j973087k020174k621370l447503k825588j648850
679.2F6544580k143746m657865o738084n232013L78117P000289J0491758R527135O547737
697.5H1717908M112375K634627J709008J258534J144964Q23593R7531n16951n91225
$$ y = [77716994, 75535017, 77095413, 82019800, 87696344, 92079264, 94749159, 95898038, 95977396, 95799559, 95919752, 96111578, 95891851, 95307076, 94868541, 94787681, 94714433, 94355744, 93952698, 93894732, 94121939, 94157219, 93754792, 93259001, 93059111, 92949605, 92458010, 91643560, 91167700, 91583425, 92358208, 92489326, 92004555, 91607755, 91547155, 91455561, 90989196, 90333116, 89901114, 89707357, 89349264, 88588417, 87663221, 86870515, 85985315, 84440237, 81885713, 78373998, 75134909, 75051224, 78364104, 81124938, 81081152, 79108065, 77087891, 74466521, 71019018, 68193430, 66544580, 64400834, 59742969, 53004885, 47772872, 48150989, 55151278, 65643036, 75170171, 81717908, 85830283, 88464910, 90173918, 91432452, 92577416, 93401009, 93498540, 92981589, 92390364]
715.9I2390364m32372o07001j091528j407695j392263j423324j852595k504540l023541
734.3G8655505l477657m309904n771452p339317p795101o366742l674620r12530J673287
752.6D0681469M807669Q151359R697121Q568007O215697M302764L178674K328468J444941
771H9376169Q00032O12181N36460O7425p51788j235509o87974N57172J320338J374954
791.4I1969460J406080J411271J016348L48348j48821j77461O9511J28359j08338k67327
811.8I5647430n7005K75528K68859n9426k49559p6485J48678N1284k55769l53599j50168
834.2I5189768k1541k39211n84424p02929o36864p23082j083094j167410j67185J230937
854.6I1094965J347333K89345o96683r76986j95569R84270J180279N49948J76895J53369
$$ y = [92390364, 91957992, 91350991, 90259463, 88851768, 87459505, 86036181, 84183586, 81679046, 78655505, 75177848, 70867944, 65096492, 57757175, 49962074, 43595332, 39920712, 39008182, 40681469, 45489138, 53640497, 63337618, 71905625, 78121322, 82424086, 85602760, 87931228, 89376169, 90176201, 90788382, 91324842, 91392267, 90640479, 89404970, 88716996, 89274168, 90594506, 91969460, 93375540, 94786811, 95803159, 96151507, 96002686, 95825225, 95894736, 96023095, 95914757, 95647430, 95590425, 95865953, 96134812, 96075386, 95825827, 95749342, 95898020, 95949304, 95693535, 95339936, 95189768, 95168227, 94929016, 94344592, 93641663, 93004799, 92281717, 91198623, 90031213, 89864028, 91094965, 92442298, 92731643, 92034960, 91057974, 90862405, 91846675, 93026954, 93576902, 93753797, 93907166]
875I3907166J9383k64555m09514l60894m53192q12495q05223P7534J000535R79197
895.4I2877942L39008j34611j75488p499P075j93375l34018k35945q2827j51289m24104
917.8I1484869o45781o98888o43802m87983k87485J9943M60261N99373L11231k2327
938.2I0089411j59181j15013j16855k99346m79293m51577l13592l24028n21952o83099
958.6H6625475o76811o73538r16422j441353k005089j938337j023525o46675j491421
977G5812304k174366k345848l157073m492271m236501r81671K674312L114122J155162
995.3F5368170J20294J911538N359906N939228J833075k887046n290985n969829m335701
1013.7F2048650J072728Q007729J0984380P922905K334917j840317l613079m075956
$$ y = [93907166, 93926549, 93661994, 93252480, 92891586, 92438394, 91625899, 90820676, 90898210, 91898745, 92877942, 93216950, 93082339, 92906851, 92899352, 92906427, 92713052, 92379034, 92143089, 92060262, 91908973, 91484869, 90839088, 90140200, 89496398, 89008415, 88720930, 88740873, 89201134, 89800507, 90111738, 90089411, 89930230, 89815217, 89698362, 89399016, 88919723, 88468146, 88154554, 87830526, 87308574, 86625475, 85948664, 85275126, 84358704, 82917351, 80912262, 78973925, 77950400, 77303725, 75812304, 73637938, 71292090, 68135017, 63642746, 59406245, 58424574, 61098886, 64213008, 65368170, 65488464, 67400002, 72759908, 78699136, 80532211, 77645165, 72354180, 66384351, 62048650, 63121378, 71129107, 82113487, 90036392, 92371309, 90530992, 86917913, 82841957]
1030H2841957l537798p89541L144616N122149M461973K845395J409829M21607n3036
1048.4I5867151j46323j76365l37368n24723n59515m73601m44406n36048o20342o06423
1068.8I1442037o69796r99123j211005n50753O57690J102257O17152J20878K4563J42116
1089.2I0676016J61916m2880k91246l57872k46090j09965k8264K7227J00625J65295
1109.6I0054762J31828p504j25903j22893o3223q1241j83487k45118j83636p8779p5847
1132H9018959j75208k35653j93846j50079k10911l37487m21411m63051n92333q67831
1152.4H5371149r36014l38334M99046O67006J60390l98081p30753r70602j368392j947480
1172.8H0007935k069647j184570j77902K30199Q29577J742763J818656P07406o28513
$$ y = [82841957, 79304159, 78514618, 81659234, 86781383, 91243356, 94088751, 95498580, 95920187, 95867151, 95720828, 95544463, 95207095, 94682372, 94122857, 93649256, 93204850, 92668802, 92048460, 91442037, 90772241, 89773118, 88562113, 88011360, 88669050, 89771307, 90388459, 90509337, 90533900, 90676016, 90837932, 90795052, 90503806, 90145934, 89899844, 89789879, 89761615, 89788842, 89889467, 90054762, 90186590, 90179086, 90053183, 89930290, 89867067, 89785826, 89602339, 89357221, 89173585, 89094806, 89018959, 88843751, 88608098, 88414252, 88264173, 88053262, 87715775, 87294364, 86831313, 86238980, 85371149, 84435135, 84096801, 84595847, 85262853, 85423243, 85025162, 84294409, 83323807, 81955415, 80007935, 77938288, 76753718, 76575816, 76806015, 77635592, 79378355, 81197011, 81904417, 81275904]
1191.1H1275904j434552j792419k031804k371037k792769k952284k367234j274032
1207.5F4259773q79079j557970j821983j59406L190619O437087P780122O985343N166119
1225.8H9400625L373367J963222R40573K58488j75465m12023n03701o02752p41380
1244.2I3500954p96539p45994o51961n45663m59826m27758m62014n60117o62970p10404
1264.6H7477708p21103p64388q83108j043094j203465j402587j692384k080262k455628
1282.9G5231689k349537q60060K148790M337775L415483Q04091r73254j816631k566784
1301.3G7371562l180939l144229j851213J019383M391777O033385M747754J788670
1317.6H7176150q45981k358740l120440l559602l800743m057777m364676l970444j980609
$$ y = [81275904, 79841352, 78048933, 76017129, 73646092, 70853323, 67901039, 65533805, 64259773, 63380694, 61822724, 60000741, 59841335, 63031954, 69469041, 77249163, 84234506, 89400625, 92773992, 94737214, 95677787, 95936275, 95760810, 95348787, 94845086, 94242334, 93500954, 92704415, 91958421, 91306460, 90760797, 90300971, 89873213, 89411199, 88851082, 88188112, 87477708, 86756605, 85992217, 85109109, 84066015, 82862550, 81459963, 79767579, 77687317, 75231689, 72882152, 72022092, 74170882, 78508657, 81924140, 82728231, 81754977, 79938346, 77371562, 74190623, 71046394, 69195181, 70214564, 74606341, 80639726, 85387480, 87176150, 86330169, 83971429, 80850989, 77291387, 73490644, 69432867, 65068191, 61097747, 59117138]
1336E9117138J527465N162328P043195P276928O833089N738914M025245K175694Q69179
1354.3I9769175o2287K30682k79903n09948o01083n23394m76837m77308n04011n68045
1374.7I5997041n59574n18763n12880m48489l09098k57766l81702n01335n57798m99928
1395.1I1449708k50125l6222N3001R8180R5296K7049n7948j48105j85377j51020j66631
1417.5I0727806l08370l72822l75378m16666m46320n79947p09963p79843j259363k044546
1437.9H3434588k410144l450042n452943o652367l333372N539799J0971791Q674079
1454.3H7321389M077726J017106j55264l57408m95004n79858m82470m61209p04944
1472.6H9180064r14812r36043r88448j063889r58610n18554j31345l25245j144409
$$ y = [59117138, 60644603, 65806931, 72850126, 80127054, 86960143, 92699057, 96724302, 98899996, 99769175, 99706888, 99937570, 99657667, 99147719, 98546636, 98023242, 97546405, 97069097, 96565086, 95997041, 95437467, 94918704, 94405824, 93957335, 93648237, 93390471, 93008769, 92507434, 91949636, 91449708, 91199583, 91163361, 91216362, 91314542, 91409838, 91436887, 91378939, 91230834, 91045457, 90894437, 90727806, 90419436, 90046614, 89671236, 89254570, 88808250, 88228303, 87518340, 86738497, 85479134, 83434588, 81024444, 77574402, 72121459, 65469092, 62135720, 67675519, 78647310, 87321389, 91399115, 92416221, 92260957, 91903549, 91408545, 90828687, 90346217, 89885008, 89180064, 88265252, 87329209, 86340761, 85276872, 84318262, 83799708, 83668363, 83343118, 82198709]
1491H2198709j463657o04254J730769L494198K538597J016742J69051m22430n34451
1509.3H8123274k84130j37513q0234j28627k18064l55333m04757l58415l95804l76869
1529.7H5383528l82071n11140m60446l38638n66548p80028o51574n82612n61881o09070
1550.1G9939520o05690n70148n83667j209038k011913j532794j651948k183557k886986
1568.5F6703779l834212l480482j486570L280204O605345M511542O82640k353615l645605
1586.8F6983026l863972l113598j927274j663649k349240l036797l600255l902587
1603.2D3525654l210816j213437K125180N851656P725224Q169240P807564N238182
1619.5G6018447L761142L985214L330076J862264O13880j85287o66660j375169j599890
$$ y = [82198709, 80735052, 80130798, 81861567, 85355765, 87894362, 88911104, 89080155, 88657725, 88123274, 87839144, 87701631, 87621397, 87492770, 87274706, 86919373, 86514616, 86156201, 85760397, 85383528, 85001457, 84490317, 84029871, 83691233, 83124685, 82344657, 81693083, 81110471, 80548590, 79939520, 79333830, 78763682, 78180015, 76970977, 74959064, 73426270, 71774322, 69590765, 66703779, 62869567, 59389085, 57902515, 61182719, 67788064, 72299606, 72982246, 70628631, 66983026, 63119054, 60005456, 58078182, 56414533, 54065293, 51028496, 47428241, 43525654, 40314838, 39101401, 41226581, 47078237, 54803461, 62972701, 70780265, 76018447, 79779589, 83764803, 87094879, 88957143, 89571023, 89385736, 88719076, 87343907, 85744017]
1637.8H5744017j174932q96854o97445q95626j366043j381910k517801n200154m889256
1656.2F6723996m823947n686730n258393j674229L834695J0029274J3375378Q857262
1672.5H5377306M493165K957195K273261J919878J557517R81492K55686k1517l7820
1690.9I9756163K1559J08463%k02721J13588k27678k11125k29723j75905j21635j01989
1713.3I8728997j12427j77645j98454j01256l1353L4261J03897J44392J28991R888
1733.7I8529291j02055n4616m4387q4436p7713n5527n4664j28180j78003j22374q9270
1756.1I7538066j01000j22452k08944k61807k38157j94293j10352j07265j24544l7592
1776.5I6031660Q0454J81490K33221K25562J84298J49125R6637r579n8770j7428L230
$$ y = [85744017, 84569085, 83672231, 82974786, 82079160, 80713117, 79331207, 76813406, 71613252, 66723996, 61900049, 56213319, 50954926, 49280697, 53115392, 63144666, 76520044, 85377306, 89870471, 92827666, 95100927, 97020805, 98578322, 99559814, 99815500, 99793983, 99756163, 99777722, 99886185, 99886185, 99683464, 99797052, 99569374, 99358249, 99128526, 98952621, 98830986, 98728997, 98616570, 98438925, 98240471, 98139215, 98107862, 98142123, 98246020, 98390412, 98519403, 98529291, 98427236, 98372620, 98328233, 98243797, 98166084, 98110557, 98055893, 97927713, 97749710, 97627336, 97538066, 97437066, 97314614, 97105670, 96843863, 96605706, 96411413, 96301061, 96193796, 96069252, 96031660, 96112114, 96293604, 96526825, 96752387, 96936685, 97085810, 97182447, 97172868, 97114098, 97096670, 97099900]
1799I7099900k4825m9895m8107o4284j36459k66146l69394l58832k17479J6474K16031
1821.4I5796984L14957L11667K23291R4664q923j2129K8085O2615R1601R8890N2899
1843.8I7054601J0591N3323J25211J63341J44684Q9514L2372j002L255L8236O3408
1866.3I7777534K3728m1520m2832k6089k9350l8457n1158o5798q0591r4533j38849
1888.7I7192085k18970k95311l42071k20680P3057K43539J61940J3804k2310O9100
1909.1I6654183J94984K41536J99366J31649R6023J12754J49029J89758K20018K03467
1929.5I8392767J43033P8338L2097M882j5396n2833r4104r4885p5257p5006j02097
1951.9I8141539j35696j55920j62857j60242j66451k14458k94077k81358o2978K49916
$$ y = [97099900, 97075075, 97025180, 96977073, 96912789, 96776330, 96510184, 96140790, 95781958, 95564479, 95580953, 95796984, 96111941, 96423608, 96646899, 96741563, 96732640, 96720511, 96748596, 96811211, 96902812, 97001702, 97054601, 97065192, 97118515, 97243726, 97407067, 97551751, 97641265, 97673637, 97672635, 97675890, 97714126, 97777534, 97801262, 97759742, 97716910, 97690821, 97661471, 97623014, 97571856, 97506058, 97425467, 97330934, 97192085, 96973115, 96677804, 96335733, 96115053, 96188110, 96431649, 96593589, 96607393, 96585083, 96654183, 96849167, 97090703, 97290069, 97421718, 97517741, 97630495, 97779524, 97969282, 98189300, 98392767, 98535800, 98614138, 98646235, 98651117, 98635721, 98582888, 98488784, 98393899, 98318642, 98243636, 98141539, 98005843, 97849923, 97687066, 97526824, 97360373, 97145915, 96851838, 96570480, 96507502, 96757418]
1972.3I6757418M41617M24236K88051J56647Q5074O9111Q3411J08534J16098R5040
1992.7I8625237Q7404J05286J11317R2536O4046L4827M232j9187j5140K5028O6847
2015.2I9182433O3139J2446n1302r7060q0824J3429J00422J21063J08110P7922L3050
2037.6I9482828r209l3444l0046r442P600J9079L1138L8957L3272J5545K819P915J9688
2064.1I9576700J6975P21p891j347J0067J5050R692K080J383R674J8119J3757K498
2090.6I9667478L129J6045J6481L976N370K1017L1191K6643J1867M399J2297J8602
2115.1I9838495J0300l994o985M339J5664J4085Q064J1730K1971K7495K0302N966J371
2141.6I9968803P272M714j0019j7518n776J1623J2583K44n579J97P629J049j6290j6260
$$ y = [96757418, 97199035, 97623271, 97911322, 98067969, 98153043, 98222154, 98305565, 98414099, 98530197, 98625237, 98712641, 98817927, 98929244, 99021780, 99085826, 99120653, 99124885, 99105698, 99090558, 99115586, 99182433, 99245572, 99258018, 99206716, 99109656, 99028832, 99042261, 99142683, 99263746, 99371856, 99449778, 99482828, 99473619, 99440175, 99410129, 99400687, 99408287, 99427366, 99458504, 99497461, 99530733, 99546278, 99549097, 99557012, 99576700, 99593675, 99594396, 99586505, 99585158, 99595225, 99610275, 99619967, 99622047, 99623430, 99633104, 99651223, 99664980, 99667478, 99670607, 99686652, 99703133, 99707109, 99712479, 99733496, 99764687, 99791330, 99803197, 99807596, 99819893, 99838495, 99848795, 99844801, 99837816, 99842155, 99857819, 99871904, 99879968, 99891698, 99913669, 99941164, 99961466, 99967432, 99968803, 99976075, 99980789, 99970770, 99953252, 99947476, 99959099, 99971682, 99971926, 99966347, 99966544, 99974173, 99975222, 99958932, 99942672]
2170.2I9942672K450J3876O592q964j4085k700P415l678k1916j8084Q058K6953J8740
2196.7I9957329k646j1272m142l225j5235k0081n143J5044J3566j3352l2395k1863
2221.2I9856585o711j0360j7684j0419Q041K5123K5368Q499n519m608N91j1516l8570
2247.7I9818820m6659j8149J3083P242j8609k4664j0210M88n299j2385Q34J8841J3477
2274.2I9736810p105j8948j2804K784N531j0764j9914q011N853K021j6928l1281k9200
2300.7I9598044k4468m5424q6731j07795r5183p9280q7887j02496q9204m8805j6015
2323.1I8814756j8406m7171p2664p8559p9668q1086n6815n472M6891Q5485J25164J35666
2347.6I8768121O9463k6601q6379j02198q8948l9411K0093N8746P0381Q3226J19758
$$ y = [99942672, 99945122, 99958998, 99965590, 99956626, 99942541, 99939841, 99947256, 99943578, 99921662, 99903578, 99911636, 99938589, 99957329, 99954683, 99943411, 99939269, 99936044, 99920809, 99900728, 99895585, 99910629, 99924195, 99910843, 99878448, 99856585, 99849874, 99839514, 99821830, 99811411, 99819452, 99844575, 99869943, 99878442, 99872923, 99868315, 99868906, 99857390, 99818820, 99772161, 99754012, 99767095, 99774337, 99755728, 99731064, 99720854, 99721342, 99716043, 99703658, 99704492, 99723333, 99736810, 99729705, 99710757, 99697953, 99700737, 99706268, 99695504, 99675590, 99667579, 99673432, 99675453, 99658525, 99627244, 99598044, 99573576, 99528152, 99441421, 99333626, 99238443, 99159163, 99071276, 98968780, 98879576, 98830771, 98814756, 98796350, 98749179, 98676515, 98597956, 98518288, 98437202, 98380387, 98374915, 98421806, 98507291, 98632455, 98768121, 98837584, 98810983, 98724604, 98622406, 98533458, 98494047, 98514140, 98572886, 98643267, 98726493, 98846251]
2370.1I8846251J46836J31762J02919J00684J17922J15943Q3822N1320M2277M4483
2390.4I9784219L0732N73j8633q940J3899J6100p493k3782r799J2910J1629o616p820
2417I9786979J5581L7658L7747K2608J7584L1543L6102j2785J4198k0111p373j889
2441.4I9957842j7906l1209k1052o68O26j9622l2502k1511l582l392j4758r149J4531
2467.9I9797648K8557J4806j4288k9212j8841p331j7983l4857k8151n96J3298k742
2492.4I9700308j9467n615K4945L7378K2435L147O902K4468J9538q857k3019r137N424
2518.9I9778450k27j1009J91K9099M1735K0516j0723j6606J800J2142l940k4539j6147
2545.5I9800742J2862K2126N30j7846o318J3495P713j9878l6997k4718q339j6749k4283
$$ y = [98846251, 98993087, 99124849, 99227768, 99328452, 99446374, 99562317, 99646139, 99697459, 99739736, 99784219, 99814951, 99815524, 99796891, 99787951, 99801850, 99817950, 99810457, 99786675, 99776876, 99789786, 99801415, 99794799, 99786979, 99802560, 99840218, 99877965, 99900573, 99918157, 99949700, 99985802, 99973017, 99987215, 99967104, 99959731, 99957842, 99939936, 99908727, 99887675, 99887007, 99887633, 99868011, 99835509, 99813998, 99810416, 99807024, 99792266, 99783117, 99797648, 99826205, 99841011, 99826723, 99797511, 99778670, 99771339, 99753356, 99718499, 99690348, 99689752, 99703050, 99700308, 99680841, 99675226, 99700171, 99737549, 99759984, 99763131, 99770033, 99794501, 99814039, 99805182, 99782163, 99773026, 99778450, 99778223, 99767214, 99767405, 99796504, 99838239, 99858755, 99848032, 99831426, 99833226, 99845368, 99841428, 99816889, 99800742, 99813604, 99835730, 99836260, 99818414, 99812096, 99825591, 99833304, 99813426, 99776429, 99751711, 99743372, 99726623, 99702340]
2572I9702340n90K7478K0945j8650n8603o7658m4995j1719Q584L868n710l398o896
2598.5I9544996k7257m0758k3866Q494K0075k68k7049l7342m0025m5955k6458M0912
2623I9345499J10448J24895Q2732L2657J7565K6936L2621K3669Q548R083K4957L0231
2647.4I9869841J5140J502O819J7971J4507l385j7709j2481P391J7512P665r83P444
2673.9I9931234J8937J5926J418q934q029r322k3228l7509l6723k2226j2201j7316
2698.4I9792027k3061j1807J0311K3538J9092P373J168K396M798r53j1003j1135m887
2724.9I9797857j2756k8860k7001j2589l439m768j3328j5551o413L421m708l0172m0281
2751.4I9601412k1196K486N370j1992k6930k5314j9282j8143j5897r239n060j7881
$$ y = [99702340, 99701750, 99729228, 99750173, 99731523, 99672920, 99605262, 99560267, 99548548, 99557132, 99561000, 99555290, 99551892, 99544996, 99517739, 99476981, 99453115, 99461609, 99481684, 99481416, 99454367, 99417025, 99377000, 99331045, 99304587, 99345499, 99455947, 99580842, 99663574, 99696231, 99713796, 99740732, 99773353, 99797022, 99805570, 99814653, 99839610, 99869841, 99884981, 99886483, 99893302, 99911273, 99925780, 99922395, 99904686, 99892205, 99899596, 99917108, 99924773, 99923790, 99931234, 99950171, 99966097, 99967515, 99958581, 99950552, 99941230, 99918002, 99880493, 99843770, 99821544, 99809343, 99792027, 99768966, 99757159, 99767470, 99791008, 99810100, 99817473, 99818641, 99821037, 99825835, 99824882, 99813879, 99802744, 99797857, 99785101, 99756241, 99729240, 99716651, 99713212, 99708444, 99695116, 99679565, 99673152, 99676573, 99671865, 99641693, 99601412, 99580216, 99582702, 99588072, 99576080, 99549150, 99523836, 99504554, 99486411, 99470514, 99461275, 99456215, 99438334]
2775.9I9438334l9882m6426k9588q34J9526J5939j3751l8547l0851j5598k3842l6008
2800.4I9198472j6295K0790M0036L4493J6952J0544J9145J7941L314q58J2397K1852
2824.9I9378783J5705N025K593Q368R877K026k4849n7310n4764l2568l5489n8836o2012
2851.4I9096549l6657j2905n072p886j2135j1653j6469l0082k6304j192o50l1852m3351
2877.9I8860341k4151Q52J2666J007j5074j6826j2070j4156k8080m5508m9478m0573
2902.4I8628950l6061l8558l4136j4895l952k9867p2581r3585q6886n9402k6542Q29
2926.8I8133314J9931J6690Q678J4746K2388M2188Q4508J08081P9995K5696o503l624
2951.3I8546088j2940m4030m5723j7184K932n90j8435l2789k9212o74K6739K0999J1265
$$ y = [99438334, 99398452, 99352026, 99322438, 99321604, 99341130, 99357069, 99343318, 99304771, 99273920, 99258322, 99234480, 99198472, 99182177, 99202967, 99243003, 99277496, 99294448, 99304992, 99324137, 99342078, 99345392, 99344534, 99356931, 99378783, 99394488, 99399513, 99402106, 99410474, 99420351, 99422377, 99397528, 99340218, 99285454, 99252886, 99217397, 99158561, 99096549, 99059892, 99046987, 99041915, 99034029, 99021894, 99010241, 98993772, 98963690, 98937386, 98936194, 98935544, 98903692, 98860341, 98836190, 98837042, 98849708, 98850715, 98835641, 98818815, 98806745, 98792589, 98764509, 98719001, 98669523, 98628950, 98592889, 98554331, 98520195, 98505300, 98501348, 98471481, 98398900, 98305315, 98218429, 98159027, 98132485, 98133314, 98153245, 98169935, 98178613, 98193359, 98215747, 98257935, 98342443, 98450524, 98530519, 98556215, 98549712, 98546088, 98533148, 98489118, 98443395, 98426211, 98429143, 98428553, 98410118, 98377329, 98348117, 98347443, 98374182, 98395181, 98406446]
2977.8I8406446J2952p099m1556o1763p0643p7522r9438j51724k07734k42770k50804
3000.3I7208345k19548j30933J6802J33687J09977m2236k40147m34661n90092o11782
3020.7I5199412m10640q0770J68073K11471N1791r4510N2315L80701M94457K68828
3041.1I6241128q9150m09997o27619o29675l53670K4003K29084K25884J82730J72382
3061.5I4965100K42406M42291N41836L66127J40244K110j57022l71832n44649m76844
3081.9I5149767o693O38991R40365P40224L81982J64879R0313N0920K551j0812N0634
3104.3I8193121J31309J51157J06734O0809M3386L2205J8042j0842m9329n7465l6347
3126.7I8582780k0349k2691l5972m3249l3945k5677l9286o1178p0751o8533n9462m3231
$$ y = [98406446, 98419398, 98412299, 98370743, 98308980, 98238337, 98160815, 98061377, 97909653, 97701919, 97459149, 97208345, 96988797, 96857864, 96874666, 97008353, 97118330, 97076094, 96835947, 96401286, 95811194, 95199412, 94788772, 94708002, 94876075, 95087546, 95139337, 95044827, 95097142, 95477843, 95972300, 96241128, 96151978, 95741981, 95114362, 94484687, 94131017, 94155020, 94384104, 94609988, 94792718, 94965100, 95207506, 95649797, 96191633, 96557760, 96698004, 96700114, 96543092, 96171260, 95626611, 95149767, 95143074, 95782065, 96722430, 97462654, 97844636, 98009515, 98099828, 98150748, 98153299, 98142487, 98193121, 98324430, 98475587, 98582321, 98643130, 98686516, 98718721, 98736763, 98725921, 98676592, 98619127, 98582780, 98562431, 98539740, 98503768, 98460519, 98426574, 98400897, 98361611, 98300433, 98229682, 98161149, 98101687, 98058456]
3151.2I8058456k0850k425l410k5195m9901o3592o4385n3698m4655n1892n8359m7124
3175.7I7572970l8671m6051n5176n6940n6565o0999o6048o6781o0195m5049l7313m3529
3200.1I6939653m7368m1395l0840k6130l5155m9293n3579n4383o8039q9019j04118
3222.6I6340334j10179j15317j28257j40041j44619j44213j18787o4408k1416r179
3243I5343918k0618o1154j15287j36310j11777p9679p1228p5710p2765n0819P93O1339
3267.5I4610703P8207K9296k8455m8554n3811n8419n9384n6708n1862m9454n1534o6459
3291.9I4193566r0975j10739j27846j35070j23316j12808j32918j89072k44725k73264
3312.3I2652833k85333k74217k12348r7167L4398J10918Q7208k69q9639j46467j70540
$$ y = [98058456, 98037606, 98035181, 98031771, 98006576, 97956675, 97893083, 97828698, 97775000, 97730345, 97678453, 97620094, 97572970, 97534299, 97488248, 97433072, 97376132, 97319567, 97258568, 97192520, 97125739, 97065544, 97020495, 96983182, 96939653, 96892285, 96850890, 96820050, 96793920, 96758765, 96709472, 96655893, 96601510, 96533471, 96444452, 96340334, 96230155, 96114838, 95986581, 95846540, 95701921, 95557708, 95438921, 95374513, 95353097, 95343918, 95323300, 95262146, 95146859, 95010549, 94898772, 94819093, 94747865, 94672155, 94599390, 94548571, 94549364, 94610703, 94688910, 94718206, 94689751, 94641197, 94587386, 94528967, 94469583, 94412875, 94361013, 94311559, 94260025, 94193566, 94102591, 93991852, 93864006, 93728936, 93605620, 93492812, 93359894, 93170822, 92926097, 92652833, 92367500, 92093283, 91880935, 91783768, 91818166, 91929084, 92016292, 92016023, 91926384, 91779917, 91609377]
3334.8I1609377j84536k04748k25348k34687k33400k14362j90472k11651k62713k77668
3355.2H9369792k54947k36613k48718k52467k10923j91695k50089l22425l18593k60592
3375.5H6822730k26265k18910k17831k12896j93411j57768j18440j28364j80680j82903
3395.9H4985262j24240r7042j54531k05135j65534j14316j10722j19877j30772j29611
3416.3H3633482j03247q9097q5675o3122l0398q935j3172q554J7846J657m9293m9132
3440.8H3152360L183M4548M8965L5465M2361P0119R1499J05530J13785R8658R7907
3463.2H3904380J44082J64765J07002M2862N5337J09470J50454J51151J07837R6875
3483.6H5034215J28174J23614J05322J21945J41555J44410J37007J39600J45072J11604
$$ y = [91609377, 91424841, 91220093, 90994745, 90760058, 90526658, 90312296, 90121824, 89910173, 89647460, 89369792, 89114845, 88878232, 88629514, 88377047, 88166124, 87974429, 87724340, 87401915, 87083322, 86822730, 86596465, 86377555, 86159724, 85946828, 85753417, 85595649, 85477209, 85348845, 85168165, 84985262, 84861022, 84763980, 84609449, 84404314, 84238780, 84124464, 84013742, 83893865, 83763093, 83633482, 83530235, 83441138, 83355463, 83292341, 83261943, 83253008, 83239836, 83231282, 83249128, 83250785, 83201492, 83152360, 83155543, 83200091, 83249056, 83284521, 83326882, 83397001, 83488500, 83594030, 83707815, 83806473, 83904380, 84048462, 84213227, 84320229, 84363091, 84418428, 84527898, 84678352, 84829503, 84937340, 85034215, 85162389, 85286003, 85391325, 85513270, 85654825, 85799235, 85936242, 86075842, 86220914, 86332518]
3504H6332518Q8066J15841J53506J74916J59794J31768J33973J60581J82390J60778
3524.4H7794131J19323J11454J31876J63394J88827J74064J50132J79779K14744J86580
3544.8H9414304J28907J21683J46616J49292J52528J77717J97888J96063J83076J62893
3565.2I1030967J48744J64449J82801J89662J99294K07907K19536K40344K57218K23845
3585.6I3064767J40202J42181K10703K30628K36660K55698K39676K13522K21741K18678
3606I5174456J92272J88685K06893K17188J95300J49560J42926J75411J99222J84608
3626.4I7026521J14197R3710J31595J29575J09261R2566Q7196J01774J19722R9826
3646.8I8105943L7396M0937J22296J56075J43326J18374P9471N7411Q3000R8222N1415
$$ y = [86332518, 86420584, 86536425, 86689931, 86864847, 87024641, 87156409, 87290382, 87450963, 87633353, 87794131, 87913454, 88024908, 88156784, 88320178, 88509005, 88683069, 88833201, 89012980, 89227724, 89414304, 89543211, 89664894, 89811510, 89960802, 90113330, 90291047, 90488935, 90684998, 90868074, 91030967, 91179711, 91344160, 91526961, 91716623, 91915917, 92123824, 92343360, 92583704, 92840922, 93064767, 93204969, 93347150, 93557853, 93788481, 94025141, 94280839, 94520515, 94734037, 94955778, 95174456, 95366728, 95555413, 95762306, 95979494, 96174794, 96324354, 96467280, 96642691, 96841913, 97026521, 97140718, 97234428, 97366023, 97495598, 97604859, 97697425, 97784621, 97886395, 98006117, 98105943, 98143339, 98184276, 98306572, 98462647, 98605973, 98724347, 98803818, 98861229, 98944229, 99042451, 99093866]
3669.2I9093866M6146P5215j3345o5988o307L1478P9137J33234J19203k879p4875k3973
3693.7I9390912J6254K4164K6256J4072K5541O4540P4911L0893l8773k9999J6606L5393
3718.2I9650770L7742K7979N090l135M4542J00577R6303K0600l8046L755%q1980N3781
3744.7I9917978N317N8704m3791o9869J2619K9426j7190k1237J9086K3830Q827j2344
3769.2I9911356k9069o348K8050M1085J4299k2298l7968l7777o503K7782L8021L1466
3793.7I9952096J5443K1786m6784J0669l5441k6601n4783l391O0218M3333m560K3949
3818.1I9955934L606n9372j5557O998L517K4491L6508L7390l272o9613n5670k1953
3842.6I9843007j5300K7984Q4305j06102N9944j48451L0631Q3959M3982j0234j3834
$$ y = [99093866, 99140012, 99215227, 99201882, 99135894, 99129587, 99161065, 99240202, 99373436, 99492639, 99489760, 99414885, 99390912, 99407166, 99431330, 99457586, 99471658, 99497199, 99561739, 99636650, 99667543, 99628770, 99598771, 99615377, 99650770, 99688512, 99716491, 99721581, 99718446, 99762988, 99863565, 99959868, 99980468, 99942422, 99946177, 99946177, 99864197, 99917978, 99923295, 99981999, 99938208, 99868339, 99880958, 99910384, 99893194, 99871957, 99891043, 99914873, 99923700, 99911356, 99882287, 99875939, 99903989, 99945074, 99959373, 99937075, 99899107, 99861330, 99854827, 99882609, 99920630, 99952096, 99967539, 99989325, 99942541, 99953210, 99917769, 99891168, 99836385, 99832994, 99893212, 99936545, 99931985, 99955934, 99959540, 99900168, 99884611, 99891609, 99895126, 99919617, 99956125, 99993515, 99990243, 99920630, 99864960, 99843007, 99827707, 99855691, 99939996, 99833894, 99893838, 99745387, 99776018, 99859977, 99903959, 99893725, 99879891]
3865I9879891K7823M29m6885m2653j8376L2902M0692K2095K1416j8596k2519Q40k7275
3891.6I9849784j5068L9560M2856P605k8717n9563l8237J0264R692m256J502m327r722
3918.1I9801373O509J1707q476j4699M560j246k7775k2173m357o86n805j7560n084
3944.6I9716288J5193J31k3001j7989N311K2930L2848L7932L4064L0715K8091J6183
3969.1I9898696J514j037M649M935J19j37j835j1784j1170j395k509p677o348k838
3997.6I9863183
$$ y = [99879891, 99907714, 99908143, 99861258, 99818605, 99800229, 99833131, 99873823, 99895918, 99917334, 99898738, 99876219, 99877059, 99849784, 99834716, 99874276, 99917132, 99924737, 99896020, 99836457, 99798220, 99808484, 99818176, 99813920, 99815422, 99811095, 99801373, 99807882, 99819589, 99811113, 99796414, 99800974, 99799728, 99771953, 99749780, 99745423, 99744737, 99738932, 99721372, 99716288, 99731481, 99731612, 99708611, 99690622, 99695933, 99718863, 99751711, 99789643, 99823707, 99854422, 99882513, 99898696, 99900210, 99899173, 99903822, 99908757, 99908876, 99908739, 99906904, 99895120, 99883950, 99882555, 99880046, 99872369, 99866021, 99863183]
##END=$$ End of the data block
