##TITLE=$$ Begin of the data block
##JCAMP-DX=5.00 $$ ACD/SpecManager v 10.08
##SPECTROMETER/DATA SYSTEM=Varian
##DATE=20 Nov 2012 10:35:18
##DATA TYPE=INFRARED SPECTRUM
##DATA CLASS=XYDATA
##ORIGIN=
##OWNER=
##NPOINTS=3735
##FIRSTX=399.26403809
##LASTX=4000.35498047
##MAXX=4000.35498047
##MINX=399.26403809
##MAXY=78.20232391
##MINY=28.60004425
##XFACTOR=1.0000000000
##YFACTOR=0.000000100000000
##FIRSTY=56.30964279
##DELTAX=0.96440572
##XUNITS=1/CM
##YUNITS=TRANSMITTANCE
##XYDATA=(X++(Y..Y))
399.3E63096428p666168o793747Q231659J1499939p93305o485290q93555O400795r04350
407.9E65692406p092095o605339l834915M56886J401520L046951K793808P243348N040206
416.6E68142776m674148j8455505j9191704J3067741P764893K373581J865272l757210
424.3E47135696l419418L999329L671341N38520M000702j775589n706749j884117n437622
433E41122093l765182R88197K933922j084976k949944J238403M070015N967141j53504
441.7E48366165j450615L274613R63554k564049n213012J854629L816185j269493J016731
450.4E48794708N128784K59934P05261O417580K200813K85225o782646j5910568K337417
459.1E43436508M123802j191291j510354N187264L932915K454796J802558m683876
$$ plain form
399.3 563096428 555430260 548636513 556868172 568368111 567574806 561089516 560195961 566596756 565692406
407.9 565692406 558600311 551994972 548160057 548616943 550018463 553065414 555859222 563102570 568142776
416.6 568142776 563468628 545013123 525821419 538889160 546654053 549027634 550892906 547135696
424.3 547135696 543716278 547715607 551386948 551925468 555926170 554150581 548443832 546559715 541122093
433 541122093 537356911 538345108 541279030 540194054 537244110 538482513 542552528 548519669 548366165
441.7 548366165 546915550 550190163 551153717 548589668 543376656 545231285 549047470 547777977 548794708
450.4 548794708 553923492 554183426 554888687 561306267 563507080 563792305 557009659 541099091 543436508
459.1 543436508 547560310 546369019 544858665 550045929 553978844 556433640 558236198 553552322
466.8E53552322p213134l715973j28746j348000k503509n695115r87243N240135P44438
475.5E37945175j594543k50969K692909j593170o177864k173958m418831m809379O23550
484.1E20242920O438103J520385j460304M222984L103943k50473l570785l907166k238045
492.8E24101562j601791k724037m024811L579979M803772K079010m2343j574822P96547
501.5E25393066m612045m233360K34146j331978j701584j986084l226623q49304l7308
510.2E07648926j429253J452217j63536r155M77791k514839k652626m208336m229317
518.9D94371872m261818l71513M04853k709159j190262K030258K532883p45087J349144
527.5D91411171p90978l361320k251854k355766J460418L01743J90887L057213M365731
$$ plain form
466.8 553552322 546339188 542623215 542494469 541146469 538642960 532947845 531960602 537200737 537945175
475.5 537945175 536350632 536099663 538792572 537199402 531021538 528847580 524428749 519619370 520242920
484.1 520242920 526681023 528201408 526741104 530964088 534068031 533817558 530246773 526339607 524101562
492.8 524101562 522499771 519775734 515750923 519330902 524134674 526213684 526171341 524596519 525393066
501.5 525393066 520781021 516547661 516781807 515449829 513748245 511762161 508535538 507686234 507648926
510.2 507648926 506219673 507671890 507508354 507499199 507976990 505462151 502809525 498601189 494371872
518.9 494371872 490110054 489738541 490143394 487434235 486243973 488274231 490807114 490062027 491411171
527.5 491411171 490620193 487258873 485007019 482651253 484111671 484413414 484604301 487661514 492027245
536.2D92027245M984512K693100K97623p38106m67301p44819k15493L72849J265411
544.9D99475021K454071J014862J176987K805634L918342J38245m160957m742432l672981
553.6D98406792p46537o86454j100083j676178m99763j43128n76019K233582P58667
562.3D95970879o13289l497200n342331k466698l070450l239403k852439j402703j513328
570.9D71973038j276627o17332r7428O56815r03854O30912n06248p1488J294709K15797
580.6D71298294N67665J878472M843483L801383M417000L707962J245613K269097J218872
589.3D95247841M60281j264763k027359p24j4077J091385L260041L304290K44904j147537
598.9D99154282P1983J84784p35855j036492j319885j261864R8725j5679q9073J663437
$$ plain form
536.2 492027245 497011757 499704857 500002480 499264374 498797073 498052254 497836761 498209610 499475021
544.9 499475021 501929092 502943954 504120941 506926575 510844917 510983162 506822205 502079773 498406792
553.6 498406792 497660255 496973801 495873718 494197540 493697777 493554649 492978630 495212212 495970879
562.3 495970879 495357590 491860390 486518059 484051361 480980911 477741508 474889069 473486366 471973038
570.9 471973038 470696411 470079079 469981651 470638466 469734612 470365524 469859276 469787788 471082497 471298294
580.6 471298294 471865959 473744431 478587914 482389297 486806297 490514259 491759872 494028969 495247841
589.3 495247841 495708122 494443359 492416000 492415276 492401199 493492584 496752625 500056915 500301819 499154282
598.9 499154282 499226265 499411049 498675194 497638702 496318817 495056953 495155678 495139999 495050926 496714363
608.5D96714363K731247J620560J048736k97661k386856p63321O7215o27937p14645
617.2D97391701P31888K009620J773224L807755L999176K802353J589164K65351P6866
625.9E14447098k68975r57984o99425Q44841J126365K015000K875671K836113K832299
634.6E25051003J253128M67872r94835j441536j08528n38978J87187J337585J526490
643.3E26739388J678848J825027J978646K473030J721954J087570O65131k071648k401848
651.9E33696098K30141L71208m08783J509285L022156K580490K087555P84760R15222
660.6E44788132O26220n48439j584663k264900q01163Q87108J075516m3068K992668
669.3E45127411L034439J844902J407928J269570R63402l77541j271667j125489l76587
$$ plain form
608.5 496714363 499445610 501066170 502114906 501817245 499430389 498667068 498734283 498106346 497391701
617.2 497391701 498123589 500133209 501906433 505714188 509713364 512515717 514104881 514370232 514447098
625.9 514447098 514178123 513220139 512520714 513365555 514491920 516506920 519382591 522218704 525051003
634.6 525051003 526304131 526772003 525777168 524335632 524227104 523688126 523875313 525212898 526739388
643.3 526739388 528418236 530243263 532221909 534694939 536416893 537504463 538169594 536097946 533696098
651.9 533696098 533926239 534297447 533888664 535397949 538420105 541000595 543088150 543872910 544788132
660.6 544788132 545414352 544865913 543281250 541016350 540215187 541102295 542177811 542134743 545127411
669.3 545127411 548161850 550006752 551414680 552684250 553647652 553270111 551998444 550872955 550496368
678E50496368M37012M83971J518287K073288K875557K468186J065140k5406j515847
686.7E59876556m53376j67351p60269p14569j112824p8812P22733J381035J294594
695.3E59987717N29518O0310j066513k436905k735901k350654l029595j368217Q28476
704E48418236M8942L83225J048088R44748J329918J536941j33209j040153K37197N68505
713.7E53342438O84013Q92983J958885L603782L732148K808380K373352L211937K801361
722.3E75409279J189537Q19511L68729q1177P50275K279320K853965K317124L045845
731E88952408L897819L484002J758193j74446l27224m14696m65584l15056J69602M33693
740.7E96998711J341323L416863K635155L20854j54839K61498l87497j622772l175087
$$ plain form
678 550496368 550933380 551417351 552935638 555008926 557884483 560352669 561417809 561392403 559876556
686.7 559876556 559423180 559255829 558495560 557780991 556668167 556589355 557312088 558693123 559987717
695.3 559987717 560517235 560577545 559511032 557074127 554338226 551987572 548957977 547589760 548418236
704 548418236 548467178 548850403 549898491 550843239 552173157 553710098 553576889 552536736 552773933 553342438
713.7 553342438 554026451 554919434 556878319 560482101 564214249 567022629 569395981 572607918 575409279
722.3 575409279 576598816 577418327 577787056 577705879 578456154 580735474 583589439 585906563 588952408
731 588952408 592850227 596334229 598092422 597917976 597590752 597176056 596710472 596395416 596565018 596998711
740.7 596998711 598340034 601756897 604392052 604712906 604558067 604819565 604432068 602809296 599634209
749.3E99634209l038369j552314k354050j449280j11923K03934J665230M47807j946640
758E91498604k264252k887344l926506k522049j469612j717415j577149r89837R19914
766.7E75064354K387810K778663K004776J514092J593818M99039J29204l76816N17464
775.4E86112404J860390K265548K691078L099785N694237N627213M558944L940392
783.1F15849991K222786K041092J035232J231194M86603P81364K631035K874946L928643
791.8F33082886L578491M006119L249664P19986O4926O64215O34461p11212j203309
800.5F44086227j092453J064454K981338K750015K313462K355804J719437l17078j060257
809.1F54800949k985382l911057k333221j405106q06198n9509P96890J072007O07605
$$ plain form
749.3 599634209 596595840 595043526 592689476 591240196 591128273 591332207 592997437 593445244 591498604
758 591498604 589234352 586347008 582420502 579898453 578428841 576711426 575134277 574144440 575064354
766.7 575064354 577452164 580230827 582235603 583749695 585343513 585842552 585971756 585594940 586112404
775.4 586112404 587972794 590238342 592929420 596029205 601723442 607350655 611909599 615849991
783.1 615849991 618072777 620113869 621149101 622380295 622866898 623648262 626279297 629154243 633082886
791.8 633082886 636661377 640667496 643917160 644637146 644702072 645366287 646000748 645289536 644086227
800.5 644086227 642993774 644058228 647039566 649789581 652103043 654458847 656178284 655861206 654800949
809.1 654800949 651815567 647904510 645571289 644166183 643359985 643300476 644097366 645169373 645776978
817.8F45776978M96673J451569m4937o49109J60675j824341j241150l14484K06910
826.5F44018784J537323J100311m69666J62964K142945k56272j886215k575760k911072
835.2F40863342k305984l104553k057877j239395N73616J840935Q87794M84314l51524
843.9F35590668o01616j250878k407722l699837l376045k553902j543846L57514J97601
852.5F20711937m49638r38073r63897j302109k277756l858414m323272k271843k449455
861.2F01877480j295052J352386K057686L197899L902550N232887O059494M887848
868.9F27273178K768974K179909K588349K023391K108193K302818L385391L125611
876.7F47755814L282699L641052K630234K316437O49643o18515k369156k798004l250199
$$ plain form
817.8 645776978 646273651 647725220 647680283 647031174 647191849 645367508 644126358 643811874 644018784
826.5 644018784 645556107 646656418 646186752 646349716 648492661 648236389 646350174 643774414 640863342
835.2 640863342 638557358 635452805 633394928 632155533 632729149 634570084 635457878 635942192 635590668
843.9 635590668 634989052 633738174 631330452 627630615 624254570 621700668 620156822 620514336 620711937
852.5 620711937 620262299 619324226 618360329 617058220 614780464 610922050 606598778 604326935 601877480
861.2 601877480 600582428 601934814 603992500 607190399 611092949 616325836 622385330 627273178
868.9 627273178 630042152 632222061 634810410 636833801 638941994 641244812 644630203 647755814
876.7 647755814 651038513 654679565 657309799 659626236 660275879 659657364 657288208 654490204 651240005
885.3F51240005l946685k336045j864471j173401l71017k05841p27082j939316k792167
894F35883980k625542k155609k711754k631569k396126j864051j710129j353722o42738
902.7F17792740p12166o39610j775170k524223l420601m333000m087219m065094l525391
911.4E92710266l479271m062958l925857l241539l517037l263359l149643l911666
919.1E64158936k776375k453919k858772k314110k039909r67560L54042J099968P86667
927.8E52988968M01611J132241J248817N25093o47926j88561P06673O35834Q80851
936.4E57683601J001854K238350K708550K472839K920036K503624J981316J467400
944.2E74977570j06278j347198r01795j860504k592087k108650j982918r08699k114944
$$ plain form
885.3 651240005 647293320 644957275 643092804 641919403 641548386 641342545 640615463 638676147 635883980
894 635883980 633258438 631102829 628391075 625759506 623363380 621499329 619789200 618435478 617792740
902.7 617792740 617080574 616440964 614665794 612141571 608720970 604387970 600300751 596235657 592710266
911.4 592710266 589230995 585168037 581242180 578000641 574483604 571220245 568070602 564158936
919.1 564158936 561382561 558928642 556069870 553755760 551715851 550748291 551102333 552202301 552988968
927.8 552988968 553390579 554522820 555771637 556296730 555648804 555460243 556166916 556802750 557683601
936.4 557683601 558685455 560923805 563632355 566105194 569025230 571528854 573510170 574977570
944.2 574977570 574871292 573524094 572622299 570761795 568169708 566061058 564078140 563169441 561054497
952.8E61054497m245301m848136n987397o461906p158051p246971o253280n937119
960.6E12916336n621300n736046n600852o387215o044846n862159p175446p283173
968.3D63205299q308715q682862r049721q729934q648949q836479q257446q902588
976C93788605q015518q070946p728501q123779q030052p201729p252083n737381o148147
984.7C27480469m456482m207878m265843l530788l037319j820412k855949j391526
992.4C01914272j980114j269188j103973j444015J65519l19137J348858k49901l99094
1001.1B96663227o3114M39052N55363j403866M42562p44209r43775j625175j404706
1009.7B91915359j363677j928254O79188j086426o30607j239052j28365N76344p94067
$$ plain form
952.8 561054497 556809196 551961060 545973663 539511757 532353706 525106735 518853455 512916336
960.6 512916336 507295036 501558990 495958138 489570923 483526077 477663918 470488472 463205299
968.3 463205299 454896584 446213722 437164001 428434067 419785118 410948639 402691193 393788605
976 393788605 385773087 377702141 369973640 361849861 353819809 346618080 339365997 333628616 327480469
984.7 327480469 323023987 318816109 314550266 311019478 307982159 306161747 303305798 301914272
992.4 301914272 299934158 298664970 297560997 296116982 296282501 295963364 297312222 297062321 296663227
1001.1 296663227 296600113 297039165 297594528 296190662 296633224 295889015 294945240 293320065 291915359
1009.7 291915359 290551682 288623428 289302616 288216190 287585583 286346531 286218166 286794510 286000443
1018.4B86000443R48810n14469L97510M9878J233673J312942P25994J837426R7618
1027.1B92089825J875991R32885J574821J092892K38819J216526K62642K089615N99479
1035.8C01973495J098691N03711J9551M82597o93474K86026n62458R27525l88718j98364
1045.4C03448582j25084p02820R52949p28263Q91094L78647K203941K617607J072235
1054.1C10008888K330132K346668M243164K170315K098923K534713L072663L571891
1061.8C32377357L834534N585861L471299M227256K856369J991730R71222j270599
1069.5C54045029j710434l943634l150444n038987m547843l176232k326088j53694
1077.2C29997673j125107J84288M4174J729393Q27485J428413K915077J436691K969933
$$ plain form
1018.4 286000443 286949253 286434784 286832294 286882172 288115845 289428787 290154781 291992207 292089825
1027.1 292089825 293965816 294898701 296473522 297566414 297805233 299021759 299284401 301374016 301973495
1035.8 301973495 303072186 303575897 303595448 304078045 303384571 303670597 303108139 304035664 303646946 303448582
1045.4 303448582 303323498 302620678 303573627 302845364 303736458 304115105 306319046 308936653 310008888
1054.1 310008888 312339020 314685688 318928852 321099167 323198090 325732803 328805466 332377357
1061.8 332377357 336211891 341797752 345269051 349496307 352352676 354344406 355315628 354045029
1069.5 354045029 352334595 348390961 345240517 340201530 335653687 332477455 330151367 329997673
1077.2 329997673 328872566 329056854 329101028 330830421 331657906 333086319 336001396 337438087 340408020
1085.9C40408020K115974M335404M251709L596611L689423L056144L519135J828727
1093.6C66801147K442132Q10813J168938J091423P19833J854401L40271J282120L77998
1102.3C76889076L71018k44179J6212M55895J0033J758003J017570K979050K351684
1111C85604362K215004K626229K054634L383293K186241L014107J500587J458092J449165
1119.7D05491714P38259J545944p9994J485863J316833J355743J241112J428643K781639
1128.4D17305756J838760J884232P06825J636123J353264J185418J605224m997k0867
1137D27489738p36618k03933j196709j615868k406234l114014j281013k688218l636894
1145.7D10610237m465484k807732j660576j447144n45806j302796l14751j493034l22266
$$ plain form
1085.9 340408020 342523994 346859398 351111107 354707718 358397141 361453285 364972420 366801147
1093.6 366801147 369243279 370054092 371223030 372314453 373034286 374888687 375228958 376511078 376889076
1102.3 376889076 377260094 377015915 377032127 377488022 377498055 379256058 380273628 383252678 385604362
1111 385604362 387819366 390445595 392500229 395883522 398069763 401083870 402584457 404042549 405491714
1119.7 405491714 406229973 407775917 407695923 409181786 410498619 411854362 413095474 414524117 417305756
1128.4 417305756 419144516 421028748 421735573 423371696 424724960 425910378 427515602 427510605 427489738
1137 427489738 426753120 426549187 425352478 423736610 421330376 418216362 416935349 414247131 410610237
1145.7 410610237 406144753 403337021 401676445 400229301 399683495 398380699 398065948 396572914 396250648
1154.4C96250648R2774J05934N30815j08490J871834Q66165J814537K559357L950119
1163.1D07933693M644165M055405N894622M651452N295944N525207N393334N286522
1170.8D48680344N825348P029876N932160O996765O997680O554413N726586N113220
1178.5D98856392N814171N242996M259071L464241L926049L692894L702507M297409
1186.2E33255730L822136L313560K936592K925644K833519K182427J073379K22855
1193.9E52565842o79055p45201L27607N70716N58510O73447P96089Q43124N67360M61808
1203.6E55940247M88510J02005n24330j3962M59976M15039J100159J422653J512566
1212.3E60902863J880340J961708J898346J452675M03481K13546L58353l34702r31663
$$ plain form
1154.4 396250648 396343422 396449356 396980171 396871681 398743515 399609680 401424217 403983574 407933693
1163.1 407933693 412577858 416633263 422527885 427179337 432475281 438000488 443393822 448680344
1170.8 448680344 454505692 461535568 467467728 474464493 481462173 488016586 493743172 498856392
1178.5 498856392 504670563 509913559 514172630 517636871 521562920 525255814 528958321 533255730
1186.2 533255730 537077866 540391426 543328018 546253662 549087181 551269608 552342987 552565842
1193.9 552565842 551886787 551141586 551469193 552039909 552598419 553271866 554067955 554911079 555478439 555940247
1203.6 555940247 556428757 556530762 556006432 555992470 556452446 556867485 557967644 559390297 560902863
1212.3 560902863 562783203 564744911 566643257 568095932 568499413 568712959 569071312 568736610 567804947
1220.9E67804947k83585L49274L19710K53868j12457k38648q09097r68781r34486j683388
1230.6E63697357j724090j790657j395112j000595p29637L86887M77028K52304j72768
1239.3E58000717l65753k97928j232033j238899j017341p23076j38626J55944J016007
1247.9E54159012J168480J194343J471329J224022O61163L82386K479q88595j043053
1256.6E58331566k12555K28157J75323L58658N56870J403770J897888J126061R27658
1265.3E64793396M87328j3619Q2436K67830O4468k00233M34532J225586J688652J845169
1274.9E70675545J728058J407013P40127k83012q70018j099091p68318m10004r42764
1283.6E70177536o1722L88527L01323J337433J262894P81898K91329n4245n66788j092224
$$ plain form
1220.9 567804947 567521362 567870636 568190346 568444214 568331757 568093109 567284012 566315231 565380745 563697357
1230.6 563697357 561973267 560182610 558787498 557786903 557057266 557444153 557921181 558173485 558000717
1239.3 558000717 557634964 557337036 556105003 554866104 553848763 553125687 552987061 553143005 554159012
1247.9 554159012 555327492 556521835 557993164 559217186 559878349 560260735 560263214 559374619 558331566
1256.6 558331566 558119011 558347168 558522491 558881149 559438019 560841789 562739677 563865738 564793396
1265.3 564793396 565280724 565267105 565349541 565617371 565681839 565481606 565916138 567141724 568830376 570675545
1274.9 570675545 572403603 573810616 574550743 574267731 573397713 572298622 571530304 571120300 570177536
1283.6 570177536 570115814 570504341 570805664 572143097 573405991 574187889 574479218 574424973 573858185 572765961
1293.3E72765961j337281j529769j281052j023331m64515j11275M97360L57590o66924
1301.9E67206764p94487j275100j418839j602058k281456k085190r70078n30586q32710
1310.6E55416260l40538O256r1057k68860o52122o24657q23174j544189k076759j055642
1320.3E47945518k67028n04113m61120n35393m95148q44307j429634j889267k371101
1328.9E39148407k378998k611580k703666k075272j254044q50029j120071n99174k92473
1337.6E25263100l07579o32744j42288M33120l46145l66364n53932j57776L80898R69581
1347.3E24539871R37920K59743J039123P51495L8605o82754p43943o21872p89184n53322
1356.9E24175682q73108l14445k48680j107R7008m96674J92452M56009N86853p25517
$$ plain form
1293.3 572765961 571428680 569898911 568617859 567594528 567130013 567018738 567516098 567873688 567206764
1301.9 567206764 566412277 565137177 563718338 562116280 559834824 557749634 556779556 556248970 555416260
1310.6 555416260 555075722 555081978 554990921 554722061 554069939 553445282 552622108 551077919 549001160 547945518
1320.3 547945518 547678490 547174377 546713257 546177864 545682716 544838409 543408775 541519508 539148407
1328.9 539148407 536769409 534157829 531454163 529378891 528124847 527274818 526154747 525555573 525263100
1337.6 525263100 524955521 524322777 524180489 524613609 524267464 523901100 523347168 523189392 523570290 524539871
1347.3 524539871 525477791 525737534 526776657 527528152 527566757 526884003 526140060 525518188 524729004 524175682
1356.9 524175682 523302574 522988129 522739449 522738342 522835350 522338676 522531128 522987137 523573990 522848473
1366.6E22848473j152611j201973o68411J20315j42097R53903N83305R27162J463929
1375.2E23731995J386299J408653L33061K50817k44942M2419l39164k96669Q17718
1383.9E27090187J197739J988067J600647K204476J896743J820069J104736M4365j03950
1392.6E38843079k50664j092148k270851O22063L60641k70920m81224l00903O00433
1401.3E35759506p48482o05773j091996k487144j581345r04274p69958j215325m18472
1409.9E25936737p87544m80156J71280j97907k60238j117859j198044j513290j69907
1418.6E20383072j991387r918J604805J69525R98917N79834J437492R20868K55280
1427.3E24348488J350136J31340N3100j37901O22749J73760M50821J439018J78986
$$ plain form
1366.6 522848473 521695862 520493889 519825478 519945793 519803696 520757599 521340904 522268066 523731995
1375.2 523731995 525118294 526526947 526860008 527110825 526865883 526908302 526569138 526272469 527090187
1383.9 527090187 528287926 530275993 531876640 534081116 535977859 537797928 538902664 538947029 538843079
1392.6 538843079 538592415 537500267 535229416 535851479 536212120 535941200 535459976 535159073 535759506
1401.3 535759506 535011024 534405251 533313255 530826111 529244766 528340492 527570534 526355209 525936737
1409.9 525936737 525149193 524669037 524840317 524642410 524382172 523264313 522066269 520552979 520383072
1418.6 520383072 518391685 518381767 519986572 520156097 521155014 521734848 523172340 524093208 524348488
1427.3 524348488 525698624 525829964 525883064 525745163 526367912 526541672 526992493 528431511 528610497
1436E28610497M58030J014176J890678O96068P67593N26200n01748M4976q21457O84967
1445.6E33369980J10283j1559j10702L52173J045074j069183m03977j068802l44162
1454.3E31869125j066970q10624K3728m038162L531951J146965K885285J775246J324729
1463E36641273K035981J68190K884102R56459K886009K198639L111801M057159J688385
1471.7E56627998M542618M489021P637597M329452M749603M130288L148956L196678
1479.4E92852211J617622K564927J877555L724213L152466K914467L114700J346626
1487.1F13164787M211884J691665R58100N08194K113037K031593O31256J707306m66614
1495.8F26551208j002235K273293K095413J694565J875305J432495M5853Q75473j97983
$$ plain form
1436 528610497 529068527 530082703 531973381 532669449 533437042 533963242 533461494 533506470 532685013 533369980
1445.6 533369980 533480263 533468704 533358002 533710175 534755249 533686066 533282089 532213287 531869125
1454.3 531869125 530802155 529991531 530015259 525977097 529509048 530656013 533541298 535316544 536641273
1463 536641273 538677254 538845444 541729546 542686005 545572014 547770653 550882454 554939613 556627998
1471.7 556627998 561170616 565659637 573297234 577626686 582376289 586506577 589655533 592852211
1479.4 592852211 594469833 597034760 598912315 602636528 605788994 608703461 611818161 613164787
1487.1 613164787 617376671 619068336 620026436 620534630 622647667 624679260 625310516 627017822 626551208
1495.8 626551208 625548973 627822266 629917679 631612244 633487549 634920044 634965897 635841370 635643387
1504.5F35643387j76163p270737n818023O243934K221451L206558K217522J758728
1512.2F38026657J88675R33037L14293o87142J16272j508255L186150Q67081k073899
1520.8F39362869J54839J361885M016113J261139J074066J461563J416397k40402k66876
1529.5F49601593P85141j125336p324j031876o63146K463073J660691J536407M36478
1538.2F53655701k677307o583863L209076L58963M60663K834930p25708L12272K350692
1546.9F53195419J785813O30264j202316K51999K306747J343994k27203k420273J79291
1555.6F55843735K329483P3166q848343m933472O008377N533981L314362J736221k65808
1564.2F60791702j378936n68772n0812j27945j224212l424835O36901J109620J20849
$$ plain form
1504.5 635643387 635467224 628196487 622378464 628622398 630843849 634050407 636267929 638026657
1512.2 638026657 638215332 639148369 639462662 638775520 638891792 637383537 640569687 641436768 639362869
1520.8 639362869 639517708 640879593 644895706 646156845 647230911 648692474 650108871 649868469 649601593
1529.5 649601593 650386734 649261398 649254074 648222198 647559052 650022125 651682816 653219223 653655701
1538.2 653655701 650978394 644394531 647603607 647962570 648423233 651258163 650532455 650844727 653195419
1546.9 653195419 654981232 655611496 654409180 654661179 656967926 658311920 658084717 655664444 655843735
1555.6 655843735 658173218 658246384 649398041 644464569 650472946 656006927 659321289 661057510 660791702
1564.2 660791702 659412766 658843994 658793182 658665237 657441025 654016190 654653091 655762711 655883560
1572.9F55883560Q3008K90909j476059n555115R41544K89688j368485j420288j557693
1581.6F46111069q69904q72726q60443j264420j509247j286964j466561j549911k517242
1590.3F33913651k294999k925110k480430k496643k454224j439171j977119r01489
1598F16944466j601410j464958k035904k530899k317048l379097k321472k723160j829376
1606.7E96741142k416000j964340j810608k067375p34864k299804j654091k786064
1614.4E81007996j437226k128257q017998P69272q61893r76257k019959M387p84454
1623.1E65555611l472329r2506j101189k97203l227195j753579q13331j216660o41784
1631.7E52939835r41277Q18100r08470k062302j294594J317749J038590M00009Q49762
$$ plain form
1572.9 655883560 655966568 656257477 654781418 649226303 650167847 650457535 649089050 647668762 646111069
1581.6 646111069 645241165 644368439 643507996 642243576 640734329 639447365 637980804 636430893 633913651
1590.3 633913651 631618652 628693542 626213112 623716469 621262245 619823074 617845955 616944466
1598 616944466 615343056 613878098 611842194 609311295 606994247 603615150 601293678 598570518 596741142
1606.7 596741142 594325142 592360802 590550194 588482819 587747955 585448151 583794060 581007996
1614.4 581007996 579570770 577442513 569424515 570193787 569331894 568355637 566335678 566340065 565555611
1623.1 565555611 562083282 561990776 560889587 560592384 557365189 555611610 554798279 553581619 552939835
1631.7 552939835 551998558 552816658 551908188 549845886 548551292 549869041 550907631 551307640 552157402
1640.4E52157402o30531Q14209l98903R42497P30095j692696J938515Q39729L273774
1649.1E57974091J307907K080574J889991j419105l627663K040367L895951K069587
1656.8E66211700K275544J017532J796494K277030J856232J905823J054268L277778
1664.5E81672401K067261K323036J665345R89914J873817J929283M047127L282013
1672.3E99850197L853721L320885K611313K642136L465843L523559J970215K216683
1680F23454552K237358L661690L245735l64723J332016N899581N563927L627091K613525
1688.6F51270752K917328K498169K673492K639160J909714K192841J737442j404953
1696.4F66433945L639297L925476M134369R92661k090531M622574L097305Q08793p11289
$$ plain form
1640.4 552157402 551526871 552341080 551942177 552884674 553614769 551922073 553860588 554700317 557974091
1649.1 557974091 559281998 561362572 563252563 561833458 558205795 560246162 564142113 566211700
1656.8 566211700 568487244 569504776 571301270 573578300 575434532 577340355 578394623 581672401
1664.5 581672401 583739662 586062698 587728043 588717957 590591774 592521057 596568184 599850197
1672.3 599850197 603703918 607024803 609636116 612278252 615744095 619267654 621237869 623454552
1680 623454552 625691910 629353600 632599335 632234612 633566628 639466209 645030136 648657227 651270752
1688.6 651270752 654188080 656686249 659359741 661998901 663908615 666101456 667838898 666433945
1696.4 666433945 670073242 673998718 678133087 679125748 677035217 681657791 684755096 685563889 684852600
1705F84852600P62482q6136J195755J852646Q31146K80457R11178J524353P73697j176376
1714.7F91721802j021500J961289l75290m330292L479843K280731J140747N94559K56043
1723.4F95707932L32946J325226J296082K90527L50189L6240j004028n12085J549758
1732F99372787J548386l353958k392273L468628K618332Q38852R85031l95050o97327
1740.7G01993408K690277R08051q46863J105728K289887J702728J200256J471329J204605
1749.4G13719406L328781J321869P33643K872390J392060J713562J851883K84271J324692
1758.1G28542557K126693J993790K041702k14614N35736K631683J250992P49588Q12836
1766.8G40470963N69839m89349J526107K163773l74374p33109M56390L048249J672210
$$ plain form
1705 684852600 685615082 685528946 686724701 688577347 689408493 689688950 690600128 692124481 692898178 691721802
1714.7 691721802 690700302 692661591 692286301 687956009 691435852 693716583 694857330 695451889 695707932
1723.4 695707932 696040878 697366104 698662186 698952713 699302902 699339142 698335114 697823029 699372787
1732 699372787 700921173 697567215 695174942 698643570 701261902 702100754 703085785 702690735 701993408
1740.7 701993408 704683685 705591736 704744873 705850601 708140488 709843216 711043472 712514801 713719406
1749.4 713719406 717048187 718370056 719103699 721976089 723368149 725081711 726933594 727217865 728542557
1758.1 728542557 730669250 732663040 734704742 734490128 735025864 737657547 738908539 739658127 740470963
1766.8 740470963 741040802 740551453 742077560 744241333 743866959 743133850 743590240 746638489 748310699
1775.4G48310699k20184J121445P8583N95398k87781l66440J495590J236267J067963
1784.1G53031540O2485Q15963R76029J49917J64032M27628q36945q69674p95670J05515
1793.8G53230820K412185J054840J21308P00455R81445L92532o87179J017303m85763
1802.4G58737946J0681Q32290M7074L54156j76163K60849R94492Q71506n32761K43378
1812.1G61643448P23724N02091Q14209m39988j64489m19159K61078Q08868L9978L27072
1821.7G64096832k77786Q05359J063003p28073l18756P20368P69272q37479j891327
1830.4G63401413O95267J689605J64338l46909J82648M00467N76324j94549L48434
1839.1G66917038J64795P6370n62591M52499N20019l634796J781311J662827j49384
$$ plain form
1775.4 748310699 748090515 749211960 749290543 749885941 749598160 749231720 750727310 751963577 753031540
1784.1 753031540 753094025 753909988 754886017 755035934 755199966 755627594 754790649 753920975 753125305 753230820
1793.8 753230820 755643005 756697845 756819153 757519608 758501053 758893585 758206406 759223709 758737946
1802.4 758737946 758748627 759580917 759627991 759982147 759805984 760066833 761061325 761932831 761400070 761643448
1812.1 761643448 762367172 762869263 763683472 763243484 763078995 762659836 762920914 763729782 763769760 764096832
1821.7 764096832 763819046 764624405 765687408 764959335 764640579 765360947 766130219 765292740 763401413
1830.4 763401413 764096680 765786285 765950623 765603714 765786362 766186829 766763153 766568604 766917038
1839.1 766917038 767081833 767158203 766595612 767048111 767568130 763933334 765714645 767377472 767228088
1847.8G67228088q4991L76129Q82568J02692r6054m65469J92260J01624k05002L88184
1857.4G68420029o0349o8817J10321O62994k0446P9117n7068n88608Q6212o04935k97546
1868G67660904j054993L8452J540146J020127K40936l53012M50973k08206L7613J3809
1877.7G69386749j87835K06375l45383L87268%K84424L12652J03531L46527k36206
1887.3G70258102M99421m72565j294861J61514O54602K01416J09101K98691m43955
1896G69971466R04617Q60367L0747n2185j92566K0675m01687k64664m27933k36740
1905.6G70212097O4621K11411L00140J62888P5378J76086Q32901m63180l48206J38855
1915.3G71362991j10702L24249j630325l36991O17752R4071K07291l84446K33155R14840
$$ plain form
1847.8 767228088 767143097 767519226 768401794 768504486 768408432 767942963 768135223 768236847 768031845 768420029
1857.4 768420029 768359680 768290863 768401184 769064178 769043732 769122849 769065781 768477173 768563385 767958450 767660904
1868 767660904 766605911 766644363 768184509 769204636 769445572 769092560 769543533 769335327 769372940 769386749
1877.7 769386749 769198914 769405289 769059906 769447174 769447174 769731598 770044250 770147781 770494308 770258102
1887.3 770258102 770757523 770284958 768990097 769151611 769806213 770007629 770116730 770415421 769971466
1896 769971466 770876083 771736450 771767197 771715012 771522446 771543121 771141434 770876770 770448837 770212097
1905.6 770212097 770276718 770488129 770788269 770951157 771026535 771202621 772035522 771572342 771224136 771362991
1915.3 771362991 771252289 771576538 769946213 769609222 770226974 770321045 770528336 770143890 770377045 771291885
1924.9G71291885P01752j97830O943k46048m39072l02200m61350K22244l10287m9133
1934.6G70216904L73764N24444M31977k5406K07138j76010K23617j016159j340332
1943.2G69419937P65228K26822k37121n9586L30429L59497N74951J02845J6021K16904
1952.9G71715927l60489o6910k44369j33286l02047l1433N4550k66114N13611J5946
1962.5G70895386K53448J67389J14975L53851n06668k35366p3395K89383j08719k23389
1972.2G70926895J24359p4920K5940l12729P8354K13241J64032j24588j42288J64642
1981.8G71042938j58920J82724K2278O2256j25122k91977p8659j86005L23410k31171
1991.5G70561752r12475J58157J088181L27224k07672K30408j04370k67487m47387
$$ plain form
1924.9 771291885 771993637 771795807 771802750 771556702 771117630 770815430 770354080 770576324 770266037 770216904
1934.6 770216904 770590668 771115112 771547089 771521683 771728821 771552811 771776428 770760269 769419937
1943.2 769419937 770185165 770411987 770174866 770115280 770445709 770805206 771380157 771483002 771499023 771715927
1952.9 771715927 771355438 771288528 771044159 770910873 770608826 770577393 770631943 770365829 770879440 770895386
1962.5 770895386 771148834 771316223 771431198 771785049 771278381 771043015 770969620 771259003 771150284 770926895
1972.2 770926895 771051254 770976334 771002274 770689545 770767899 770981140 771145172 771020584 770878296 771042938
1981.8 771042938 770884018 771066742 771089020 771151276 771026154 770734177 770655518 770469513 770792923 770561752
1991.5 770561752 769649277 769807434 770895615 771222839 771015167 771245575 771141205 770873718 770426331
2000.1G70426331j05286p9498j12076r766q7433Q7967l56674O4087j30234l17459N2643
2010.7G69432602L3722K58179m10462l38592o9275j17340l60794l96500J80588O9503
2020.4G68281631M9057O7521J99508l00979m84696j52206Q8730l4485r07059j34125
2030G66672897K34146J96763k91825q32748J67312Q622j08796l22876p4005J26953
2039.7G65776443m81491m11377k37579K76184n7754K4414n9815l4790L58429j84707
2049.3G64967957K03552k15378l06549J33362L22571K3803o27212q8806l0976L48892
2059G64731216k14996l28751K88697o6147L47748R7809M36172K72369k55203k78396
2068.6G65030518l84903J6555m80728j80282J76773J22528K36130L81851K30560l09601
$$ plain form
2000.1 770426331 770321045 770241547 770129471 770119705 770032272 770120239 769763565 769827652 769697418 769379959 769432602
2010.7 769432602 769466324 769724503 769314041 768975449 768906174 768788834 768428040 768031540 768212128 768281631
2020.4 768281631 768330688 768398209 768597717 768296738 767812042 767659836 767748566 767714081 766807022 766672897
2030 766672897 766907043 767103806 766811981 765979233 766146545 766155167 766046371 765723495 765649490 765776443
2039.7 765776443 765294952 764883575 764645996 764922180 764864426 764888840 764829025 764794235 765152664 764967957
2049.3 764967957 765171509 764956131 764649582 764782944 765105515 765129318 764502106 764413300 764382324 764731216
2059 764731216 764516220 764187469 764476166 764410019 764757767 764855576 765291748 765564117 765308914 765030518
2068.6 765030518 764645615 764662170 764181442 764001160 764177933 764300461 764536591 764918442 765149002 764839401
2078.2G64839401K97928P3547o1264r002k40479j48391m21219Q9798L48510R4834k63748
2088.9G64599915m7074Q2779K56653N30853j32751l5935l13949k55738o6986K47193
2098.5G64864960O95572j85395j18789k08130L5019J93405k8305L96881Q1329k7771
2108.1G65698776l20358j87149j36719q4762J83410J78986L79791j88904J7243M5547
2117.8G65585861K670O0502j54572K50473l7002L967j52359k06223N5695K28119K94265
2128.4G65931396Q469O9428l69263O7444j87149o54526Q1406L46222P67593J40915
2138G66201935k8534J34048j96304r9869q4839j21383m77982j46637k8305M42200P34711
2148.6G66329041j33210m1351L57513K61002k03857j99662k94037q6364K48184L0060
$$ plain form
2078.2 764839401 765137329 765210876 765149612 765140610 764900131 764751740 764330521 764420319 764768829 764863663 764599915
2088.9 764599915 764552841 764635620 764892273 765423126 765290375 765254440 764940491 764684753 764617767 764864960
2098.5 764864960 765560532 765375137 765256348 765048218 765083237 765276642 765248337 765645218 765726547 765698776
2108.1 765698776 765378418 765191269 765054550 764969788 765153198 765332184 765711975 765523071 765540314 765585861
2117.8 765585861 765588531 765649033 765494461 765744934 765707932 765711899 765559540 765353317 765409012 765637131 765931396
2128.4 765931396 765939865 766009293 765640030 765707474 765520325 764865799 764947205 765293427 766061020 766201935
2138 766201935 766173401 766307449 766111145 766011276 765926437 765805054 765327072 765180435 765152130 765594330 766329041
2148.6 766329041 766195831 766154480 766511993 766772995 766569138 766369476 766075439 765989075 766237259 766267319
2158.3G66267319P019n14374l6850N97687P09381K68402j72501M26407J65711J49154
2167.9G67867355j11084k65655R460j93176r2468j40839L32718N08270M15116Q4076
2177.6G68413773J55563L99475k25601m883q2779J44806L06396r3002J2131J25809
2187.2G69151688O38961M59290J06277K05460K56424n17502o90613R2850K5711K93961
2196.9G70022507r384J85089N54733L6545K49939L33786L47671J30310J40305k12402
2206.5G71779099m69208j65787l9444M50287R3765K5788J66549K23389K28729L0441
2216.1G72323608J67618l70712j51291M578j75019O8436K52914K52457K0447M58374
2225.8G72851410M53339M79278M7989l46909R4681m13971n26504p6142K60926M3106
$$ plain form
2158.3 766267319 766274338 765759964 765723114 766320801 767030182 767298584 767126083 767552490 767718201 767867355
2167.9 767867355 767756271 767490616 767500076 767306900 767214432 767073593 767406311 767914581 768329697 768413773
2177.6 768413773 768569336 768968811 768743210 768738327 768655548 768800354 769106750 769013748 769025879 769151688
2187.2 769151688 769790649 770249939 770356216 770561676 770818100 770300598 769609985 769702835 769728546 770022507
2196.9 770022507 770013123 770198212 770752945 770789490 771039429 771373215 771720886 771851196 771991501 771779099
2206.5 771779099 771309891 771144104 771104660 771554947 771648712 771674500 771841049 772064438 772293167 772323608
2216.1 772323608 772491226 772120514 771969223 771973801 771798782 771867218 772120132 772372589 772393036 772851410
2225.8 772851410 773304749 773784027 773832016 773485107 773579788 773165817 772639313 772563171 772824097 772867203
2235.4G72867203J04217M04053M27094N19027j12839j87225o2485j8310j69068k36969
2245.1G73534698m29992o24008P23037P58057J25046k8534O4163L76053P3166L7231
2254.7G74608917l96347l32489k64740p2708o1722k46277L77655J17569N69382M57001
2264.4G74756241K8686K50779O8817K02179m00925n69611m07257J37024K84271K37427
2274G74587631L22418j02920O21643K33078k20032l30658k50320j5640n66712N1041
2283.7G74329529r2316P9498p4691j73264O93665L14483N55344O4621k77252l24021
2293.3G75095596j65329Q8959o83060j6250k5559M2115L73764N85098Q00629j66321
2302.9G75929642j33438k71759K1896N92041N6076l53317j67618J60751K26059P86362
$$ plain form
2235.4 772867203 772971420 773375473 773802567 774321594 774208755 774021530 773959045 773940735 773771667 773534698
2245.1 773534698 773104706 772480698 773203735 773961792 774086838 774058304 774122467 774498520 774571686 774608917
2254.7 774608917 774212570 773880081 773615341 773542633 773480911 773234634 773612289 773729858 774299240 774756241
2264.4 774756241 774784927 775035706 775104523 775306702 774905777 774336166 773928909 774065933 774350204 774587631
2274 774587631 774910049 774807129 775428772 775661850 775441818 775111160 774860840 774845200 774278488 774329529
2283.7 774329529 774237213 774316711 774242020 774068756 774762421 775076904 775632248 775696869 775419617 775095596
2293.3 775095596 774930267 775019226 774336166 774319916 774294357 774336472 774710236 775295334 776095963 775929642
2302.9 775929642 775796204 775524445 775546341 776138382 776194458 775841141 775673523 775834274 776060333 776846695
2312.6G76846695Q1024j46942P15866M02832o10046o46973M27475L13187J44729n13305
2322.2G77014542K63748R75952K9373O73447J29013p4997l44620j21155L12119L4103
2331.9G78891525L23715j663894r37958J178207J227875K77481N36194J280365o17065
2340.6G80496445j369019q72650j47934k23083l16773o06537j544113m36783Q75473
2349.2G75855026J482010Q38623O66886M98809M10920M23889j074295K73208m74930
2357.9G78900146l63769N99365K27127P27387O10351J322632p45849p92389j530838
2366.6G78954163k081070n23377o50024o43387j185303K32697J68457p03736p84759
2375.3G72783661r74808L6850l40881o71082p30285n04151l48663o26602k84958j55945
$$ plain form
2312.6 776846695 776927719 776780777 777496643 777899475 777289429 776642456 777069931 777383118 777527847 777014542
2322.2 777014542 777278290 778254242 778283615 778957062 779086075 779011078 778666458 778545303 778857422 778891525
2331.9 778891525 779215240 777551346 776613388 777791595 779019470 779296951 779833145 781113510 780496445
2340.6 780496445 779127426 778254776 778106842 777883759 777566986 776960449 775416336 774979553 775855026
2349.2 775855026 777337036 778175659 778842545 779341354 779752274 780176163 779101868 779375076 778900146
2357.9 778900146 778536377 779135742 779362869 780090256 780700607 782023239 781277390 780485001 778954163
2366.6 778954163 776873093 776349716 775699692 775056305 773871002 774103699 774272156 773568420 772783661
2375.3 772783661 771808853 771845703 771504822 770833740 770103455 769599304 769250641 768624039 768339081 768183136
2384.9G68183136K08969J7243k97471k18505J02233O2790m82254k01110m34037k86026
2394.6G66654968j21231k17743K01111j2512M9896K90680J76544o00281o34536j55716
2404.2G65631180k87094l05100l44238j04370l34778K6093K15988k15302o1493j21841
2413.8G64099045J69906j98440m76761m70505m32281k32163l73916J20697j94702k19727
2423.5G61791153k8763j69678J77994k26059k50702k66342p96890q24814j07574k9679
2433.1G59268646l49121k2583j30539J12229J87378N5389j03607o07529o14624n56488
2442.8G57239151m46625n05829l68728j98975o5994J58539J65100P2937o6223O5231
2452.4G56048584o21033p16324l77121r27429o65893j23291m2801k85416R1248M04815
$$ plain form
2384.9 768183136 768392105 768409348 768111877 767893372 767995605 768058395 767576141 767375031 766940994 766654968
2394.6 766654968 766533737 766315994 766517105 766504593 766554489 766845169 767021713 766421432 765786896 765631180
2404.2 765631180 765344086 765038986 764694748 764590378 764255600 764281693 764497681 764282379 764220886 764099045
2413.8 764099045 764268951 764070511 763593750 763123245 762690964 762458801 762084885 762205582 762010880 761791153
2423.5 761791153 761762390 761592712 761770706 761544647 761293945 761027603 760230713 759405899 759298325 759268646
2433.1 759268646 758919525 758896942 758766403 758878632 759066010 759121399 759017792 758410263 757795639 757239151
2442.8 757239151 756792526 756286697 755917969 755718994 755653000 755811539 755976639 756049576 755983353 756048584
2452.4 756048584 755427551 754711227 754334106 753406677 752740784 752617493 752574692 752289276 752380524 752785339
2462.1G52785339K34146K39792j11007n32837r22547l22876l4561n19409o22330n12848
2471.7G49680862j22833k05231R9564L48435L76815L22647k01110m13437q43659r16824
2481.3G48125229p82623m27399j33743j93940R4681L28217K25219l12652r1095q9493
2491G46742401j449K49557o44379n08499l65600n48706k12021o1264o8131J3962K79007
2501.6G44874878J64413j6555n75943o49796m07104k52686n7983m59900n9052J12076
2511.2G42672348P8278R3155l5325L37525r3079o70242o71463J3046O1340l35922j99966
2521.9G41249695k00424J8921l05024o8359R2163o12946m81185n1728q39m39300o61850
2532.5G38539124o91300k99301J90582L65906K59628l27301k53448k65122j16729k22397
$$ plain form
2462.1 752785339 753019485 753259277 753148270 752615433 751692886 751370010 751335449 750816040 750193710 749680862
2471.7 749680862 749558029 749352798 749452362 749800797 750177612 750500259 750299149 749885712 749042053 748125229
2481.3 748125229 747342606 746915207 746781464 746587524 746682205 747010422 747235641 746922989 746831894 746742401
2491 746742401 746740952 746990509 746346130 745837631 745472031 744923325 744711304 744650040 744581909 744595871 744874878
2501.6 744874878 745039291 745022736 744446793 743796997 743389893 743137207 743079224 742619324 742560272 742672348
2511.2 742672348 742750626 742843781 742808456 743145981 743052902 742382660 741711197 741724243 741785583 741449661 741249695
2521.9 741249695 741049271 741068192 740763168 740694809 740786972 740174026 739692841 739641113 739640274 739200974 738539124
2532.5 738539124 737847824 737548523 737739105 738105011 738364639 738037338 737783890 737518768 737402039 737179642
2542.1G37179642q17871n44663l05176j71966k29111K4567J51596j7166Q4762m38232
2551.7G34916382n55496k98996k98539k98843l61023n54581m98962k55585j65481J34506
2561.4G31763382J7929M1504O8207l60718n41306n89141m50211m30374l46527k70691
2571G28902054j31226j43356K3041M18014N265m7684j89820n49697o98853p11822l78037
2581.6G26497879m64859j87530l6469k43530k68326j77918K82135L30201j41526l77121
2591.3G25212936l48663m98505m18701p52411o61010R8571m6005k06146j30234M65317
2600.9G22715149J17416l07312L7995n86701m75540o10046o56281k79312k34680j31836
2610.6G19588852m16260q087L3722K8076k23389m79812l42941r65958o98242n04837
$$ plain form
2542.1 737179642 736361771 735817108 735511932 735339966 735110855 735135422 735287018 735269852 735354614 734916382
2551.7 734916382 734360886 734061890 733763351 733464508 733103485 732548904 732049942 731794357 731628876 731763382
2561.4 731763382 731781311 731822815 731891022 731530304 730988998 730399857 729949646 729519272 729172745 728902054
2571 728902054 728770828 728627472 728650513 729068527 729073792 729026108 728836288 728286591 727587738 726875916 726497879
2581.6 726497879 726033020 725845490 725809021 725565491 725297165 725119247 725401382 725731583 725590057 725212936
2591.3 725212936 724864273 724365768 723947067 723194656 722533646 722632217 722586212 722380066 722249832 722715149
2600.9 722715149 722832565 722525253 722563248 721976547 721501007 720890961 720234680 719955368 719720688 719588852
2610.6 719588852 719172592 719164505 719198227 719226303 719002914 718523102 718180161 717214203 716515961 716011124
2620.2G16011124m35410m87594j61515K92588n94483l14789r8648l98865m77294o31409
2629.9G12703705o02341n86853k30102n63431m54712k35748j78833j9074m81033j64948
2639.5G09186630l81393q87680p63626n03083k25296n08728m91027l50800o02646n27267
2649.1G03945084J1367r1247l35541l13187o66656p23648p13654p14035l97949n4855
2658.8F99945679n27039n63278K92053J13602m78897p94754l99857k24228m44031m81185
2668.4F96438065q61283n95169j95389R5368j86539m50134O9122m196l35693o99540
2678.1F93274612m15649l00217q46328q70133n89752j21231K38571K22397m56848n41535
2687.7F89593887m9057j94168p23190p60498j78223o91833p78199j99584k07367j79825
$$ plain form
2620.2 716011124 715575714 715088120 714926605 715219193 714624710 714309921 714211273 713812408 713335114 712703705
2629.9 712703705 712101364 711514511 711284409 710720978 710266266 710030518 709851685 709832611 709351578 709186630
2639.5 709186630 708805237 707917557 707153931 706650848 706425552 705916824 705425797 705074997 704472351 703945084
2649.1 703945084 703956451 703865204 703529663 703216476 702549820 701826172 701112518 700398483 700000534 699945679
2658.8 699945679 699418640 698855362 699147415 699261017 698782120 697987366 697587509 697363281 696919250 696438065
2668.4 696438065 695576782 694981613 694786224 694881592 694695053 694244919 694314041 694309845 693974152 693274612
2678.1 693274612 692858963 692558746 691712418 690842285 690252533 690131302 690369873 690592270 690135422 689593887
2687.7 689593887 689544830 689350662 688627472 687866974 687688751 686996918 686218719 686019135 685811768 685631943
2697.4F85631943l66211j04675q2779m32358l98407k23694l42255n86776o64368p74231
2707F81656189l90472l53241l29438k78473l25470j23291n14679m95376m36096m12445
2716.6F77997208l87192m20914l15246l74222O4392k69623m88510r8877m7226k02408
2726.3F75457382n82428n32226o96869m75464k76108k81525j8997l25393o14396n82504
2735.9F71071472J4191j20011l71704j39999n51987m82177j85776p1182l34855m12674
2745.6F68415298j97906k35062j04446q6060r4223p2479j4877o28052q44727n52673
2755.2F65584793n77316l9902j04980j81275j98593j07956K36435m82330o83136j95008
2764.9F63250732p4157l57285p18307o84586L7003l357n62058O3248l2501k47040n26123
$$ plain form
2697.4 685631943 685265732 685161057 685078278 684645920 684247513 684023819 683681564 683094788 682430420 681656189
2707 681656189 681265717 680912476 680583038 680304565 679979095 679855804 679341125 678845749 678409653 677997208
2716.6 677997208 677610016 677189102 676873856 676499634 676564026 676294403 675805893 675707016 675659790 675457382
2726.3 675457382 674874954 674342728 673645859 673170395 672894287 672612762 672593765 672268372 671653976 671071472
2735.9 671071472 671085663 670965652 670593948 670453949 669901962 669419785 669234009 669162827 668827972 668415298
2745.6 668415298 668217392 667982330 667877884 667791824 667697601 667625122 667610245 666982193 666137466 665584793
2755.2 665584793 665007477 664967575 664862595 664681320 664482727 664374771 664611206 664128876 663445740 663250732
2764.9 663250732 663176575 662819290 662100983 661416397 661453400 661450043 660887985 660951233 660918732 660671692 660145569
2775.5F60145569p81098j95922m84925n48172m73709m33121m57611o89926l00064k03476
2785.1F55577545l02582j94473m1428n80520r49478p53327o21414m43344n73959m99802
2794.8F50617218q01544l56674L45535m22287j182404j250610o31714p78274r88923
2803.4F44550323n77545m58374o12945r13925n16282n41763p10296p08886p53059n71480
2813.1F38185768q62923r41886j204758j243172q15887q08373j121139q84056l03536
2821.8F30000038o61163q56171r93156q32444q31832j558266j143913j031075j297569
2830.4F20794449j130028r44061o54946j175079j489563j036491j129113j235160j227951
2839.1F10772057j821404j905022j890640j987381j747780j670875j589012k080384
$$ plain form
2775.5 660145569 659364471 659168549 658683624 658135452 657661743 657228622 656771011 656081085 655781021 655577545
2785.1 655577545 655274963 655080490 655039062 654458542 653509064 652755737 652134323 651690979 651117020 650617218
2794.8 650617218 649815674 649459000 649804535 649382248 648199844 646949234 646317520 645539246 644550323
2803.4 644550323 643972778 643514404 642901459 641987534 641471252 640929489 640219193 639510307 638757248 638185768
2813.1 638185768 637322845 636380959 635176201 633933029 633117142 632308769 631187630 630303574 630000038
2821.8 630000038 629338875 628482704 627489548 626657104 625825272 624267006 623123093 622092018 620794449
2830.4 620794449 619664421 618720360 618065414 616890335 615400772 614364281 613235168 612000008 610772057
2839.1 610772057 608950653 607045631 605154991 603167610 601419830 599748955 598159943 596079559
2846.8E96079559k055664j801491k101020j843644j528930j198845r76486r41429j111527
2855.5E82520523p75337l46871l59878j32790o99157r23310q82110j240273j732330
2864.2E75428467j864281j139946j443901j709175j865807j884613j229973j401786
2871.9E62888985j626320k063294k176857j893882k001419j999894j615181j294441
2879.6E48217697j633568j605072j298027p92961p90138j136513q22716q87756p99866
2888.3E38451080p40204m27513j09558l74260n61676o22673K9297j18217o31523n61181
2897.9E34333572l92875k02408o83098q56895m82712k76642q12111o70052l36456j197357
2907.6E28422966j338043r67331q28667j696930j842880j188583j842003k094269k175903
$$ plain form
2846.8 596079559 594023895 592222404 590121384 588277740 586748810 585549965 584573479 583632050 582520523
2855.5 582520523 581745186 581398315 581038437 580905647 580206490 579283180 578401070 577160797 575428467
2864.2 575428467 573564186 572424240 570980339 569271164 567405357 565520744 564290771 562888985
2871.9 562888985 561262665 559199371 557022514 555128632 553127213 551127319 549512138 548217697
2879.6 548217697 546584129 544979057 543681030 542888069 542097931 540961418 540138702 539250946 538451080
2888.3 538451080 537710876 537283363 537173805 536799545 536237869 535615196 535644493 535526276 534894753 534333572
2897.9 534333572 533940697 533738289 533055191 532198296 531715584 531438942 530626831 529956779 529620323 528422966
2907.6 528422966 527084923 526117592 525288925 523591995 521749115 520560532 518718529 516624260 514448357
2916.3E14448357j820565j434784j454734j185379j335946j044654q98629j138076
2924E04135590j250115r42116n17997l75786l62320m54750N7564R1705O54564J483726
2933.6E02520065J234284J417083J431351J389733J587524J709709J703644J976471
2941.3E14969864K498932K377739K053604K256317K962189K471122J812859K315140
2949.1E33717766K583618K155800J521721J888771K389488K312851K025566J881256
2956.8E50476837J993332K231598K652435K542534K067032J419830J624871J569938
2964.5E66578407Q77457J554527K006912J600914J325837J579437J556625J523171
2972.2E78603287J978492J929207J295014Q42628J569863J428375J109505J473045
$$ plain form
2916.3 514448357 512627792 511193008 509738274 508552895 507216949 506172295 505273666 504135590
2924 504135590 502885475 501943359 501425362 501049576 500687256 500232506 500290070 500381775 501036339 502520065
2933.6 502520065 503754349 505171432 506602783 507992516 509580040 511289749 512993393 514969864
2941.3 514969864 517468796 519846535 521900139 524156456 527118645 529589767 531402626 533717766
2949.1 533717766 536301384 538457184 539978905 541867676 544257164 546570015 548595581 550476837
2956.8 550476837 552470169 554701767 557354202 559896736 561963768 563383598 565008469 566578407
2964.5 566578407 567455864 569010391 571017303 572618217 573944054 575523491 577080116 578603287
2972.2 578603287 580581779 582510986 583806000 584648628 586218491 587646866 588756371 590229416
2979.9E90229416J040611R47991J062240J503296J302223J035614J426201J373520
2987.6E99921112Q27293P3929N06974K86750J86234O31027M07257Q15163M69551L34625
2997.3F04459915L31116J83334R5558m52766l8147L04909K44903k16446m34608k88162
3006.9F04189606m86031k8114Q6860n21125n27497l01170p45659m43458m69780j136208
3016.6E99617424n93338o15234n67818l66020o72760p82318j054650q42094m86527
3025.2E93636665p11517j173401q61359r09080j141548m33617n33752p59468r93576
3033.9E86119347j407280j111832p73659q97445j350823j199341q96339j106491j054764
3042.6E76321373p28912r01413r10302j015853j522408q81309m81339r31282j312103
$$ plain form
2979.9 590229416 591270027 592218018 593280258 594783554 596085777 597121391 598547592 599921112
2987.6 599921112 600748405 600822334 601329308 601616058 601802292 602433319 602840576 603655739 604125290 604459915
2997.3 604459915 604791031 604974365 605069923 604617157 604579010 604883919 605128822 604912376 604477768 604189606
3006.9 604189606 603703575 603675461 603762321 603241196 602713699 602412529 601666870 601223412 600753632 599617424
3016.6 599617424 599024086 598408852 597841034 597475014 596802254 596019936 594965286 594123192 593636665
3025.2 593636665 592925148 591751747 590890388 589981308 588839760 588406143 587872391 587112923 586119347
3033.9 586119347 584712067 583600235 582826576 581929131 580578308 579378967 578482628 577376137 576321373
3042.6 576321373 575592461 574691048 573780746 572764893 571242485 570361176 569879837 568948555 567636452
3051.3E67636452j530724j162262j058235j182899j274529j404724r01337l19328o79398
3060E58123016j321792j610832j389428j190376j339416q58307j174431j340599q05664
3068.6E47092171r70536p14225q94547r31358r43566j283302j021843j254692j458816
3077.3E37619286j447907j216659r29680r28688j180344j276855j021309j016693p71027
3086E27830124r83734j056137j151886j502800j335945j260872r94416j392860r21021
3094.7E17230453m63485j042519p53097j040268j193161j165886j259880j618309j617356
3103.4E07076492j072464j177063n08918p28875j285629j092186j068191j088753j193314
3112D97861099p73887j206055j211052j407700j619491p42455j333999j691513j267357
$$ plain form
3051.3 567636452 566105728 564943466 563885231 562702332 561427803 560023079 559121742 558802414 558123016
3060 558123016 556801224 555190392 553800964 552610588 551271172 550412865 549238434 547897835 547092171
3068.6 547092171 546121635 545407410 544512863 543581505 542637939 541354637 540332794 539078102 537619286
3077.3 537619286 536171379 534954720 534025040 533096352 531916008 530639153 529617844 528601151 527830124
3086 527830124 526846390 525790253 524638367 523135567 521799622 520538750 519544334 518151474 517230453
3094.7 517230453 516766968 515724449 514971352 513931084 512737923 511572037 510312157 508693848 507076492
3103.4 507076492 506004028 504826965 504318047 503589172 502303543 501211357 500143166 499054413 497861099
3112 497861099 497087212 495881157 494670105 493262405 491642914 490900459 489566460 487874947 486607590
3120.7D86607590m39759n79757j281853q41789j100159j217728j401710j205101j006775
3129.4D77532959j132545r30634j315498j175080j120796q51631p95364j289940j394043
3138.1D67527428j498032j024132j320343j323051n44663o79283j067619j406212j279602
3146.8D57384491j006241r88769j110955j474037j654854q79936n41916j132393j063652
3155.4D47531738q99543p81746r30672j046448j235275j417885p12051q06504j562423
3164.1D38139191j676827q89129q82874j424179q43773n15366l72734q09860j337089
3172.8D29387360j166802r89456j018944j023292p91931j423264j542206j024208m39644
3181.5D19967613l48549j251030j182365j180000j074181o90880q40187j278496j384086
$$ plain form
3120.7 486607590 486167831 485588074 484306221 483464432 482364273 481146545 479744835 478539734 477532959
3129.4 477532959 476400414 475469780 474154282 472979202 471858406 471006775 470211411 468921471 467527428
3138.1 467527428 466029396 465005264 463684921 462361870 461817207 461137924 460070305 458664093 457384491
3146.8 457384491 456378250 455389481 454278526 452804489 451149635 450269699 449727783 448595390 447531738
3155.4 447531738 446632195 445850449 444919777 443873329 442638054 441220169 440508118 439701614 438139191
3164.1 438139191 436462364 435573235 434690361 433266182 432422409 431907043 431534309 430724449 429387360
3172.8 429387360 428220558 427231102 426212158 425188866 424396935 422973671 421431465 420407257 419967613
3181.5 419967613 419619064 418368034 417185669 416005669 414931488 414240608 413400421 412121925 410737839
3190.1D10737839m69094p81593j300926p73354m03442m96254j076393j335640j063919
3198.8D03037224o10581p22694p30286j053199j258851o94656q76655q30117p20291
3207.5C95539894n32837p90977j244698o53839o06499o37703r05990j193619j082191
3216.2C87891541q07953m75922q85811r55047p05262n82504p26051o98815o08101o34918
3225.8C80811157l87153r49059j101990q92715j074104p79572k88353o24695j243477
3234.5C73470039m21829k53601r29832r15718p26777l71856m45633p90825q60710o13823
3244.2C67139435p75261p50160j83678m09775j099472j099663o08940o53038m90074
3252.8C61069374o63605q24470k60430m29763q27523j074524l11813N646m86031m37431
$$ plain form
3190.1 410737839 410268745 409487152 408186226 407412872 407009430 406513176 405436783 404101143 403037224
3198.8 403037224 402426643 401703949 400973663 399920464 398661613 397966957 397090302 396260185 395539894
3207.5 395539894 395007057 394216080 392971382 392317543 391711044 391073341 390167351 388973732 387891541
3216.2 387891541 387083588 386607666 385721855 384766808 384061546 383479042 382752991 382054176 381446075 380811157
3225.8 380811157 380424004 379474945 378372955 377480240 376406136 375626564 375338211 374713516 373470039
3234.5 373470039 373048210 372794609 371864777 370949059 370222282 369850426 369404793 368613968 367753258 367139435
3244.2 367139435 366364174 365614014 365430336 365020561 363921089 362821426 362212486 361559448 361069374
3252.8 361069374 360405769 359581299 359320869 358891106 358063583 356989059 356677246 356682892 356196861 355759430
3262.5C55759430r28383j021385j181641p92732J35345j10855l16429o11305r27277
3271.2C50004768n62324m00543q56247o05736l79410p50770l58239K8992k72980q03413
3280.8C45044098q46367q26645k52266J84174l23029m27398p15142m37050n42717j002273
3290.4C39855385m79202l30315j74942k69127l50037l49578n05600p07627n48744k80991
3300.1C35859222p65266l49159p5836l36686r07898j240272k67296j83296o36253q03719
3309.7C30293541J06010M80652n40504p62482q19740o18019n56526k50969l30277r01718
3319.4C26099968n85403l66211l02430p28531n54962o33888j271171j003457m57344
3328.1C20196571L3379n60894n82409l96614m28333j67160l78800N1556m25053q30631
$$ plain form
3262.5 355759430 354831047 353809662 352628021 351835289 351970634 351859779 351543350 350932045 350004768
3271.2 350004768 349442444 349041901 348185654 347579918 347200508 346449738 346091499 346120491 345847511 345044098
3280.8 345044098 344197731 343371086 343118820 343302994 342979965 342552567 341837425 341400375 340857658 339855385
3290.4 339855385 339376183 339045868 338870926 338601799 338251762 337902184 337396584 336688957 336140213 335859222
3300.1 335859222 335093956 334744797 334668961 334332275 333424377 332184105 331916809 331733513 331097260 330293541
3309.7 330293541 330399551 330880203 330339699 329577217 328757477 328139458 327582932 327331963 327001686 326099968
3319.4 326099968 325514565 325148354 324845924 324117393 323562431 322928543 321657372 320653915 320196571
3328.1 320196571 320229950 319669056 319086647 318690033 318261700 318094540 317715740 317767296 317342243 316511612
3337.7C16511612n99556p48844p14932p77549k57283k90203m64382n16491p75165n22900
3347.3C10844307o52046p14855n60894l71151l63083o18592j97162J8120q56514r20239
3357C05607891k63691l82233p29923r79404m64821j40953k28958l83702r79251j073781
3366.6B99981174q28304J10417j98460j015797m23069j70269o4182o48460q86479k65980
3376.3B95590591J71891j51081q44193o66847k32678N15118j10969n41955l98845r83200
3385.9B92347832j21498j56289l23486r4356l51735m17900j035881p67574p5951M85020
3395.6B89488182L17040m15879m57859J660J05972q09078l35846P44037N71289k34069
3405.2B88975449n67742k50644l89748k03438N9891M7912l35216j91498N97286K7237
$$ plain form
3337.7 316511612 315912056 315163212 314448280 313670731 313413448 313123245 312658863 312142372 311367207 310844307
3347.3 310844307 310192261 309477406 308916512 308545361 308182278 307563686 307366524 307384644 306528130 305607891
3357 305607891 305344200 304961967 304232044 303252640 302787819 302646866 302417908 302034206 301054955 299981174
3366.6 299981174 299152870 299263287 299064827 298049030 297625961 297455692 297391510 296743050 295856571 295590591
3376.3 295590591 295762482 295611401 294767208 294100361 293867683 294382801 294271832 293729877 293331032 292347832
3385.9 292347832 292226334 292070045 291746559 291652203 291300468 290882568 289846687 289079113 289003162 289488182
3395.6 289488182 289805222 289389343 288931484 288933144 289039116 288230038 287894192 288638229 289209518 288975449
3405.2 288975449 288407707 288157063 287767315 287563877 287623768 287671680 287336464 287144966 287742252 287769489
3414.8B87769489m53720J72043L88699l26348k06966L44505L0518q4191K0619P7572
3424.5B87732220j26496J14994q3809m61769L44715M97265p3299L5076N38578K14882
3434.1B88732357J80798K39372j86463R4624M83360P72591O26831O58493N16186K64759
3443.8B92382908L72906O14376Q77113o23684j10111O84299J21575P02877N50709N70869
3453.4B96143837O63242N58815N61638M30508M61826K98004N91317O34002P15752N76553
3463.1C01635494M28086M17232O44875R58576M44565N48248J95866Q07418J236210
3471.7C07316570M16451N78079K59495O82163M98199K53773Q40435J041699J307316
3480.4C13194180P35645P82280O09093R75723J189708N48287Q63266P28607P70321
$$ plain form
3414.8 287769489 287315769 287487812 287876511 287550163 287343197 287687702 287718220 287634029 287654648 287732220
3424.5 287732220 287605724 287720718 287636909 287175140 287519855 288017120 287943821 287978897 288517475 288732357
3434.1 288732357 288913155 289152527 288966064 289060688 289544048 290316639 290943470 291601963 292118149 292382908
3443.8 292382908 292755814 293370190 294247303 293623619 293513508 294197807 294319382 295022259 295572968 296143837
3453.4 296143837 296807079 297365894 297927532 298358040 298819866 299117870 299709187 300343189 301058941 301635494
3463.1 301635494 302063580 302480812 303125687 304084263 304528828 305077076 305272942 306080360 307316570
3471.7 307316570 307733021 308311100 308570595 309252758 309750957 310004730 310845165 311886864 313194180
3480.4 313194180 313929825 314712105 315321198 316296921 317486629 318034916 318898182 319626789 320397110
3489.1C20397110O63261P82547M96636L67012J240997J053085Q25806M01230Q10127
3497.8C27037811J430130J426697J298409N64804K41089J92680J163177J861000J308098
3506.5C36523895M39759J026878J131058O6833J277657J058693Q04710Q56361Q75245
3515.1C44061089J778869R27315P67212Q10547O05659J000824J577339J465187L7384
3523.8C53031425O79665J419525J507340J346168J133270P60651J356659J738129N51605
3532.5C63524437J099930N91774P16743J350861Q34312J587677J243096J668853J590119
3541.2C74207802J111946P72896O67343Q48160M98161K213631J521911J817742J708870
3549.9C85368462J477584K267037j22795J326561J721191J970406K200012P15256K043037
$$ plain form
3489.1 320397110 321060371 321842918 322339554 322706566 323947563 325000648 325826454 326227684 327037811
3497.8 327037811 328467941 329894638 331193047 331757851 331998940 332191620 333354797 335215797 336523895
3506.5 336523895 336963654 337990532 339121590 339188423 340466080 341524773 342329483 343185844 344061089
3515.1 344061089 345839958 346767273 347534485 348345032 348950691 349951515 351528854 352994041 353031425
3523.8 353031425 353711090 355130615 356637955 357984123 359117393 359878044 361234703 362972832 363524437
3532.5 363524437 364624367 365216141 365932884 367283745 368118057 369705734 370948830 372617683 374207802
3541.2 374207802 375319748 376092644 376759987 377608147 378106308 380319939 381841850 383659592 385368462
3549.9 385368462 386846046 389113083 388990288 390316849 392038040 394008446 396208458 396923714 398966751
3558.5C98966751J647263J089782J059037K618789K169037Q26264L415031M73137M45862
3567.2D12710953J466331Q82111L682785K513885J976395K112427K464752J814575
3574.9D29624214J478081K016945J078377K501983K324562J681748K576370K869148
3582.6D46151428J839562J301002M452782L160057l8338J130982o32325K968941M157906
3591.3D64491997L536262J461029J243706L735123J93100K466888L687706R05914K891350
3600D84613075J837769J650810K726898K322464K460709L324509L836975P9383K398262
3608.7E05250854K78969Q56171P269516J036949n44510M286576l26844M490128M670982
3617.4E27268791M42238J941795k79235J953735M350243K822570J843491K660904K523537
$$ plain form
3558.5 398966751 400614014 401703796 402762833 405381622 407550659 408376923 411791954 412265091 412710953
3567.2 412710953 414177284 415059395 418742180 421256065 423232460 425344887 427809639 429624214
3574.9 429624214 431102295 433119240 434197617 436699600 439024162 440705910 443282280 446151428
3582.6 446151428 447990990 449291992 453744774 456904831 456866493 457997475 457365150 460334091 464491997
3591.3 464491997 468028259 469489288 470732994 474468117 474661217 477128105 480815811 481721725 484613075
3600 484613075 486450844 488101654 490828552 493151016 495611725 498936234 502773209 502852592 505250854
3608.7 505250854 505529823 506385994 513655510 514692459 514147949 518434525 518107681 522597809 527268791
3617.4 527268791 527711029 529652824 529373589 531327324 535677567 538500137 540343628 543004532 545528069
3626E45528069K939910O299859j570321r495048N994797O272926N312691J023903j087418
3634.7E61219368K322083K799034K300224N99632J844826K751083K324295J266938
3642.4E77427483N71518K449340L470078N316467p26127k797280N496025k010841k464447
3651.1E86732216J866417N939941M784508L505707L543854o873894K209320M843826
3658.8F06551895J420708J870384P31278K141914J208649R62028J079826O61812M321900
3667.5F20950394K278251j235161r85450l790741M215355P043686O512489j549225
3675.2F33439598j3019562K990074O115418L989830j207848Q31414L160782J598625
3682.9F37898331R02900J11084Q2131L583069N181884p729644j541062P888947m449616
$$ plain form
3626 545528069 548467979 554767838 553197517 543702469 549697266 555970192 561282883 562306786 561219368
3634.7 561219368 563541451 566340485 568640709 569240341 571085167 573836250 576160545 577427483
3642.4 577427483 577999001 580448341 583918419 589234886 588508759 585711479 591207504 589196663 586732216
3651.1 586732216 588598633 594538574 599323082 602828789 606372643 599498749 601708069 606551895
3658.8 606551895 607972603 609842987 610574265 612716179 613924828 614886856 615966682 616628494 620950394
3667.5 620950394 623228645 621993484 621008034 617217293 621432648 628476334 634988823 633439598
3675.2 633439598 620420036 623410110 629525528 633515358 632307510 633138924 636299706 637898331
3682.9 637898331 638801231 638912315 638994446 642577515 647759399 640029755 638488693 646377640 641928024
3691.6F41928024M9362M780274Q14209J784363O53228j21460R56803L53622K559586
3700.3F53758011K405548m722443j416320M358673J212310J56861Q56170K205735L454818
3709F62269363n567169L560028L934861j1304245M200439L413620K40021J588745K736816
3717.7F65072479J656266l217621O11267M639129m134903l622055N252686J513214
3725.4F67770462J0300k306290j08261L662949R29489M423370k070770o247940P147979
3734F73211288M18702p167969p1030J467056P61643L043823L342896k652130L012085
3742.7F75366364J0693740o731186j6069183Q261566N122986M564819l354339q368454
3750.4F69486313R897385n214692n252533N759507M157333L158112m774094J663361
$$ plain form
3691.6 641928024 641977386 646757660 647571869 649356232 650009460 649888000 650844803 651198425 653758011
3700.3 653758011 656163559 651441116 650024796 654383469 655595779 655752640 656608810 658814545 662269363
3709 662269363 656702194 660262222 664197083 652892838 657093277 660506897 660746918 662335663 665072479
3717.7 665072479 666728745 663511124 664122391 668761520 664626617 661004562 666257248 667770462
3725.4 667770462 667780762 665474472 665366211 669029160 669958649 674382019 672311249 666063309 673211288
3734 673211288 673629990 666462021 666390991 667858047 668619690 671663513 675006409 672354279 675366364
3742.7 675366364 686060104 679328918 663259735 671521301 676644287 681209106 677854767 669486313
3750.4 669486313 679383698 674169006 668916473 674675980 678833313 681991425 677217331 678880692
3758.2F78880692M091262p358169J56936M804230J478729j17645K654190j649933l270950
3766.8F79669342L253632M256363o57349p948456K063904L219452M40674N74188l62854
3775.5F84508896Q33664Q57391K602844m72641o658706K266617K461090Q95843J424866
3784.2F88719864k130585n59311J955414J416931K83127p72247j30844N08651N38636
3792.9F89829636m98352R37194K957077l290023l511277K610550L895340N233383n399475
3801.5F92764053j0291061L659668M083099M727631M235382q237610l214645M609222
3809.3F92335739K004852L67966R09348o37665J00860N184632r86633j2692566M207000
3817.9F90793533N261460L898849Q80432j4820480K123413N714874K359619J992875
$$ plain form
3758.2 678880692 682971954 675613785 675770721 680574951 682053680 681936035 684590225 682940292 679669342
3766.8 679669342 682922974 687179337 686521988 678573532 680637436 683856888 684297562 684871750 684508896
3775.5 684508896 685342560 686199951 688802795 688330154 681671448 683938065 686399155 687294998 688719864
3784.2 688719864 686589279 686029968 687985382 689402313 689685440 688913193 688782349 689291000 689829636
3792.9 689829636 689331284 690268478 693225555 689935532 686424255 689034805 692930145 698163528 692764053
3801.5 692764053 682472992 686132660 690215759 694943390 699178772 690941162 687726517 692335739
3809.3 692335739 694340591 694708557 695617905 694980240 695081100 700265732 699279099 686586533 690793533
3817.9 690793533 696054993 699953842 700834274 686013794 688137207 693852081 696211700 698204575
3825.7F98204575j11771l708878O00129K339477K688751J445237o608506J689225N155105
3834.3G01693344n324020M7989P175674p252121l971252O884765m212341K43607P040100
3843G02325745j117859m176712J389389J051941J6250J522370M82101K824707M177704
3851.7G08495636p490387o76117j0113754K275467Q031540j066590o38275K217636
3859.4G01035156K123337J811829m937897O42395O140823n264435m720764L897553
3867.1G00727997M641876N061569p831650q169708M814072O442947K759857r753723
3874.8F98693237R77402M447632M28467J945877L660278n973206p141799N571441J206589
3883.5G03815918R76181M650726j0577926N44052L922272K178649N167084o66656q514786
$$ plain form
3825.7 698204575 698092804 694383926 694984055 697323532 700012283 701457520 694849014 696538239 701693344
3834.3 701693344 696369324 696417313 703592987 696340866 692369614 699254379 695042038 695285645 702325745
3843 702325745 701207886 697031174 698420563 699472504 699488754 701011124 701493225 704317932 708495636
3851.7 708495636 701005249 700329132 690215378 692490845 700522385 699455795 698817520 701035156
3859.4 701035156 703158493 704970322 700032425 700674820 706815643 701551208 696830444 700727997
3867.1 700727997 705369873 710431442 702599792 694430084 699244156 705687103 708446960 698693237
3874.8 698693237 699670639 704118271 704546738 706492615 710152893 704179687 697037888 702609329 703815918
3883.5 703815918 704792099 709442825 698864899 699408951 703331223 705509872 710676956 710010300 701495514
3892.2G01495514J005554K998886j764831P64312J512986K211761J199036q652878
3899.9G00770340M658508K587662m421310L877868l321457j239242J232452M91104
3907.6G04635925J526261L3950L57438L13339Q51593p7744p51342J175766J700973
3916.3G09766159k335434k915802L422241L97950l666840J054230J381988J015320
3924G08119812j478729j569290J920776J310348M15192j333771m01992J595916j939239
3932.7G06639023j405411J313934Q27790P56302M71344k90757j99279j12229J449051
3941.4G09449768P48367l832168J30462K235795R92431Q25348k394180m93469P0724
3950.1G07733078j133194J709671N24063Q2245K88544j52512R2468j78909O07224j40229
$$ plain form
3892.2 701495514 702501068 705499954 703735123 704499435 706012421 708224182 709423218 700770340
3899.9 700770340 705428848 708016510 703595200 707473068 704151611 702912369 704144821 704635925
3907.6 704635925 706162186 706196136 706553574 706866913 707718506 707640762 706889420 708065186 709766159
3916.3 709766159 707430725 704514923 707937164 708335114 704668274 705722504 707104492 708119812
3924 708119812 706641083 705071793 706992569 708302917 708718109 707384338 706982346 708578262 706639023
3932.7 706639023 705233612 706547546 707375336 708131638 708602982 708312225 708112946 708000717 709449768
3941.4 709449768 710198135 706365967 706496429 708732224 709724655 710550003 708155823 707662354 707733078
3950.1 707733078 706599884 708309555 708833618 708915863 709204407 709051895 709144363 708965454 709572678 709432449
3959.7G09432449L41416K65884j372986j56326M26559O16990Q17489K81830o79855
3968.4G09973450j278839j374J480484M98963j165009k97165O68488O29196K79236
3977.1G10787430K83279n569l91159K95562j85089j135482o35605O64367N80216M92325
3986.7G10750275O69174n83725p9727k75116o04553O27288K01493k30484n27115K19650
3996.3G10167160P29065N8441J68381J02386
4000.2G11225433
$$ plain form
3959.7 709432449 709773865 710039749 708666763 708510437 708936996 709553986 710371475 710653305 709973450
3968.4 709973450 708694611 708693237 710173721 710672684 709507675 709210510 709878998 710508194 710787430
3977.1 710787430 711070709 711065140 710673981 710969543 710784454 709648972 709013367 709677734 710257950 710750275
3986.7 710750275 711419449 710835724 710755997 710480881 709876328 710503616 710705109 710474625 709947510 710167160
3996.3 710167160 710896225 710954666 711123047 711225433
4000.2 711225433
##END=$$ End of the data block
