##TITLE=$$ Begin of the data block
##JCAMP-DX=5.00 $$ ACD/SpecManager v 10.08
##SPECTROMETER/DATA SYSTEM=Varian
##DATE=20 Nov 2012 10:35:12
##DATA TYPE=INFRARED SPECTRUM
##DATA CLASS=XYDATA
##ORIGIN=
##OWNER=
##NPOINTS=3735
##FIRSTX=399.26403809
##LASTX=4000.35498047
##MAXX=4000.35498047
##MINX=399.26403809
##MAXY=78.32325745
##MINY=28.60003853
##XFACTOR=1.0000000000
##YFACTOR=0.000000100000000
##FIRSTY=56.76673889
##DELTAX=0.96440572
##XUNITS=1/CM
##YUNITS=TRANSMITTANCE
##XYDATA=(X++(Y..Y))
399.3E67667389M61349k539100r38835Q685836J2203904m234620p318725m578819l544426
407.9E65863953K646370q266221q091278L548813K682953j063270k615662O866722
415.7E61572380O798935n178871q664971j0466194k62870P896652Q464927L866616
423.4E64026604j893311n134353n049439L866005M797516P01713k115478n043373l366204
432.1E50789680n57022J86158q25234L46871J241569j804314j997566j739425R85527
440.7E46626244Q453102Q769340m105110j0099373k639198Q04825k051392L64456N396042
449.4E51518936Q584709L503266p47261N397834j498069l065262J496734n267944p954903
458.1E51968040m147262K27661L739357M245148P643280J125717j012535k384606o220779
$$ plain form
399.3 567667389 568128738 565589638 564650803 573336639 585540543 581305923 573987198 569408379 565863953
407.9 565863953 568510323 560244102 552152824 555701637 558384590 557321320 554705658 561572380
415.7 561572380 568371315 563192444 554527473 544061279 543798409 551695061 560159988 564026604
423.4 564026604 562133293 556998940 551949501 555815506 560613022 561314735 559199257 554155884 550789680
432.1 550789680 550232658 550418816 549593582 549940453 551182022 549377708 547380142 545640717 546626244
440.7 546626244 555079346 563848686 559743576 549644203 547005005 547809830 545758438 546122894 551518936
449.4 551518936 560103645 563606911 562859650 568257484 566759415 563694153 565190887 559922943 551968040
458.1 551968040 547820778 548048439 551787796 556032944 563676224 564801941 563789406 561404800 555184021
466.8E55184021n886383n298538j743813j141167K82364n145378n798683L793335L437386
475.5E37683144O471061K821884n163040m915847j512261r42802l547745k630005k077904
484.1E26186485J262017m49143L86047N711632M165955K853737k816506m157982j125221
492.8E32017021m925575m481659j415901J858444K778244J480293j02501M86412q51020
501.5E26843758l078423j8730l177223l573151r41391l896828m212875n68771J310768
510.2E08687134O57234K288666j82610j709099m09927J81580k931557r571838n871163
518.9D91138420j473999L61023j095200m577K134628j278114n93605K211532P73354
527.5D92173462l509560k744369J061020Q45642l4027k071381L35617K916985L674240
$$ plain form
466.8 555184021 549297638 543999100 542255287 541114120 541396484 536251106 530452423 534245758 537683144
475.5 537683144 544154205 546976089 541813049 536897202 535384941 534442139 530894394 528264389 526186485
484.1 526186485 527448502 526999359 527385406 533097038 537262993 540116730 537300224 533142242 532017021
492.8 532017021 527091446 522609787 521193886 523052330 525830574 527310867 527208366 527694778 526843758
501.5 526843758 523765335 523746605 520569382 516996231 516054840 512158012 507945137 507376366 508687134
510.2 508687134 509344368 511633034 511450424 509741325 509331398 509512978 506581421 497009583 491138420
518.9 491138420 489664421 490025444 488930244 488925667 491060295 489782181 489188576 491400108 492173462
527.5 492173462 488663902 485919533 486980553 487826195 487792168 485720787 486056404 488973389 492647629
536.2D92647629L749122L582383J992988n57136O79664k38456q70362q63762j70860
544.9D99951210K002754J901818L994178K447358j00480k49557r28230k057763m828834
553.6E02132454l317757j112480j524391p46651J23749n33409J26305R09881j715317
562.3D94342384k338524j732139k050247l609848m971657l370476j995621j75094Q8653
570.9D74187431K7504j516189p35436j50223q56590K201462O48079j72463j479148
579.6D72154427p73659K223816K579193M075203L429069M482842L351135K017822M96407
588.3D94036255o8359J380500o78978M51393m48646r08356R33266J231651K457962
597D98386688J385613P29980p91321o56128K13547p18994p18536j278153o07681p52449
$$ plain form
536.2 492647629 496396751 499979134 501972122 501414986 502094650 501856194 500985832 500122070 499951210
544.9 499951210 501953964 503855782 507849960 510297318 510196838 509947281 509019051 506961288 502132454
553.6 502132454 498814697 497702217 496177826 495431175 495554924 495021515 495147820 496057701 494342384
562.3 494342384 492003860 490271721 488221474 484611626 479639969 476269493 474273872 474098778 474187431
570.9 474187431 474214935 472698746 471963310 471813087 470956497 473157959 473806038 473633575 472154427
579.6 472154427 471380768 473604584 476183777 480258980 483688049 488170891 491522026 493539848 494036255
588.3 494036255 493967896 495348396 494669418 495120811 494672165 493763809 494697075 495928726 498386688
597 498386688 499772301 500502281 499710960 499054832 499268379 498549385 497830849 496552696 495945015 495192566
606.6D95192566J058159K531166J770515J904068J085663J93634j099052r76334j436996
615.3E00223389r57146J886559J626777L5248P83577L000641L418007M381904K412529
624E16811485j558876j428299J57967K53525l94936L82042P70340J588249K782326
632.7E19363823L429069K470932K45972Q35686L50342N98945k67791j818429r8571
641.3E25109978l8681J659126J744003J577530L406525K461052J848488J559219M26979
650E39754219k096558k180213J07116k35023l57361J604729L560180K478523J426926
658.7E44062538J299629J210442L43361j061478r55009j393814n40352J813011L931885
667.4E48710213K356949l052826J225319J933479J739273J010704l84331m88243n93529
$$ plain form
606.6 495192566 496250725 498781891 500552406 502456474 503542137 503735771 502636719 501660385 500223389
615.3 500223389 499266243 501152802 502779579 502814827 503598404 506599045 510017052 514398956 516811485
624 516811485 515252609 513824310 513982277 514235802 513840866 514222908 514993248 516581497 519363823
632.7 519363823 522792892 525263824 525509796 526345482 526695824 527294769 527026978 525208549 525109978
641.3 525109978 525071297 526730423 528474426 530051956 533458481 535919533 537768021 539327240 539754219
650 539754219 537657661 535477448 535584564 535349541 534992180 536596909 540157089 542635612 544062538
658.7 544062538 545362167 546572609 546915970 545854492 544899483 543505669 542965317 544778328 548710213
667.4 548710213 551067162 548014336 549239655 551173134 552912407 553923111 553538780 553050537 552457008
676.1E52457008r48715m13017P28187P40891J437187K846794K723503K268563J361236
684.7E63201637m60357j480484j129876j55754k36129j454850r92546n9242M22592
693.4E57654991J485863J071281Q12455K10151j347046k069206k519607j801720j518669
702.1E51978493j456757l55530K50740K36054N62019K086792J991120M16755l05938
710.8E55403748k90108n26200m88548O55213J218490K098541K447205K407341L506088
719.5E66431770L843613L276520K238045J180877P45506O95763J027985O92634J215973
728.1E81348686K795143L246270M026908L855973K314682J102409K19383J55030k66991
736.8E98797493J38741l61329j426963L06511K018775K221680J593552J281624J345024
$$ plain form
676.1 552457008 551508293 551095276 551823463 552564354 554001541 556848335 559571838 561840401 563201637
684.7 563201637 562741280 561260796 560130920 559975166 559739037 558284187 557291641 557232399 557654991
693.4 557654991 559140854 560212135 561024590 561234741 559887695 557818489 555298882 553497162 551978493
702.1 551978493 550521736 550166206 550416946 550653000 551215019 553301811 555292931 555709686 555403748
710.8 555403748 555113640 554587440 554098892 554754105 555972595 558071136 560518341 562925682 566431770
719.5 566431770 570275383 573551903 575789948 576970825 577716331 578412094 579440079 580132713 581348686
728.1 581348686 584143829 587390099 591417007 595272980 597587662 598690071 598909454 599064484 598797493
736.8 598797493 598936234 598574905 597147942 597454453 599473228 601694908 603288460 604570084 605915108
745.5F05915108K63405j080246j601067k597694k890358k158928l031616j889649P57523
754.2E91686478J108703R81064O65436q57430k345390l095703l969536k782402j536407
762.8E79854813k438813j511650j0299O94999J918221J793289J486549K706414K402801
771.5E86896324J31569j53847J82267K9029R93576K657471L463898L532104N223198
780.2F02955589N348053M203949L207398J527977J844330K367668K011909O97594J169853
788.9F25334320J857948K160797M523812M269638L852768L365707J926880P45926o07300
797.6F47430496l23791m81949j205521j203918P39441L418808L400421J602554R68857
806.2F54345398J036987j75705j249466k084198k453231k160035j404190j239547j480790
$$ plain form
745.5 605915108 606178513 605098267 603497200 600899506 598009148 595850220 592818604 590928955 591686478
754.2 591686478 592795181 593776245 594441681 593584251 591238861 588143158 584173622 581391220 579854813
762.8 579854813 577416000 575904350 575894051 576589050 578507271 580300560 581787109 584493523 586896324
771.5 586896324 587027893 586874046 587056313 587085342 588078918 590736389 594200287 597732391 602955589
780.2 602955589 608303642 612507591 615714989 617242966 619087296 621454964 623466873 624164467 625334320
788.9 625334320 627192268 629353065 633876877 638146515 641999283 645364990 647291870 648037796 647430496
797.6 647430496 647106705 646624756 645419235 644215317 644954758 648373566 651773987 653376541 654345398
806.2 654345398 655382385 655206680 653957214 651873016 649419785 647259750 645855560 644616013 643135223
814.9F43135223n4779J918869K058411J553345K023391J27564j745758j427994j488953
823.6F46099319k20413n9128n63049N14755J155548P22733J161499J466904r75800
832.3F49302368k772446l050003j873474j877060l090362j966095n71785P22885Q02078
841F35626106O19889Q82339k23618j012039j468811l308525m181366k190780j982308
849.6F22760887j477012j94474m00963p5836p70874j246910j228943k102165l897057
858.3F11366653l806037j934205k134933j568146M67491K633171L937607L537636L844872
867F16344109N335426N453339L424797K931556K504998J764221K465248K111282K547989
875.7F44882965L563919M370041L778305K788849J411819m07104q14743k535706k677612
$$ plain form
814.9 643135223 643080444 644999313 647057724 648611069 650634460 650762024 649016266 647588272 646099319
823.6 646099319 645878906 645819778 645256729 645771484 646927032 647649765 648811264 650278168 649302368
832.3 649302368 646529922 643479919 641606445 639729385 636639023 634672928 634101143 634824028 635626106
841 635626106 636245995 637128334 636904716 635892677 634423866 631115341 626933975 624743195 622760887
849.6 622760887 621283875 621089401 620688438 620612602 619841728 618594818 617365875 615263710 611366653
858.3 611366653 607560616 605626411 603491478 601923332 602390823 605023994 608961601 612499237 616344109
867 616344109 621679535 627132874 630557671 633489227 635994225 637758446 640223694 642334976 644882965
875.7 644882965 648446884 652816925 656595230 659384079 660795898 660388794 659574051 657038345 654360733
884.4F54360733l280868l126603j406097j543655j269455j406327r72595o92139r37385
893F39725609j996880l072395k843208k618409k693481l681603j963691p45850p72819
901.7F19337273R0026p89680j098366j736030k740441l693771m191971m118805m362945
910.4E96695290l969193l926430l400077k627793k998886m434700m054909k452278
918.1E68831024l027572l672829l650971l220825k392006j299743Q1672J63880J98707
926.8E52011337R61495J394195J180229j91421l26653K74201K35290J89019J70707
935.5E55898399J296044K312546K721862K986985K301826J444206J791191K291031
943.2E73044090J524658L35351m90494j106720k069779k354202k049637j705208j452026
$$ plain form
884.4 654360733 651079865 647953262 646547165 645003510 643734055 642327728 641355133 640662994 639725609
893 639725609 637728729 634656334 631813126 629194717 626501236 622819633 620855942 620110092 619337273
901.7 619337273 619427299 618637619 617539253 615803223 613062782 609369011 605177040 601058235 596695290
910.4 596695290 592726097 588799667 585399590 582771797 579772911 575338211 571283302 568831024
918.1 568831024 565803452 562130623 558479652 555258827 552866821 551567078 551648750 551812630 552011337
926.8 552011337 552972832 554367027 555547256 555355835 555029182 555303383 555538673 555727692 555898399
935.5 555898399 557194443 559506989 562228851 565215836 567517662 568961868 570753059 573044090
943.2 573044090 574568748 574904099 574413605 573306885 571237106 568882904 566833267 565128059 563676033
951.9E63676033k510986m116440n009689n503083o142502p120895p119026o414185
959.6E19739227o358490o702537o434670n196380n794983n833779n995445p211456
967.3D70211487p519226q456650q101502q740348r095002r159736q997612p799683
975D02341728p911072p493095q923187q332482p791175p511635p164574q157654o139641
983.7C32917213n537452m172631n077419m548607k792701k911015j378975k451267
991.4C04047146j677361k518501j578903p31602r58385N97324r59759P86515j67218
1000.1B96839256m20093L08685l11794L42693n11475L99609j033935p27578r69982
1008.8B93915386j455650j394577j979332J31607r40838L9902n93796q44364N6648
$$ plain form
951.9 563676033 561165047 557048607 552038918 546535835 540393333 533272438 526153412 519739227
959.6 519739227 513380737 506678200 500243530 495047150 489252167 483418388 477422943 470211487
967.3 470211487 462692261 454235611 446134109 437393761 428298759 419139023 410141411 402341728
975 402341728 394430656 386937561 378014374 369681892 361890717 354379082 347214508 339056854 332917213
983.7 332917213 327379761 323207130 318129711 313581104 310788403 307877388 306498413 304047146
991.4 304047146 302369785 299851284 298272381 297540779 296582394 297179718 296219959 297006474 296839256
1000.1 296839256 296419163 296727848 296416054 296758747 296247272 296646881 295612946 294885368 293915386
1008.8 293915386 292459736 291065159 289085827 289217434 288276596 288316498 287722702 286878338 286934986
1017.5B86934986n61504J91746n64843J342984L12500J91135P47261J111298J889019
1026.1B91594582L89061K713699J771526R28040N31654J435528J724567n23624J451969
1034.8C02017002O46229P19070J99223K74582O79493J9359K62471j479397L92208m75006
1044.5C03255234l63789m27532p44076J432572K70252N93967J47476K512646K203331
1053.1C08880081K063580K550182J544399L832608K074661L738518K767181K477989
1060.9C29929199M091416L311119N109253L871231M084854K289123K395096Q57697
1068.6C55938988j977120j360626l895149l630142n325241l777466k382431k667809
1076.3C30923004o27556j250801N29709l19519J509018J172333J153908K705879J573028
$$ plain form
1017.5 286934986 286373482 286565228 286000385 287343369 287655869 287847004 288594265 289705563 291594582
1026.1 291594582 291983643 294697342 296468868 297396908 297928562 299364090 301088657 300565033 302017002
1034.8 302017002 302663231 303382301 303581524 303856106 304535599 304554958 304817429 303338032 303730240 303255234
1044.5 303255234 302891445 302463913 301719837 303152409 303422661 304016628 304164104 306676750 308880081
1053.1 308880081 310943661 313493843 315038242 318870850 320945511 324684029 327451210 329929199
1060.9 329929199 334020615 337331734 342440987 346312218 350397072 352686195 355081291 355938988
1068.6 355938988 353961868 352601242 348706093 345075951 339750710 335973244 333590813 330923004
1076.3 330923004 330295448 329044647 329574356 329254837 330763855 331936188 333090096 335795975 337369003
1085C37369003L703575K833977M561768L392067K315864L308335K851410M195709K634201
1093.6C67165909L119392J427307Q08106J058769O30913J684570O08635R18083o41823
1102.3C76779861N9433K37542R3193N63698q4305J763000R51920K338257K718162K532501
1112C87953262K240181J976204L819199K686691K732239J369400J812134J511192l3646
1120.6D06066856Q21610L36838J685409J339989J932411J904068J969719K265358Q57887
1129.3D19180145K125778J377068J509247R58214Q39729J621246N84679j90125j201820
1138D26804161J33247j048545j850968k847595l537178j976852l413277k446747k688675
1146.7D07127571k276230j973228k047272r76105j588325K95753r03167o52085k9793
$$ plain form
1085 337369003 341072578 343906555 348468323 351860390 354176254 357484589 360335999 364531708 367165909
1093.6 367165909 370285301 371712608 372520714 373579483 374210396 375894966 376503601 377421684 376779861
1102.3 376779861 376839294 377076836 377170029 377733727 377649422 379412422 380364342 382702599 385420761 387953262
1112 387953262 390193443 392169647 395988846 398675537 401407776 402777176 404589310 406100502 406066856
1120.6 406066856 406888466 407225304 408910713 410250702 412183113 414087181 416056900 418322258 419180145
1129.3 419180145 421305923 422682991 424192238 425150452 425990181 427611427 428196106 428005981 426804161
1138 426804161 426937408 425888863 424037895 421190300 417653122 415676270 412262993 409816246 407127571
1146.7 407127571 404851341 402878113 400830841 399854736 398266411 398562164 397658997 397006912 396977119
1155.4C96977119P5188N48897r8991J729850P92122K084847K623291L385734N057297
1164D13175354M462471N185089M642067O162682O060676N234375N041161N121002O355972
1172.7D61440849N986481O412659O496734O980133O599541O104431N836869M742012
1180.4E10599709M159698L396378L710022L930702M003868L555069L308525L914642
1188.1E40578613L535614K783776K003479J773491J111106M56810J14060m32701j89438
1196.8E51734810J76124O82335Q03490Q33130J060867Q73490P41310J30729m19197
1205.5E56617088k64129L31688K07786j11542P52793J611213K262955K245865J901970
1214.2E65555687J642609J161155P60536l8032k75993L49044k18658p02896j49765
$$ plain form
1155.4 396977119 397052307 397601204 397502213 399232063 400024185 402109032 404732323 408118057 413175354
1164 413175354 417637825 422822914 427464981 433627663 439688339 444922714 449963875 455084877 461440849
1172.7 461440849 467427330 473839989 480336723 487316856 493916397 500020828 505857697 510599709
1180.4 510599709 514759407 518155785 521865807 525796509 529800377 533355446 536663971 540578613
1188.1 540578613 544114227 546898003 548901482 550674973 551786079 552242889 552356949 551924248 551734810
1196.8 551734810 551910934 552593269 553396759 554229889 555290756 556164246 556905556 557036285 556617088
1205.5 556617088 556352959 556684647 556892433 556780891 557533684 559144897 561407852 563653717 565555687
1214.2 565555687 567198296 568359451 569119987 569081955 568805962 569155006 568936348 568233452 568083687
1222.9E68083687N80635O38008k50893k33116k97966r48524j351319k031211k119637
1231.5E62069664j785088j533775j119499m92668K30217N20782N82390N1956m45366
1240.2E58078613o02531j097756j037674j100425p24945j74446j77498Q57506J432418
1248.9E55453262J604462J608658J074943P07322L05213r5405n55954p79038o01997
1257.6E58721466j44768M14467N15328P58934J105308J241951J304436J115913O41327
1266.3E65674362P1869k52952m9134J30501M97589P05376J094131J819763J566620
1274.9E71258125J307907J147042P04803K36855m69742j298294j264153q59260q61473
1283.6E69901810L91044P09305L57552J301613J407241R75037O6032n72128n90897
$$ plain form
1222.9 568083687 568664322 569302330 569051437 568818321 568520355 567571831 566220512 564189301 562069664
1231.5 562069664 560284576 558750801 557631302 557138634 557368851 557889633 558472023 558523979 558078613
1240.2 558078613 557476082 556378326 555340652 554240227 553515282 553340836 553163338 554020844 555453262
1248.9 555453262 557057724 558666382 559741325 560448647 560753860 560658455 560102501 559323463 558721466
1257.6 558721466 558576698 558991165 559506493 560265427 561370735 562612686 563917122 565033035 565674362
1266.3 565674362 565746231 565493279 565444145 565574646 566072235 566777611 567871742 569691505 571258125
1274.9 571258125 572566032 573713074 574417877 574654732 574184990 572886696 571622543 570763283 569901810
1283.6 569901810 570292854 571002159 571359711 572661324 574068565 575043602 575109634 574537506 573946609
1292.3E73946609j006431j564102j532135j036110q73909m00849K61879L13225l22609
1301E67785568n40237n35431j582069j731492q01086j237755k211456j618920r91897
1309.7E56535225n25551m5738k82898j51672l24097q09670j023445j106071j072960
1318.3E51193123j708946j365128o20918n04227O9656j2359n52521r05037j448097
1327E44145546j942253k181626k345848k970695k887344k029152j510582n99861q80852
1335.7E26797333j129341k82288n3368o24122j60408M65622n42870p23800l25280K37351
1345.3E23658829M10042N68847R56230Q02918R05037L62472J08528k36282n66673p71485
1355E26198463j026535q37249j032639n44739O2600P23381O9274r17930K98538M04739
$$ plain form
1292.3 573946609 572940178 571376076 569843941 568807831 567933922 567533073 567794952 568108177 567785568
1301 567785568 567245331 566709900 565127831 563396339 562595253 561357498 559146042 557527122 556535225
1309.7 556535225 556009674 555963936 555681038 555529366 555205269 554395599 553372154 552266083 551193123
1318.3 551193123 549484177 548119049 547498131 546993904 547063560 547051201 546498680 545593643 544145546
1327 544145546 542203293 540021667 537675819 534705124 531817780 529788628 528278046 527678185 526797333
1335.7 526797333 525667992 525385704 525332336 524708214 524547806 525013428 524470558 523746758 523421478 523658829
1345.3 523658829 524068871 524637718 525593948 526396866 527301903 527664375 527772903 527536621 526969948 526198463
1355 526198463 525171928 524334679 523302040 522757301 522819901 523543282 523612556 522694626 522993164 523397903
1364.6E23397903J58997p30934q18939r19495r09424j98211j37978O56166P33147J495018
1374.3E22726250J597824J494484J165123L36609L03154m63219Q4724n53817m07219
1382.9E26283913J170463J197739J909332J420593J638451K425385K248001R25636
1390.7E39219513J11351k22893o22711r77173k188415M91523K92092l59688n112L8452
1400.3E35776939M14391j011658p58629q65402j945495j475525j011544r42916j567193
1409E26612968o14471n40733j63193M311m74511j49803j053924r99718j439552o42395
1418.6E20538979j509743p172J414337J02578O02455O21605J558876J051712L72352
1427.3E24745979P38755p16248J84059P31621R17473n1918K28081J724052O67419K48146
$$ plain form
1364.6 523397903 523556900 522825966 522007027 521087532 520178108 519979897 519841919 520498085 521231232 522726250
1374.3 522726250 524324074 525818558 526983681 527320290 527623444 527160225 527244949 526691132 526283913
1382.9 526283913 527454376 528652115 530561447 531982040 533620491 536045876 538293877 539219513
1390.7 539219513 539330864 539107971 538485260 537508087 535319672 535811195 536103287 535743599 535738487 535776939
1400.3 535776939 536191330 535179672 534421043 533555641 531610146 530134621 529123077 528180161 526612968
1409 526612968 525998497 525457764 525294571 525298882 524824371 524674568 523620644 522620926 521181374 520538979
1418.6 520538979 519029236 519022064 520436401 520538979 521141434 521763039 523321915 524373627 524745979
1427.3 524745979 525484734 524768486 524952545 525684166 526601639 526549721 526777802 528501854 529169273 529417419
1437E29417419J037484K208938P14150M14314L86162l76702L63083n37491L83721k2469
1446.6E33988609J58615r2735J02692P19261o46629n7183j249199j88598j264458j971626
1456.2E29498749j813278k910920M752350J169472K973976J708946J458626K354736
1464E39192657m31747L028641J513519K795639J940155K892723L504448J417198O631623
1472.6E62484856M831962O568718M042855M894638M055519L166771L375206J377868
1480.3E94798393K592926J969452L540230L046074K703590L570366J450348L482971
1488.1F17154350J929283J375733Q64143J885109J794129M62417J504631n83343j047516
1496.7F25338936K675323K584610J899338J755524J505699M9400N62477j40648N39589
$$ plain form
1437 529417419 530454903 532663841 533377991 533792305 534178467 533801765 534164848 533627357 534011078 533988609
1446.6 533988609 534147224 534054489 534157181 534876442 534229813 534172630 532923431 532734833 531470375 529498749
1456.2 529498749 527685471 524774551 529526901 530696373 533670349 535379295 536837921 539192657
1464 539192657 538760910 541789551 543303070 546098709 548038864 550931587 554436035 555853233 562484856
1472.6 562484856 567316818 573885536 577928391 582823029 586878548 590045319 593420525 594798393
1480.3 594798393 597391319 599360771 602901001 605947075 608650665 612221031 613671379 617154350
1488.1 617154350 619083633 620459366 621323509 623208618 625002747 625465164 626969795 626386452 625338936
1496.7 625338936 628014259 630598869 632498207 634253731 635759430 635808830 636371307 636230659 636770248
1505.4F36770248n791854p892571N363503K420005L208351K388878J791535L29971
1513.1F38588066J227379O54068k29492K29034k298088L173485Q92410l300552k72026
1521.8F38664284K309303M726181J760407K94723J040955J571960k34833j97143P77130
1530.5F50712967q76999J85242j600876r89838K811661J923447J669387j91116n387421
1539.2F48256454k973556N398407K29340p87888J869583j080780N85709K573623J796341
1547.9F55867233N73578j031875K81982K048721J230851L7918k201691l73154K608719
1556.5F59042282J966248l759537j903000r62601L756180K587357J103286j66320j708527
1565.2F59955368o37665J60828k28729j158524m275055Q00781J751938L10059j03455
$$ plain form
1505.4 636770248 630978394 623085823 628449326 630869331 634077682 636466560 638258095 638588066
1513.1 638588066 639815445 640469513 640240021 640469055 638170967 641344452 642236862 638936310 638664284
1521.8 638664284 640973587 645699768 647460175 647754898 648795853 650367813 650132980 649935837 650712967
1530.5 650712967 649835968 650021210 648420334 647430496 650242157 652165604 653834991 653643875 648256454
1539.2 648256454 645282898 650681305 650910645 650122757 651992340 650911560 651497269 654070892 655867233
1547.9 655867233 656440811 655408936 655690918 657739639 658970490 659008408 656806717 656433563 659042282
1556.5 659042282 661008530 657248993 655345993 654383392 658139572 660726929 661830215 661663895 659955368
1565.2 659955368 659317703 659478531 659249802 658091278 653816223 654617004 656368942 656679001 656575546
1573.9F56575546M56543q29544n869903N90667J05133j354217j425553j607589j029511
1582.6F45611572j346054o98166p51419j221924j359481j618462j696892k983360k396507
1591.2F31539307k657891k270279k541885k237511j169319k018661p91397j779442
1599F16072922j615448k123299k633972k211876l260002k066498k912865k029876k262078
1607.6E94957008j977386k040939k000466k46277k345543j638145k608109j817169
1615.4E80282974k551956q263435R98382n42602n36194j761665k32926j752815m019547
1624E61620216O68030q49647j52665l105278j930275q09326j258812n06210p80449
1632.7E52895584O83670r27238k211953j713142J700592J036072J41182J071129m13971
$$ plain form
1573.9 656575546 657032089 656202545 650332642 650923309 651028442 649674225 648248672 646641083 645611572
1582.6 645611572 644265518 643567352 642815933 641594009 640234528 638616066 636919174 633935814 631539307
1591.2 631539307 628881416 626611137 624069252 621831741 620662422 618643761 617852364 616072922
1599 616072922 614457474 612334175 609700203 607488327 604228325 602161827 599248962 597219086 594957008
1607.6 594957008 592979622 590938683 588938217 588691940 586346397 584708252 582100143 580282974
1615.4 580282974 577731018 569467583 570465965 569923363 569387169 567625504 567392578 565639763 561620216
1624 561620216 562288246 561438599 561285934 558180656 556250381 555441055 554182243 553676033 552895584
1632.7 552895584 553579254 552652016 550440063 548726921 550427513 551463585 551604767 552675896 552261925
1641.4E52261925J010055k94227J050148J423645j297188J031799L29590L352470J644097
1650.1E60512314K261467R61037o332589J717034K722892L802300J891251J980133
1657.8E69515839J141090J766396K164535J967507K172317R48868L142814K075730
1665.5E84895096K116318K059822J823272J449356J853104M057999K552643L546104
1673.2F04353714L311119K705460K762069L242455L250236K335434L057595J843147
1680.9F26861229L160133L723107K224502K831230K875443M708176L819198K618485
1688.6F52821503K629623K652359K644272K517395J875000K223968K250290j396255
1696.4F68218155L257522L850480L995132J813507l212967L959809K935562P70034
$$ plain form
1641.4 552261925 553271980 552977753 554027901 555451546 554154358 555186157 555515747 558868217 560512314
1650.1 560512314 562773781 563734818 557402229 559119263 561842155 565644455 567535706 569515839
1657.8 569515839 570656929 572423325 574587860 576555367 578727684 579676552 582819366 584895096
1665.5 584895096 587011414 589071236 590894508 592343864 594196968 598254967 600807610 604353714
1673.2 604353714 607664833 610370293 613132362 616374817 619625053 621960487 625018082 626861229
1680.9 626861229 630021362 633744469 635968971 638800201 641675644 646383820 650203018 652821503
1688.6 652821503 655451126 658103485 660747757 663265152 665140152 667364120 669614410 668218155
1696.4 668218155 671475677 675326157 679321289 681134796 677921829 681881638 684817200 685587234
1704.1F85587234l06625R73969l31269J239014K119446J068039N45959J020508J171112
1712.8F93087387M33807j298446j038513K208557N75180l692780K283325J869355J458435
1721.4F95886307J008758N15442K27738P57141P48596K16827L08838l65982j493530
1730.1F97810135j32218J987153J386718l434753j724014L416824K749100R69619J283722
1738.8G04312286J84250j116256K345428R39636q37555P96738K397614J821975R02252
1747.5G11746368J803132J215133K918930J230164O93741L037414J509628J662446
1755.2G25816956J625442j9760J676407K570343J894836J645584k52685O93207K665939
1763.9G38316269J173859P35397J060867Q71811l14941J124191J913910l96576j197586
$$ plain form
1704.1 685587234 685280609 686254578 685923309 687162323 689281769 690349808 690895767 691916275 693087387
1712.8 693087387 693521194 692222748 691184235 693392792 693967972 690275192 692558517 694427872 695886307
1721.4 695886307 696895065 697410507 697638245 698395386 699143982 699360809 699669647 699303665 697810135
1730.1 697810135 697677917 699665070 701051788 697617035 695893021 699309845 702058945 703028564 704312286
1738.8 704312286 704496536 703380280 705725708 706665344 705827789 706624527 709022141 710844116 711746368
1747.5 711746368 713549500 714764633 717683563 718913727 719607468 722644882 724154510 725816956
1755.2 725816956 727442398 727422638 729099045 731669388 733564224 735209808 734957123 735650330 738316269
1763.9 738316269 739490128 740225525 741286392 742158203 741843262 742967453 744881363 744484787 743287201
1772.5G43287201Q23517L276748J755753o0501J332550J52283J98898l80249l79791
1781.2G50006409J196594J140823P67060l63312R56955J271057M46320K76412K96250
1789.9G55994568m78134o33545j476441K14234K688980R63669O3553J289901J323929
1798.6G59950714J24283q27942N88913o07758N16358R68475k48642j63345k05383M29840
1808.2G60525513P04651R65957M2877N93262R98840O8589K23999k07749K03019n23835
1817.9G63595123o8283O97708M044M82941L738O83823P40738j087800J80665R83123
1827.5G66215820M45633r14154k188797P41883J587677K21328N46723N28946R3841
1836.2G67278900K69318j4038N26580l09982j71356l68576L83453J54419l296966K000580
$$ plain form
1772.5 743287201 744110718 747387466 749143219 749082718 750415268 750567551 750766449 750386200 750006409
1781.2 750006409 751203003 752343826 753110886 752747574 753704529 754975586 755421906 755698318 755994568
1789.9 755994568 755516434 754882889 753406448 753620682 756309662 757273331 757336884 758626785 759950714
1798.6 759950714 760074997 759247055 759835968 759228210 759744568 760713043 760464401 760301056 760095673 760525513
1808.2 760525513 761230164 762196121 762238998 762832260 763831100 763899689 764123688 763915939 764118958 763595123
1817.9 763595123 763526840 764224548 764228592 764711533 764715271 765399094 766139832 765052032 765232697 766215820
1827.5 766215820 766661453 765747299 763558502 764300385 765888062 766109390 766656113 767185059 767278900
1836.2 767278900 767548218 767534180 768060760 767750778 767579422 767210846 767594299 767748718 764451752 766452332
1845.8G66452332J760025P8125j85166L52020O32477l09982P1106k13165q9722k30713
1855.5G68317337J7319O88171R2850R5596J82038P07397k41776n05828k77176j46866
1865.1G68929062K97775q24203k26822q93173M2114J422119P97729O49949J33590K17285
1874.8G70545425j15661k7237n07126k41776L46222j7013N08270r8572K16294j7090
1884.4G70591736R0332O31180j23825K56347r71756j412506N97916J089477K97547
1893.1G71046448l6392j57853p02591Q39386Q72879L73307P5531l5019j33896o96335
1902.7G71445465j10092m99954j73493L08304J58463m8294J32904O51626L50266P23724
1912.4G72938919l37677l26385k51160l35236M02985j681442l46909P41577M40979
$$ plain form
1845.8 766452332 768212357 768290482 768105316 768457336 769089813 768779831 768850937 768637772 768548050 768317337
1855.5 768317337 768334656 769022827 769115677 769211273 769393311 770100708 769858932 769353104 769075928 768929062
1865.1 768929062 769226837 768402634 768175812 767282639 767324753 768746872 769544601 770194550 770328140 770545425
1874.8 770545425 770429764 770402527 769895401 769653625 769999847 769982834 770491104 770392532 770608826 770591736
1884.4 770591736 770682068 771313248 771189423 771445770 770474014 769061508 769659424 770748901 771046448
1893.1 771046448 771010056 770852203 770149612 770988998 771861877 772235184 772310715 772275696 772141800 771445465
1902.7 771445465 771335373 770835419 770661926 770970230 771128693 771080399 771213303 771864929 772215195 772938919
1912.4 772938919 772601242 772274857 772023697 771688461 772091446 770410004 770063095 770804672 771245651
1921.1G71245651J19019q28934M63562J127243P67746k30102j68763l90243m35410
1929.7G71669769j27945n02777j19629j82800O18744M77447J46180K48870l8833J18637
1939.4G72307663j50681N44205j094131j589966O35071K50778J07345k25524L21273
1948.1G71106033L68882J76391J61896L15552K98385m36554m7989m01535r2620Q39
1957.7G71449280k79465j2512j18866M99649J58462J54953j33209J80969N82200o27518
1967.3G71853943j22833M2801o0578k29950j7319K98539n5161R1171k79007m3945M82712
1978G71960373M47540m51813n49087J33896J7395L33099J88370J44882m97513q17718
1987.6G70909424j99509N4550N37949j69754n87463K18963N59921J78070R2545L07999
$$ plain form
1921.1 771245651 771364670 770535736 770999298 772126541 772894287 772664185 772495422 772105179 771669769
1929.7 771669769 771541824 771039047 770919418 770736618 771355362 771832809 771978989 772227859 772189026 772307663
1939.4 772307663 772156982 772701187 771607056 770017090 770652161 770902939 771010284 770784760 771106033
1948.1 771106033 771474915 771651306 771813202 772128754 772427139 771990585 771942596 771541061 771448441 771449280
1957.7 771449280 771169815 771157303 771038437 771538086 771696548 771851501 771718292 771899261 772481461 771853943
1967.3 771853943 771731110 771773911 771713333 771483383 771466064 771764603 771709442 771800613 771521606 771477661 771960373
1978 771960373 772407913 771956100 771407013 771540909 771558304 771891403 772079773 772224655 771727142 770909424
1987.6 770909424 770709915 770764465 771302414 771132660 770545197 770764160 771324081 771502151 771594696 771902695
1997.2G71902695j11084o6986m98810l02048N5695k9373K5100q9340J82648k10648
2006.9G70857849k70080j63651p4387k79846m25186J11160J1826J86691l35769m49677
2016.5G69168930n6305j28937J29471q7738L3341K899P8964k29721j78757J25962k36969
2027.1G68621140n6153n30472l49044k900N2567j45798m39071K8686k53067J2360j1750
2037.7G66926498j48086j33972k87400j97143m53034L0518k20566j21536l2272j14747
2047.4G65248260K90299O9504L87192j32752q0872J59379M4097j7318n69916l6392
2057G65361481j60675P3166o4393m09927J70441R6359M46396K13318P6751Q393j26114
2067.6G65685196n417j19553o1264l55835m4860J41906L33100L22342j9379k36054
$$ plain form
1997.2 771902695 771791611 771724625 771225815 770923767 770979462 770950089 770975189 770885849 771068497 770857849
2006.9 770857849 770587769 770424118 770349731 770069885 769644699 769755859 769767685 769954376 769618607 769168930
2016.5 769168930 769112625 768983688 769113159 769025421 769058762 769061661 769140625 768910904 768732147 768858109 768621140
2027.1 768621140 768564987 768034515 767685471 767682571 767735138 767589340 767150269 767178955 766925888 766938248 766926498
2037.7 766926498 766778412 766644440 766357040 766159897 765706863 765737381 765516815 765395279 765363007 765248260
2047.4 765248260 765538559 765608063 765995255 765862503 765781631 765941010 765985107 765967789 765397873 765361481
2057 765361481 765200806 765273972 765209579 764799652 764970093 765066452 765512848 765726166 765802917 765811310 765685196
2067.6 765685196 765679779 765560226 765498962 765143127 765098267 765240173 765573273 765895615 765876236 765640182
2077.3G65640182k52685N88989K17362l8529n2871m73938m36554l07541M59594N63355
2086.9G65907364R4757k28577k517L3187l4866j4114l31650K02179J02539Q4229p3014
2097.5G65739517r8724M23889j84708j50756R2086M45481J88522j63727J4954l31574
2107.2G65974960J46561K60010M4403l81775k06223N22919K93274L6545p2479J90887
2116.8G66809082j29776j76544j8845M3717J43661l83301k06451k97546n3864K07367
2126.5G65937500K18811K78091J24360K49557k90527J75094j220l46070R9640j05285
2136.1G66339951M62951K55585K20489J85547k02026m1657n4245j75704o04554j47552
2145.8G66238785k6932K42767L81165j92185L00446M75998O9275m36783J10092M01917
$$ plain form
2077.3 765640182 765387497 765976486 766193848 766155319 766102448 765628510 765191956 764884415 765344009 765907364
2086.9 765907364 766002121 765773544 765771027 765804214 765769348 765755234 765423584 765625763 765728302 765812531 765739517
2097.5 765739517 765640793 766064682 765879974 765729218 765821304 766266785 766455307 766291580 766306534 765974960
2107.2 765974960 766121521 766381531 766425934 766044159 765837936 766360855 766654129 766690674 766618195 766809082
2116.8 766809082 766679306 766502762 766483917 766527634 766671295 766287994 766081543 765783997 765730133 765937500
2126.5 765937500 766156311 766434402 766558762 766808319 766517792 766692886 766691666 766345596 766445236 766339951
2136.1 766339951 766802902 767058487 767278976 767464523 767262497 767220840 767166595 766990891 766386337 766238785
2145.8 766238785 766211853 766454620 766835785 766643600 766944046 767420044 767489319 767052536 767162628 767564545
2155.4G67564545N5008j603m49829j43585j27029q927M31900N80216K31781j1139N79147
2166G68700485J63574j04217j95236j18256J09482k03171j21918K9908M06875K20337
2175.6G68887863K18048K83890J83487K67410o6910J22605l08304j87225L18679O6452
2185.3G69785995L19977M33274L69339K1667N8823K79236Q1558k39640p7209L67584
2194.9G71400604j33133k94876P7515L56598K36206J30539K38113P3395K08588J86309
2204.6G72479858J08719O8131J89514j47095m70505j144J34659K65274L31116M32510
2214.2G73391037k9984M6616M51813k93274m24271k57263K98691K35901M0359J98212
2223.9G73657837r0561L08914K62909L30353P1793j49003k53753n75028J25809L1738
$$ plain form
2155.4 767564545 767619553 767617950 767168121 767024536 766897507 766888580 767320480 767900696 768132477 768121338 768700485
2166 768700485 768864059 768759842 768564606 768446350 768555832 768352661 768230743 768260651 768667526 768887863
2175.6 768887863 769105911 769389801 769573288 769840698 769773788 769896393 769588089 769400864 769719543 769785995
2185.3 769785995 770105972 770539246 770908585 770930252 770989075 771268311 771349869 771110229 771033020 771400604
2194.9 771400604 771267471 770972595 771050110 771406708 771642914 771773453 772011566 772084961 772293549 772479858
2204.6 772479858 772588577 772656708 772846222 772699127 772228622 772227478 772362137 772627411 772958527 773391037
2214.2 773391037 773361053 773407669 773859482 773566208 773141937 772884674 773183365 773419266 773459625 773657837
2223.9 773657837 773567276 773876190 774139099 774469452 774541245 774392242 774138489 773563461 773689270 773721008
2233.5G73721008m57K10723N12162L81546k70081L0823J64413K66724q1787j25275
2243.2G74809799P630n4856l70178p44247L11279N11474K89994K58484K34604L1738
2252.8G75285721q850L55835o17142m51736j80130k8687K09656j97983K80991K90679
2262.4G74938354N02625J72882J93710M68064J98822q0338j045761k74963N3863j449
2272.1G75125809k0600k92816J03073K26746R20868K33002N1956J09558k54059j97983
2281.7G76005554q19092o6375l03269k02942L26767L27149O45828O4392M36401N4551
2291.4G76468964j8921J1978l60184Q1482m45328j77231j10244K4719Q9798K44141
2301G75809174Q36334P553Q3542L80630J00022k64817k93274j08413M2190Q24433M60586
$$ plain form
2233.5 773721008 773720551 773931274 774443436 774824982 774554901 774585724 774750137 775016861 774935074 774809799
2243.2 774809799 774817429 774762573 774392395 773648148 773959427 774470901 774760895 775019379 775253983 775285721
2252.8 775285721 775276871 775632706 775015564 774563828 774383698 774355011 774564667 774366684 774647675 774938354
2262.4 774938354 775440979 775613861 775807571 776275635 776474457 776394119 775348358 775073395 775127258 775125809
2272.1 775125809 775105209 774812393 774915466 775142212 776063080 776296082 776348038 776457596 776203537 776005554
2281.7 776005554 775186462 775120087 774816818 774613876 774940643 775267792 775913620 775978012 776414413 776468964
2291.4 776468964 776450043 776462021 776101837 776183319 775737991 775560760 775450516 775475235 775565033 775809174
2301 775809174 776645508 776653061 776736603 777117233 777217255 776952438 776659164 776550751 776592941 777417374 777877960
2311.6G77877960K54288L72543K72293M14200k65808r37729k37579N19790j18942J09864
2321.3G78260880K88848J77002J21460K85874O09359j1901P83920M16031l83682k00501
2330.9G80347290j32980r1095j450653p94526O87867R79080P63550P53021L88184k31476
2340.6G81218262l18833n66940m81033m04435K57798j108780j616211o04324K51998
2349.2G76627502J707840M37317l15399L75061R82514J668777j022415k97012K41928
2357.9G80406113m72412j74790J700363J460572j53504M66232k490768r07593j69677
2366.6G79664536q63877l6545j017150q00934j957322q96072p6294k72903j17340q11158
2376.2G72814941j99508o9428j03302n26275q20237q45031q62503l54309j64414K71835
$$ plain form
2311.6 777877960 778132248 778504791 778777084 779191284 778925476 777987747 777750168 778269958 778151016 778260880
2321.3 778260880 778549728 778726730 778848190 779134064 779743423 779731522 780515442 780931473 780547791 780347290
2330.9 780347290 780214310 780123215 778672562 777878036 778565903 779544983 780308533 781061554 781449738 781218262
2340.6 781218262 780899429 780332489 779851456 779447021 779704819 778596039 776979828 776375504 776627502
2349.2 776627502 778335342 778772659 778457260 778832321 779814835 781483612 780461197 780164185 780406113
2357.9 780406113 779933701 779758911 781459274 782919846 782766342 783232574 780741806 779834213 779664536
2366.6 779664536 778800659 778764114 777746964 776946030 774988708 774092636 774016342 773743439 773626099 772814941
2376.2 772814941 772615433 772546005 772442703 771916428 771096191 770251160 769388657 769034348 768869934 769141769
2385.9G69141769J22757K4033K9907l01056k19269j92565j42212k22321j95007n13535
2395.5G67532501l20663O7520j9684J03760J06582K79236l55835k83203o7672p82853
2405.2G66259689n05218l9215p7973l70254K64282J24130m46014J07651j7014k38037
2414.8G65062027k61230j95466n39093l17001n5313m80728j54343p9269P171k60315
2424.5G62726440k7923K72903l57284m33502m42963n35355r35440k84042J03149l69262
2434.1G59716721o6224M5548J78986j21537R2392j19858o22177l06091n87082m13895
2443.7G57796783k47726j06812l86276n98831k18506L05N80368L43247j54953o45523
2453.4G56362076n48859k50015p05490p74384o38122j03913J34659K68250P4920k02102
$$ plain form
2385.9 769141769 769264526 769288559 769318466 769017410 768798141 768605576 768463364 768241043 768046036 767532501
2395.5 767532501 767211838 767279358 767259674 767363434 767470016 767749252 767393417 767110214 767042542 766259689
2405.2 766259689 765754471 765715256 765637283 765267029 765531311 765655441 765209427 765317078 765300064 765062027
2414.8 765062027 764800797 764605331 764066238 763749237 763693924 763213196 763058853 762979584 762986755 762726440
2424.5 762726440 762698517 762971420 762614136 762180634 761737671 761202316 760266876 759982834 760085983 759716721
2434.1 759716721 759650497 759696045 759875031 759753494 759845886 759726028 759103851 758797760 758210678 757796783
2443.7 757796783 757549057 757442245 757055969 756457138 756238632 756238937 756819305 757162552 757007599 756362076
2453.4 756362076 755813217 755563202 754857712 754083328 753445206 753341293 753475952 753744202 753819122 753617020
2463G53617020m8066j63192n8365m81796n02930m35257o18973m46319l19214j24131
2472.7G50418777j51214M75311M00162j0300M1199j09634m02680j102600o42319l21960
2482.3G48594742l21503j61972j05972J81961k11334k77863j95694J00174J90353P1183
2492G47864075l4561o62766o40030n20248k52762p0419R3460M3792j50756Q0184Q622
2502.6G45758591K33688k89535p62558o76041m0436J13525q74481J89133M37851k51617
2512.2G43838120r3537j40152K00577q1253m99649n93186p4844j21689n39245j45874
2521.9G41749268J86233J57089m47387k7237m5014n05142k86865l46451k7390m6463
2531.5G40360641l08914q20388l99323K14462M5166R1324j61896K0066k65885k43759
$$ plain form
2463 753617020 753568954 753405762 753347397 752865601 752362671 751927414 751308441 750862122 750542908 750418777
2472.7 750418777 750267563 750742874 751143036 751132736 751173935 751064301 750661621 749559021 748916702 748594742
2482.3 748594742 748273239 748111267 748005295 748187256 747975922 747698059 747502365 747602539 747792892 747864075
2492 747864075 747829514 747166748 746526718 746006470 745753708 745683289 745776749 745820541 745669785 745749969 745758591
2502.6 745758591 745992279 745702744 744940186 744264145 744223709 744337234 743462753 743651886 744089737 743838120
2512.2 743838120 743744583 743604431 743805008 743723755 743224106 742630920 742556076 742434387 741895142 741749268
2521.9 741749268 741935501 742092590 741645203 741617966 741572952 741067810 740780945 740434494 740407104 740360641
2531.5 740360641 740051727 739231339 738832016 739046478 739091644 739182968 739021072 739041138 738775253 738531494
2541.1G38531494m38232r56955n46723n43518o2790P8659K71302J04294l39737J11999
2550.8G36209793r8953k54440o98624n68009k28118o37436p76520m97131J90887P1411
2560.4G32712860K89612K70462k02560j76163k65045r9259o38428q68225n66406m29916
2570.1G30026932k47879k25907j41601j25275J40152J74408j4877l31955j60065o1798
2579.7G29032135p33490p59125o44912k32392R4528k3040r5215j22223o5918j31683
2589.4G26318665j05515m41513k67944l65067m79355j3275m51279k66647o1874O7901
2599G23934097K67487l36609l42941N1422l03421p64694k07291m40903q02078j14365
2608.6G20940704q2550l44619j96381Q6746k17132q9798m0207o34842o10504k58255
$$ plain form
2541.1 738531494 738093262 737136307 736589584 736046066 735983276 736061935 736333237 736437531 736097794 736209793
2550.8 736209793 736110840 735856400 735157776 734589767 734361649 733724213 732947693 732450562 732641449 732712860
2560.4 732712860 733002472 733272934 733070374 732894211 732629166 732529907 731891479 731023254 730456848 730026932
2570.1 730026932 729779053 729553146 729411545 729286270 729426422 729600830 729585953 729253998 729093933 729032135
2579.7 729032135 728298645 727539520 726894608 726662216 726756744 726733704 726638489 726516266 726450348 726318665
2589.4 726318665 726213150 725771637 725503693 725138626 724659271 724645996 724194717 723928070 723866196 723934097
2599 723934097 724201584 723864975 723522034 723573456 723270035 722505341 722298050 721857147 721055069 720940704
2608.6 720940704 720858154 720513535 720317154 720403900 720186768 720096970 720056763 719421921 718811417 718553162
2618.3G18553162k18048q71659o43310l37677k95792J61819j72882m29382m33273k68250
2627.9G15044708n55191n30014l79257q89511n40009m44717m25644k99912n3024J20239
2637.6G11047668l34091m95987p24258m67301m94155p63550n29938l52707l84598o60171
2647.2G05840912m82254l14789J46942n5466q01773p13729p04957l65982j14975l69644
2656.9G02064285o96258m20532l45078n69153m5318J74865J10016p97653r94339k31018
2666.5F98249817l44620n74646q79059l84826o9580k07901j05362k56272J6480n9891
2676.1F95384140n04913n81665m71192o66961o01044l82233n19638l74069j91116l2349
2685.8F91058960j64871j32752k52151m44870l49198m61654l17383o75659n28794k41317
$$ plain form
2618.3 718553162 718335114 717463455 716820145 716482468 716186676 716348495 716175613 715746231 715312958 715044708
2627.9 715044708 714489517 713959503 713580246 712690735 712150726 711706009 711280365 710980453 710927429 711047668
2637.6 711047668 710713577 710217590 709493332 709026031 708531876 707768326 707238388 706885681 706501083 705840912
2647.2 705840912 705358658 705043869 705190811 705135345 704333572 703619843 702914886 702548904 702433929 702064285
2656.9 702064285 701368027 700947495 700602417 700033264 699987946 700162811 700272827 699475174 698480835 698249817
2666.5 698249817 697905197 697330551 696451492 696066666 695997086 695789185 695683823 695427551 695444031 695384140
2676.1 695384140 694879227 694297562 693826370 693159409 692558365 692176132 691656494 691282425 691091309 691058960
2685.8 691058960 690894089 690761337 690509186 690064316 689715118 689253464 688936081 688260422 687731628 687490311
2695.4F87490311k99454k17514n17883j23902p9574l04795o62307o22788j14288m93698
2705.1F84054108n23148p80640n23071p6l78876m67682j32293j45722p72095m09317
2714.7F79921188k05154l27835k47421n99366n44662m20075j38092m46548l41415L4103
2724.4F76684723j85623q0872m81491n67551o77642k96784j6250o59867k18200k18812
2734F73281631m58831j68152k57721k51465j96152l72085k41242k75955o64596k79007
2743.7F70116425q9722q2932m29687n69229J68457L6163j75857l74070l24630k51618
2753.3F68023300m96673m57764o47583l52478p6065j2970l96958k72903L31650k51770
2762.9F65389786n08423n30319j25351l6240q03146p45087m8675J63192n95016l18222
$$ plain form
2695.4 687490311 687190857 686973343 686455460 686331558 686251984 685947189 685284882 684662094 684547806 684054108
2705.1 684054108 683530960 682750320 682227249 682227173 681848297 681380615 681248322 681102600 680330505 679921188
2714.7 679921188 679716034 679388199 679140778 678541412 677996750 677576675 677438583 676992035 676650620 676684723
2724.4 676684723 676499100 676418228 675936737 675369186 674691544 674394760 674378510 673718643 673500443 673281631
2734 673281631 672822800 672654648 672396927 672145462 671949310 671577225 671335983 671060028 670395432 670116425
2743.7 670116425 670026703 669943771 669514084 668944855 669113312 669149475 668973618 668599548 668274918 668023300
2753.3 668023300 667526627 667068863 666421280 666068802 665992737 665979767 665582809 665309906 665641556 665389786
2762.9 665389786 664881363 664351044 664225693 664189453 663386307 662641220 662592545 662755737 662160721 661842499
2772.6F61842499L69720J09101n42450r37500o27594o21872o36292n93643j36185R156
2782.2F58234940l02124l69339p01752j89514r9869k59934k17056q97140j042252q76083
2791.9F53279877o23093k65121j51825m83475l90625l27530r27963j056366r84802
2800.5F48069077m81644l93143o76193p39136j004944r32998p55387n23376l90473
2809.2F42171783k49862r14231j126632l59230p81174j009903j132660j118011p79534
2817.9F34700546q14628p54013q87566r26476j183471r24912o63833q44002q58460
2826.6F26843185j385765j101913p56607j441651j592330r57833j048088j275558q39234
2835.3F16444206j137581j302566j011658j028213j715546k070122j701240k081757
$$ plain form
2772.6 661842499 662212219 662321320 661778870 660841370 660213776 659591904 658955612 658361969 658225784 658234940
2782.2 658234940 657932816 657563477 656861725 656672211 656572342 656312408 656095352 655198212 654155960 653279877
2791.9 653279877 652656784 652391663 652239838 651756363 651365738 651038208 650110245 649053879 648069077
2800.5 648069077 647587433 647194290 646518097 645778961 644774017 643841019 643085632 642562256 642171783
2809.2 642171783 641921921 641007690 639881058 639521828 638740654 637730751 636598091 635480080 634700546
2817.9 634700546 633885918 633131905 632244339 631317863 630134392 629209480 628545647 627701645 626843185
2826.6 626843185 625457420 624355507 623598900 622157249 620564919 619607086 618558998 617283440 616444206
2835.3 616444206 615306625 614004059 612992401 611964188 610248642 608178520 606477280 604395523
2843F04395523j820793j529083j939888j923981j821365j726876j933670j740913j552010
2851.7E88406944j683311j239357o19316n76592r39865o92482l48167j52512k15645
2860.3E81939697r91630j760826j580239j009903j437568j564560j136589j653328
2868.1E70805054k216072j971627j655922j459350j588249k092171j893883j680260
2875.8E56247520j844863j775895j658859j697197j769447j488571j424942q91190
2883.5E43696556o29234j133194p73163p81479p39288o04096n80444k59895j009865
2892.2E37185898r11369q8921O2523J98135n08003o96831J57509j19362q86154q95195
2901.8E33498230n99022o54793q91075o35490o61049o84204n58205p71217j060295
$$ plain form
2843 604395523 602574730 601045647 599105759 597181778 595360413 593633537 591699867 589958954 588406944
2851.7 588406944 586723633 585484276 584864960 584288368 583348503 582656021 582307854 582155342 581939697
2860.3 581939697 580948067 579187241 577607002 576597099 575159531 573594971 572458382 570805054
2868.1 570805054 568588982 566617355 564961433 563502083 561913834 559821663 557927780 556247520
2875.8 556247520 554402657 552626762 550967903 549270706 547501259 546012688 544587746 543696556
2883.5 543696556 543067322 541934128 541160965 540379486 539640198 539036102 538455658 538195763 537185898
2892.2 537185898 536274529 536185608 536248131 536446266 535938263 535241432 535398941 535279579 534393425 533498230
2901.8 533498230 532899208 532244415 531353340 530717850 530056801 529372597 528814392 528043175 526982880
2910.5E26982880j785965j826210j855049k105332j956825k018624j701698j682510
2918.2E12050667j142845j115685j978111j561089r71069n97191j183853j139984m22859
2926.9E01937981p46765l27607J57395L65905M51241P75147J002235O79169J259002
2935.6E05553703J875534J735421J279945J623306K220459K185250K248077K140160
2943.3E20861855K202682K572479K705956K378654J918793J878014K124824K025070
2951E38668327K286759K334976J648788K294083K482452K110863K191544K382698K772217
2959.7E59172707J856765J588784J645202J711808K261543J578560J283035J185684
2967.4E72284088J050148J612053J756325J537781J977272J852760J148910J389847
$$ plain form
2910.5 526982880 525196915 523370705 521515656 519410324 517453499 515434875 513733177 512050667
2918.2 512050667 510907822 509792137 507814026 506252937 505281868 504684677 503500824 502360840 501937981
2926.9 501937981 501191216 500863609 501021004 501386909 501838150 502613297 503615532 504294701 505553703
2935.6 505553703 507429237 509164658 510444603 512067909 514288368 516473618 518721695 520861855
2943.3 520861855 523064537 525637016 528342972 530721626 532640419 534518433 536643257 538668327
2951 538668327 540955086 543290062 544938850 547232933 549715385 551826248 554017792 556400490 559172707
2959.7 559172707 561029472 562618256 564263458 565975266 568236809 569815369 571098404 572284088
2967.4 572284088 573334236 574946289 576702614 578240395 580217667 582070427 583219337 584609184
2975.1E84609184J340370J342011J349716J445313J532478R78928J191520J456528
2982.8E95246048J452141J221504J277771J373138Q75664M71192J29470L32566M85382
2991.5F02864876P81936M28811L25470J169853Q43582M28772k08130N4970K84920m26217
3001.1F06548843j28288k13737l68691k12021K35787m8180n15137N494L7269j09558
3010.8F05231781n27840n43174o96831q25195p20788q12339l35694o87370n55763o94885
3020.4E98831902p03621K90146p03393j407890r48639r69620j378974j037026n45425
3029.1E91427460o34003m52652j057548p75071m61731j226425r70077q86841j263275
3037.8E83699837j384697j019325r26629j276168j093445r66072q77495p16438p53365
$$ plain form
2975.1 584609184 585949554 587291565 588641281 590086594 591619072 592598000 593789520 595246048
2982.8 595246048 596698189 597919693 599197464 600570602 601446266 601917458 602046928 602379494 602864876
2991.5 602864876 603646812 604075623 604401093 605570946 606414528 606843300 606635170 606690140 606975060 606548843
3001.1 606548843 606420555 606206818 605838127 605626106 605861893 605813713 605298576 605304070 605341339 605231781
3010.8 605231781 604703941 604160767 603463936 602638741 601917953 601105614 600769920 600082550 599526787 598831902
3020.4 598831902 598128281 598418427 597715034 596307144 595358505 594388885 593009911 591972885 591427460
3029.1 591427460 590793457 590340805 589283257 588508186 588046455 586820030 585849953 584963112 583699837
3037.8 583699837 582315140 581295815 580369186 579093018 577999573 577033501 576156006 575439568 574686203
3046.5E74686203r66721j014709p93076j196327j695671j183548j094360j526985j267815
3055.1E63946991j397095j255951m05693m60891j012726j213646j333733j105308r80072
3063.8E54781876j359444r18312j139031j783294j084671o11000n65110r90257j059341
3072.5E45271416q16078j250077j292190j221123j243668j166877j383171j522904
3080.2E35375328r86557p27806j192436j343842q37402o41289j363945j031723p21092
3088.9E26529236j599159j800156j083489l31916j105995j585694r30824p27310j001854
3097.6E16362839j320000j071205j212807j179695j110802j121559r73320j213455
3105.3E07159996p70988j119080j727104j241226n84183q74214j549340j231536j409455
$$ plain form
3046.5 574686203 573719482 572704773 571911697 570715370 569019699 567836151 566741791 565214806 563946991
3055.1 563946991 562549896 561293945 560888252 560427361 559414635 558200989 556867256 555761948 554781876
3063.8 554781876 553422432 552504120 551365089 549581795 548497124 547886124 547321014 546330757 545271416
3072.5 545271416 544455338 543205261 541913071 540691948 539448280 538281403 536898232 535375328
3080.2 535375328 534388771 533660965 532468529 531124687 530287285 529645996 528282051 527250328 526529236
3088.9 526529236 524930077 523129921 522046432 521714516 520608521 519022827 518092003 517364693 516362839
3097.6 516362839 515042839 513971634 512758827 511579132 510468330 509346771 508373451 507159996
3105.3 507159996 506389008 505269928 503542824 502301598 501717415 500843201 499293861 498062325 496652870
3114D96652870j217956j070404r70917n07355j516571j714249q44993n42259j186829
3122.6D87081337j179237n83420j315155j454392j391487j391182j098823r34220p11670
3131.3D77021751j046981j117249j087799j063080j167717j480636j036148q51059
3139D68171082j506157j760369j055107m95186q82339j187287q72345j089172j313820
3147.7D58009300j131515j050492j047554j323394r20296r34334j288719j127472j041718
3156.4D48143806o03294p76024r28879j217422j333008q73871j208343j481362j413154
3165.1D38308449q00743r32389j314849j210595j079254n39932r57756p40814r00002
3173.8D29832115j436767r61838j325684j209945p97196m52042o30531j346779j285286
$$ plain form
3114 496652870 495434914 494364510 493393593 492886238 491369667 489655418 488810425 488268166 487081337
3122.6 487081337 485902100 485318680 484003525 482549133 481157646 479766464 478667641 477733421 477021751
3131.3 477021751 475974770 474857521 473769722 472706642 471538925 470058289 469022141 468171082
3139 468171082 466664925 464904556 463849449 463354263 462471924 461284637 460412292 459323120 458009300
3147.7 458009300 456877785 455827293 454779739 453456345 452536049 451601715 450312996 449185524 448143806
3156.4 448143806 447540512 446764488 445835609 444618187 443285179 442411308 441202965 439721603 438308449
3165.1 438308449 437507706 436575317 435260468 434049873 432970619 432430687 431472931 430732117 429832115
3173.8 429832115 428395348 427433510 426107826 424897881 424100685 423648643 423018112 421671333 420386047
3182.4D20386047q15467n31350q30421r16176j224976j302642j265831j094170o06270
3191.1D11798744j245422j093521n46761p02553q56132p63931q65632j125335q52890
3199.8D03746567j093140q36983j106262j198349j33247m15535r04007j195488r27315
3208.5C95936241o96220r37310r86671o24428j38511j135636j202240j088791j265182
3217.2C87861252p4463j37825j032791r97429o31409r73625j250229q81996j69411
3225.8C81712074m90226j366463n03845k61498q72230j167069j021385p47681l92418
3234.5C74889259l0822r65424p60269l92685q70094j012650q30498m80690j207962
3243.2C68338165o77414l48320o10771k32086r11369p27425o94275j156921p74079
$$ plain form
3182.4 420386047 419570580 419039230 418208809 417292633 416067657 414765015 413499184 412405014 411798744
3191.1 411798744 410553322 409459801 408913040 408210487 407354355 406590424 405724792 404599457 403746567
3199.8 403746567 402653427 401816444 400710182 399511833 399378586 398963051 398059044 396863556 395936241
3208.5 395936241 395240021 394302711 393316040 392691612 392553101 391417465 390215225 389126434 387861252
3217.2 387861252 387786789 387648964 386616173 385618744 384987335 384013710 382763481 381881485 381712074
3225.8 381712074 381221848 379855385 379351540 379090042 378217812 377050743 376029358 375281677 374889259
3234.5 374889259 374858437 373893013 373132744 372740059 371869965 370857315 370026817 369546127 368338165
3243.2 368338165 367660751 367312431 366701660 366469574 365558205 364830780 364136505 362979584 362205505
3251.9C62205505l74755q51441r81026N8785K4338n47829p69043m80576k98500o53495
3261.5C57331963j054612j090774n26199m82178m47884l48396j64337o92559j243286
3270.2C51281738o63719n29098n3635k44637o25267p23915r62486m23202m36326k37274
3279.8C46382179l43208o41899o20003l40691k31895o43463k90833n94024p16706o73370
3289.5C41286087m31099J06087l57781n69915q07648l26386m07600p16095n05295m15077
3299.1C36855278M7417n14641k04430m73938p91893m31747j193047l83873k8038l65028
3308.8C32516060m80461n73883m68445o89087l55873o53114q76999o97060l94669l4942
3318.4C27291527J42174o1074r12933q78563o23436p32422j123543p67898l28331k40135
$$ plain form
3251.9 362205505 361830750 360979309 359998283 360057068 360081406 359533577 358764534 358283958 357985458 357331963
3261.5 357331963 356277351 355186577 354660378 354178200 353730316 353381920 353217583 352525024 351281738
3270.2 351281738 350618019 350088921 350035286 349790649 349165382 348441467 347478981 347055779 346619453 346382179
3279.8 346382179 346038971 345397072 344777069 344436378 344204483 343561020 343270187 342676163 341959457 341286087
3289.5 341286087 340854988 340961075 340603294 340033379 339225731 338899345 338491745 337775650 337270355 336855278
3299.1 336855278 336902695 336388054 336183624 335709686 334917793 334486046 333292999 332909126 332881088 332516060
3308.8 332516060 332035599 331461716 330993271 330304184 329948311 329295197 328418198 327721138 327326469 327291527
3318.4 327291527 327433701 327372627 326459694 325581131 324957695 324225273 323101730 322333832 322005501 321765366
3328.1C21765366N188q39310l77274j24969l77426m45004j253795m05999l26080j101589
3337.7C16519108r96323k28805J3618n34572m80443p69119j51729m38824j365872p13710
3347.3C10853329n31273j56441m9210j009426j231556j75457k7141m31862k69585n80692
3357C06390686n73006k52494o66256j410351o39191j26991l22132j12381r54018q69255
3366.6C00464611k09389l4523m76932j071949p26395l38020J8348l42655n48725o63299
3376.3B96071072l80669J18332l86372n43880p06864k29492j40705l84540k75326j66149
3385.9B92975407O68544K1172q52013o51264j72767n52178q86001j78757m19731O9332
3395.6B90021744J33838m89769m44717k03915K89784K15797M9725n59597m31233k32391
$$ plain form
3328.1 321765366 321770554 320931244 320553970 320429001 320051575 319606571 318352776 317946777 317620697 316519108
3337.7 316519108 315522785 315293980 315307598 314773026 314292583 313523464 313371735 312932911 311567039 310853329
3347.3 310853329 310322056 310165615 310116405 309106979 307875423 307699966 307672825 307240963 306971378 306390686
3357 306390686 305817680 305565186 304898930 303488579 302849388 302722397 302400265 302287884 301333866 300464611
3366.6 300464611 300255222 300220699 299743767 298671818 297945423 297607403 297625751 297283096 296734371 296071072
3376.3 296071072 295690403 295808735 295422363 294878483 294171619 293942127 293801422 293416882 293141556 292975407
3385.9 292975407 293643951 293665123 292813110 292161846 291989079 291436901 290550900 290372143 289952412 290021744
3395.6 290021744 290155582 289665813 289221096 289017181 289306965 289522762 289572487 289012890 288581657 288349266
3405.2B88349266l97263K5826Q3828K0046m41150j36109j75972j53637K36225j65004
3414.8B87246056K26211Q5583K09637J09520l31898J1139Q8520J20640j16845M01059
3424.5B88049622k0447m30107O00032L44105j25351p9727l59154j58023Q27732O60572
3434.1B89309254K52323O13880J68190m32529K54058J069565M11797M04949j98708
3442.8B91852779l05328Q54664N44224M77428k60887O01253J272850J74180J39904
3451.5B95351067K40440N88322K10895O51550Q96626O61736P93495j02349M36821M96636
3461.1C00225239O32400N26791N38292J413002L61824J44539J11618M00085Q66795
3469.8C05220585J143780J418171M20703O01502M54159L28808P68108Q16250J034717
$$ plain form
3405.2 288349266 287952003 287977829 288061657 288081703 287640553 287504444 287328472 287174835 287411060 287246056
3414.8 287246056 287472267 287557850 287767487 287877007 287545109 287556248 287644768 287765408 287648563 288049622
3424.5 288049622 288029175 287599068 288199100 288543205 288417854 288338127 287978973 287820950 288648682 289309254
3434.1 289309254 289561577 290175457 290343647 289911118 290165176 291234741 291646538 292051487 291852779
3442.8 291852779 291547451 292402115 292946339 293423767 293162880 293764133 295036983 295211163 295351067
3451.5 295351067 295591507 296179829 296390724 297042274 297938900 298600636 299394131 299291782 299728603 300225239
3461.1 300225239 300857639 301384430 301922722 303335724 303697548 303842087 303953705 304353790 305220585
3469.8 305220585 306364365 307782536 308203239 308804741 309258900 309587708 310355816 311172066 312206783
3478.5C12206783N91774O23532J335964J090832j97697N11532J056766Q45165J130524
3487.2C19195175N53379Q70571R11637Q34121O69594M32663R33914R52034N59769j64947
3496.8C25747910R24682J692429J203003R48906J139259J387405K06948L97148Q97636
3505.5C34545326J348915J787987J452370M38461L4561J411591P70683J026726J150474
3514.2C43967094Q22831J798019J196861P59392M70619J253434J046562O17141Q98629
3522.9C52830582n5390J428108J534997J239089J278840J215286J394081Q68759J510048
3531.5C63244400J191826J346969J087685Q50105O53267L32070J612053J199722J264954
3540.2C72783051J202163J571541J632690R00231J120911P93151J738968O85311J914520
$$ plain form
3478.5 312206783 312798557 313422089 314758053 315848885 315651188 316162720 317219486 318064651 319195175
3487.2 319195175 319748554 320619125 321530762 322364883 323034477 323467140 324401054 325353088 325912857 325747910
3496.8 325747910 326672592 328365021 329568024 330516930 331656189 333043594 333250542 333647690 334545326
3505.5 334545326 335894241 337682228 339134598 339573059 339607620 341019211 341789894 342816620 343967094
3514.2 343967094 344789925 346587944 347784805 348544197 349014816 350268250 351314812 351931953 352830582
3522.9 352830582 352775192 354203300 355738297 356977386 358256226 359471512 360865593 361734352 363244400
3531.5 363244400 364436226 365783195 366870880 367720985 368374252 368706322 370318375 371518097 372783051
3540.2 372783051 373985214 375556755 377189445 378089676 379210587 380003738 381742706 382428017 384342537
3548.9C84342537K172508J175270K002945j91803J056595J966095K282600J903573
3556.6C96710320N91087K467956K216301J371842N73349K369079K530327Q55332L250732
3565.3D12936325J371460J302872P15637N19524L333282J996613K091484K288398K283478
3574D28839073J521530J641770K378196J555596K715187J963844J105499J822167K666168
3582.6D46209030K272186J712838M359436K719307k8611J119767J97487L005447L689079
3591.3D65255966L980065K292862J578025L553276L65563K083206K955704J120682
3599D83185349K911529J561356J892242L208809K390900K403869L344040K935639J15394
3607.7E03949127M058953Q12530Q1024O989136J232223j109924L743401K35252M550667
$$ plain form
3548.9 384342537 386515045 387690315 389693260 389501457 390558052 392524147 394806747 396710320
3556.6 396710320 397301407 399769363 401985664 403357506 403930855 406299934 408830261 409685593 412936325
3565.3 412936325 414307785 415610657 416326294 416845818 420179100 422175713 424267197 426555595 428839073
3574 428839073 430360603 432002373 434380569 435936165 438651352 440615196 441720695 443542862 446209030
3582.6 446209030 448481216 450194054 454553490 457272797 457244186 458363953 458561440 461566887 465255966
3591.3 465255966 469236031 471528893 473106918 476660194 477025757 479108963 482064667 483185349
3599 483185349 486096878 487658234 489550476 492759285 495150185 497554054 500898094 503833733 503949127
3607.7 503949127 508008080 508820610 508901634 515890770 517122993 516013069 519756470 519991722 524542389
3616.4E24542389M327164N93490K177620L43170J471443L456460L191566K330627K769318
3625.1E45203247K755203K301140N409432K55775q098793M532700N174446M834022
3632.8E62367172J523667o39000K366562K836303K402611N10902J017037K716484K974472
3641.5E78076210J778832R55314K386322L467217M941864k55509j535797M628906j608047
3650.1E92835312k332192N39437N232124M494934L560372L347015p109718K389717
3657.9F02957001N414390J886978J702652M68445J664391J152077J475639J358147
3665.6F18079720P48100M125175J580315j519775l81356l908920M193344P176285O398201
3674.3F36491089j970978j4131355M396362P443085L556404j839981J064758K939797
$$ plain form
3616.4 524542389 528869553 529463043 531640663 531983833 533455276 536911736 540103302 542433929 545203247
3625.1 545203247 547958450 550259590 555669022 555924797 547826004 552358704 557533150 562367172
3632.8 562367172 563890839 563251839 565618401 568454704 570857315 571368217 572385254 575101738 578076210
3641.5 578076210 579855042 580810356 583196678 586663895 591605759 591350250 589814453 594443359 592835312
3650.1 592835312 590503120 591042557 596274681 600769615 604329987 607677002 600567284 602957001
3657.9 602957001 608371391 610258369 611961021 612429466 614093857 615245934 616721573 618079720
3665.6 618079720 618827820 622952995 624533310 623013535 622632179 618723259 622916603 630092888 636491089
3674.3 636491089 634520111 620388756 624785118 632228203 635784607 633944626 635009384 637949181
3682F37949181J782493J254959J32141O7749L338318N246659p651673k574653O872368
3690.6F46417542l621979J439285M579010K59476J760330J263351K26593J019059K11944
3699.3F53554611J542282J810990m491654p58514N200653J214905l32947O16074K436904
3708F60793304L728791o548538K416915L467942r996491M478302L462219L44086J417084
3716.7F63563614K498703J323318k820892J052246N096054k819137m035111M549484
3724.4F68408279J587525m36630k430039R613L272476J368256M955368l095474o372528
3733.1F67266846Q633575J416550q559876J23062Q97675L12042L591385K975083l197937
3741.8F73458405K866287J0610428m973374j5582886O954804M073334M999542l169479
$$ plain form
3682 637949181 639731674 640986633 641118774 641186523 644524841 649771500 642119827 639545174 646417542
3690.6 646417542 642795563 644234848 648813858 649073334 650833664 652097015 652323608 653342667 653554611
3699.3 653554611 655096893 656907883 652416229 651657715 656858368 658073273 657740326 658356400 660793304
3708 660793304 664522095 657973557 660390472 663858414 653861923 658340225 661802444 662146530 663563614
3716.7 663563614 666062317 667385635 664564743 665616989 670713043 667893906 663858795 668408279
3724.4 668408279 669995804 669559174 667129135 667138748 670411224 671779480 676734848 673639374 667266846
3733.1 667266846 675900421 677316971 668757095 668880157 669777832 670089874 673681259 676656342 673458405
3741.8 673458405 676324692 686935120 681961746 666378860 673333664 677406998 682406540 679237061
3749.5F79237061q398667J0970688m546204n578231N505066M006118K588349m632492
3757.2F79151688K305145M295502p793274j032029M799729K251968P60803K797699
3764.9F87537231l221740m160767L573227N331268O1722p755127K163315J865387p1793
3773.6F85322723J221619K060Q19626N61981L146668j14136o913452K434539K242279
3782.3F88723907J195450J497803k724915n09567Q71735M98276J208572M18854J93023
3790.9F91373138r4375K73132j5106J228256K920761l540954l883591K086868L863220
3799.6F94211349N284882m292374q454284K418823L067245M845276M614869q567353
3807.3F93128433l737411M097900J716766M62800P30056L72620J163711M450531k029876
$$ plain form
3749.5 679237061 670838394 681809082 677262878 671684647 677189713 681195831 683784180 679151688
3757.2 679151688 681456833 685752335 677959061 676927032 681726761 683978729 684739532 687537231
3764.9 687537231 684315491 680154724 683727951 689059219 689120941 681365814 683529129 685394516 685322723
3773.6 685322723 686544342 686546402 687366028 687928009 691074677 690960541 684047089 686481628 688723907
3782.3 688723907 689919357 691417160 688692245 688182678 689054413 689552689 690761261 691180115 691373138
3790.9 691373138 691278763 691551895 691536789 692765045 695685806 692144852 688261261 690348129 694211349
3799.6 694211349 699496231 695203857 686749573 689168396 692235641 697080917 701695786 693128433
3807.3 693128433 689391022 693488922 695205688 695668488 696398544 696771164 697934875 702385406 700355530
3816G00355530j2185593M773026N164642L814087P33414j5465241K958374N510788
3823.7F95659027J769714J943284O82449l198013m46854J964035K929459R40551o521911
3832.4F95721741K382202N327072n658112k53830P434769o539459l386993P159881
3840.1G02187271n361252n33371O403809j505966l397904J693268J447601R13163K278137
3848.8G04124756r45740O73142M544372n712662j101913j2696457L519440R254455
3856.5G01659393o29806N569J849289J043472J859208l845368J227646N877228n554886
3865.2G03491745m611053L619689M979477N085755r295044o550141M974518M998627
3872.9G06693573J097641r987335K412796N486984P33261J320267L087006n201645
$$ plain form
3816 700355530 688169937 692942963 698107605 701921692 702655106 687189865 690148239 695659027
3823.7 695659027 697428741 699372025 700054474 696856461 696409607 698373642 701303101 702243652 695721741
3832.4 695721741 698103943 703431015 697772903 697519073 704953842 698414383 695027390 702187271
3840.1 702187271 696826019 696292648 702696457 701190491 697792587 699485855 700933456 701846619 704124756
3848.8 704124756 703179016 703852158 708396530 702683868 701581955 688885498 692404938 701659393
3856.5 701659393 701029587 701035156 702884445 703927917 705787125 701941757 703169403 709046631 703491745
3865.2 703491745 698880692 702500381 707479858 712565613 703270569 696720428 701694946 706693573
3872.9 706693573 707791214 697803879 700216675 705703659 706436920 707757187 710844193 705642548
3880.6G05642548o520462N878830J538620N23147L256531j0202179K143173L594055
3888.3G05854263O69098M157791n52368p637482J433564L363723j334228M34189O12488
3897G07001038K024307J872253q053360M052048K328339m373474L172836l046494j035156
3905.7G03942337J561661R07898J641540K71988J28250j90811M11453N55802o9962
3914.4G09160156Q92868J184464l369141k279892M179764L40881l403091J107788J360931
3923.1G09174728R14231j534043j502456K099914J484757M15573j632157p52410K384109
3931.7G11052246j498794k155381Q91266N54123Q57239O32858m55627k20948J02845
3940.4G09759827J092605L37448l215866L3798J677018O58798O94961j323089O54602
$$ plain form
3880.6 705642548 699122086 705000916 706539536 707062683 710319214 700117035 702260208 705854263
3888.3 705854263 706523361 710681152 710128784 702491302 703924866 707288589 705954361 706388550 707001038
3897 707001038 709025345 710897598 702844238 706896286 709224625 704851151 708023987 704977493 703942337
3905.7 703942337 705503998 706411896 708053436 708325424 708453674 708262863 708674316 709230118 709160156
3914.4 709160156 710053024 711237488 707868347 705588455 709768219 710109100 706706009 707813797 709174728
3923.1 709174728 710088959 708554916 707052460 709152374 710637131 711052704 709420547 708668137 711052246
3931.7 711052246 709553452 707398071 708289337 708843460 709700699 710333557 709877930 709656982 709759827
3940.4 709759827 710852432 711189880 707974014 708007812 709684830 710343628 711038589 709715500 710370102
3949.1G10370102K35214j253815J680298J80359n63583K75650K26669o790n30472L01438
3958.7G10915070k76642N11474P37229j374207l93295P73392K31323O8436M24957J72653
3968.4G11790390n77469n57861P20901L04642n43442N09415K45590n54962l43704N29251
3978G11522751M99496L27683M11835l92685q04215l74222O85501o2942L01285P99942
3987.7G12914429l47596M82407n34058k81219N75562k93427J9302q84780l35846O64215
3997.3G11978989M70428r3155j7547
4000.2G12338715
$$ plain form
3949.1 710370102 710605316 709351501 711031799 711212158 710648575 710924225 711150894 711144104 710613632 710915070
3958.7 710915070 710638428 711149902 711887131 710512924 710119629 710893021 711124344 711192780 711617737 711790390
3968.4 711790390 711212921 710655060 711375961 711680603 711137161 711646576 711892166 711337204 710993500 711522751
3978 711522751 712022247 712349930 712761765 712369080 711564865 711190643 711876144 711813202 712114487 712914429
3987.7 712914429 712566833 713049240 712515182 712233963 712809525 712516098 712535400 711650620 711314774 711978989
3997.3 711978989 712449417 712356262 712338715
4000.2 712338715
##END=$$ End of the data block
