##TITLE=$$ Begin of the data block
##JCAMP-DX=5.00 $$ ACD/SpecManager v 10.08
##SPECTROMETER/DATA SYSTEM=Varian
##DATE=20 Nov 2012 10:35:06
##DATA TYPE=INFRARED SPECTRUM
##DATA CLASS=XYDATA
##ORIGIN=
##OWNER=
##NPOINTS=3735
##FIRSTX=399.26403809
##LASTX=4000.35498047
##MAXX=4000.35498047
##MINX=399.26403809
##MAXY=78.18117523
##MINY=28.62988281
##XFACTOR=1.0000000000
##YFACTOR=0.000000100000000
##FIRSTY=56.74594116
##DELTAX=0.96440572
##XUNITS=1/CM
##YUNITS=TRANSMITTANCE
##XYDATA=(X++(Y..Y))
399.3E67459412R152832o744728p44935K55738n72434J4752808L67088j4487762m838181
407.9E64599838J573639n458298j0991401m83780M726143J992340P34100N072975P576981
416.6E69342537L553162P317352o691437j2155914p59506J569900m640121q698006
424.3E48837967l525391L759499R612541L922424m620857k375946l228874k553558
432.1E49827805j03760o14433o03524m17747p6599k182274M29191K929039K932167
440.7E52119865M375954K56157k747116k872009l025818k923775j693726J174660M243050
449.4E48907242P147827L953094l94401Q14094j019363J257210M447594j138688p835540
458.1E56139069p493020n825386J739808N533561L072586K465744n43327J294403p67136
$$ y = [567459412, 576612244, 569867516, 569122581, 569378319, 568805885, 583558693, 583925781, 569438019, 564599838, 566173477, 560715179, 549723778, 549239998, 553966141, 555958481, 556692581, 561765556, 569342537, 572895699, 580213051, 573521614, 561365700, 560606194, 562176094, 557535973, 548837967, 545312576, 549072075, 558684616, 562607040, 557986183, 555610237, 552381363, 549827805, 549724045, 549109612, 548506088, 548088341, 548011742, 545829468, 546258659, 549187698, 552119865, 556495819, 556751976, 554004860, 551132851, 548107033, 545183258, 543489532, 544664192, 548907242, 556055069, 560008163, 559613762, 560427856, 559408493, 560665703, 565113297, 563974609, 556139069, 548646049, 542820663, 544560471, 550094032, 553166618, 555632362, 555089035, 556383438, 555616302]
466.8E55616302p417449K49748j048470n371475l74718n467796k599945K423248K884216
475.5E38893661Q658066L818703l220558n105629o659317m744873j651306j547013
483.2E28441734r75990L142967k313728k705269O864700L823471O52161K373772l804169
491.8E35499649m051170r57184j673622m34647m934158k865830N381127L699074J897125
500.5E31560364j527405m129868k284431k499313l022728n270729j273423J017189
508.2E12569656k01339l0251l859367j324539K513504J359710k499885l901978m980850
516.9D99644661k856026j005287o508255k148018j221N60341M515038K462501O29921
525.6D95293655k100906r49364j473694j404953l35350k018165j01357J00365J065445
$$ y = [555616302, 548198853, 548448601, 547400131, 542028656, 541653938, 536186142, 533586197, 536009445, 538893661, 547551727, 551370430, 548149872, 543044243, 536384926, 531640053, 529988747, 528441734, 527465744, 530608711, 528294983, 525589714, 532454414, 536277885, 536930046, 539303818, 535499649, 531448479, 530491295, 528817673, 528383026, 523448868, 520583038, 525964165, 529663239, 531560364, 530032959, 525903091, 523618660, 521119347, 518096619, 512825890, 511552467, 512569656, 512368317, 512338066, 508478699, 507154160, 509667664, 511027374, 508527489, 504625511, 499644661, 496788635, 495783348, 489275093, 487127075, 487125854, 487686195, 492201233, 494663734, 495293655, 493192749, 492243385, 490769691, 489364738, 489029388, 487011223, 486909866, 487010231, 488075676]
534.3D88075676K266159M212685M410514K333298J819802n6153j092720j565780J08337
543E00511818M34456k37503J161117J684418L280296K508049K065850k60392l219986
551.6E07928123l012428l514137k434654k713814j031685J532059N75371j171189n0545
560.3D96107101J228676j856842p45086j165657m077912l558159m314270k831917k377128
569D76408806k444267j334534N06363m13780n29938J603927N2796M6463r00841p49168
578.6D72245827L5362J163559K370605R66187K846107L842202N534668M886779J428337
587.3D95319633m21981j216774o81725j172829J2284Q84208R54018K215042K739983
596D98631859K882080R92241q53462r04847k8686j069946j334496j012306k086601
$$ y = [488075676, 490341835, 494554520, 498965034, 501298332, 503118134, 503061981, 501969261, 500403481, 500511818, 500946274, 500708771, 501869888, 503554306, 506834602, 509342651, 511408501, 511148109, 507928123, 504915695, 501401558, 498966904, 496253090, 495221405, 496753464, 497328835, 496157646, 496107101, 497335777, 495478935, 494733849, 493568192, 489490280, 485932121, 481617851, 478785934, 476408806, 473964539, 472630005, 473136368, 472722588, 472192650, 473796577, 473849373, 473895836, 472994995, 472245827, 472281189, 473444748, 475815353, 476781540, 479627647, 483469849, 489004517, 493891296, 495319633, 494897652, 493680878, 492999153, 491826324, 491838608, 492722816, 493676834, 495891876, 498631859, 501513939, 502506180, 501652718, 500747871, 500719185, 499649239, 498314743, 497302437, 495215836]
604.7D95215836K56271J598740J522789J424827P82089J006585P39631J14746r95636
613.4E01665878r26437q79059o33430M02221P09496J167564J910057L664894L893052
622E10974236L456954J907807n42565n74073O01959l17612j255455N80902J389466
630.7E16221619J889457K709160K478333K284622J443405P63741n44320j376419j161842
639.4E24707756m16946P48405J177368J270561J52245K288704M855080K831611P17888
648.1E38332672M41895J60217j721458j436730J065750O33774l01933J107864J940384
656.8E40222435R08890J912880K878494Q76579n10902k70271q39310j881752q15430
665.4E42481613J002770J306266K854119J954689J820755J629562R02634J174164M4708
$$ y = [495215836, 495472107, 497070847, 498593636, 500018463, 500800552, 501807137, 502546768, 502661514, 501665878, 500739441, 499860382, 499226952, 499629173, 500338669, 501506233, 503416290, 507081184, 510974236, 514431190, 516338997, 515796432, 515222359, 515824318, 515506706, 514251251, 514832153, 516221619, 518111076, 520820236, 523298569, 525583191, 527026596, 527790337, 527246017, 525869598, 524707756, 524290810, 525039215, 526216583, 527487144, 527639389, 529928093, 534783173, 537614784, 538332672, 538774567, 538934784, 537213326, 535776596, 536842346, 537476120, 537174187, 538282051, 540222435, 541131325, 543044205, 545922699, 546799278, 546288376, 546018105, 545178795, 543297043, 542481613, 543484383, 544790649, 547644768, 549599457, 551420212, 553049774, 553952408, 555126572, 555171280]
674.1E55171280j458778j714898p63397J039200Q34236N64270J113701K499962L202629
682.8E60488205J473160J210632M59862l8223p61528j836472p12433j074219p54509
691.5E58454475L58429J044731R17969M27971J095200j52626p93724j808014k929344
700.2E56615067k024193j833000j527901j161919N54733J106186M68522J565933Q20846
708.8E54584274M45023K65503n30510K22244N12085K41699Q42057J739387K665215
717.5E60986977L487053L184242L390236L158149K593766K084350N81932K37923N73349
726.2E80277977Q23021J753998K998123K645645L201065L859406K118492K214050J391945
734.9F01283722k63329p37381j016502m06189K47459R33228Q33855J474609K336578
$$ y = [555171280, 553712502, 551997604, 551234207, 552273407, 553107643, 553671913, 554785614, 557285576, 560488205, 561961365, 563171997, 563631859, 563593636, 562832108, 560995636, 560283203, 559208984, 558454475, 558812904, 559857635, 560775604, 561203575, 562298775, 562146149, 561352425, 559544411, 556615067, 554590874, 552757874, 551229973, 550068054, 550622787, 551728973, 552197495, 553763428, 554584274, 555029297, 555294800, 554764290, 554986534, 555498619, 555740318, 556582375, 558321762, 560986977, 564474030, 567658272, 571048508, 574206657, 576800423, 578884773, 579466705, 579704628, 580277977, 581100998, 582854996, 585853119, 588498764, 591699829, 595559235, 597677727, 599891777, 601283722, 601020393, 600283012, 599266510, 598860321, 599107780, 600041008, 600874863, 602349472, 604686050]
743.6F04686050J492081P21779J25465o29348k035256l476410k881393j159668j353760
752.2E95489540j419639k99874l78761K86903N09987n17769j095352l384514m512367
760.9E84678154k764359k067680j935234j254425n88760M75578K701721L000832J220283
769.6E83466110J911469K607422N29441r44328l23181J514320J808396J160965K494926
778.3E94225540M395943N559692N223694M671478L496590J893120J951866J095161
786F22513084O11725Q93212J455192K885246L863869L525734L011665L503914K833329
794.7F45096970K020111R68475n0735k97242k23007j05133m74396L91693J854630L345566
804.3F52526932K736282J636505P96433r75418r97696k106934l253250l256226k018356
$$ y = [604686050, 606178131, 606899910, 607025375, 606396027, 604360771, 600884361, 598002968, 596843300, 595489540, 594069901, 593770027, 593391266, 593678169, 594188156, 593670387, 592575035, 589190521, 584678154, 581913795, 579846115, 577910881, 576656456, 576067696, 576543274, 579244995, 582245827, 583466110, 585377579, 587985001, 588514442, 587570114, 587246933, 588761253, 590569649, 591730614, 594225540, 598621483, 604181175, 609404869, 614076347, 617572937, 619466057, 621417923, 622513084, 623124809, 624018021, 625473213, 628358459, 632222328, 635748062, 638759727, 642263641, 645096970, 647117081, 648085556, 648034821, 647737579, 647514572, 647409439, 646935043, 647326736, 649181366, 652526932, 655263214, 656899719, 657696152, 656720734, 655723038, 653616104, 650362854, 647106628, 645088272]
813F45088272m28772M37393O43006J09176J453934J819687J433716P7896j060257q71735
822.6F48702316k315521r03091L96881P01446R49402J36871J95694L24250J522064
831.3F49710312k3117k642517k672730j774826k367630l338547j632309o98967L93639
840F34953308O50368n2300J038514M89082r67407k005921k977295l085136k053871
848.7F25989342k004166j632385m53987p30820l80249n5046j116829j858025k216301
857.4F15541534l683166l495483k375756k583236j055069N94406K147407L731003M521790
866F13343430M927787M452210M435081L162117K794876L371201K504234K192307J877670
874.7F43060913K437286L042679L936386L571625K666321K128372N28412o84433k362976
$$ y = [645088272, 644659500, 645096893, 645739899, 645849075, 647303009, 649122696, 650556412, 650634308, 649574051, 648702316, 646386795, 645483704, 645880585, 646582031, 647531433, 647668304, 647863998, 648188248, 649710312, 649687195, 647044678, 644371948, 642597122, 640229492, 636890945, 635258636, 634559669, 634953308, 635603676, 635551376, 636589890, 637078972, 636111565, 634105644, 631128349, 628043213, 625989342, 623985176, 622352791, 621898804, 621167984, 620787735, 620732689, 619615860, 617757835, 615541534, 611858368, 608362885, 605987129, 603403893, 602348824, 602943230, 605090637, 608821640, 613343430, 618271217, 622723427, 627158508, 630320625, 633115501, 636486702, 638990936, 641183243, 643060913, 645498199, 648540878, 652477264, 656048889, 658715210, 660843582, 661371994, 660687561, 658324585]
883.4F58324585k801666l893280k782822j763916k579041j084136q15278n41000j347580
892.1F40715866j353989k004394l097344k096672l427620k412223k141838k788239
899.8F21393547j535149j197700k43912J91498m38499k371293k666091l533516n090752
908.5F04508133m250221m248200l646011l433533l248443k783013l523025l491974
916.2E75883713l101349l156166m128418m066506l238639k774735j872978j595688
923.9E51949234o90346L22075J030922P92770Q6251J499176Q64944o18515j55716O56815
933.6E55737610P34596J65367O72074J266327K783393L706131K624665K141342K117119
942.2E71948624J650161Q99506J34277k11906l40767k403450l232117k069931j826591
$$ y = [658324585, 655522919, 651629639, 648846817, 647082901, 644503860, 643419724, 642604446, 642063446, 640715866, 639361877, 637357483, 634260139, 632163467, 628735847, 626323624, 624181786, 621393547, 619858398, 618660698, 618416786, 618608284, 618169785, 615798492, 613132401, 609598885, 604508133, 600257912, 596009712, 592363701, 588930168, 585681725, 582898712, 579375687, 575883713, 572782364, 569626198, 565497780, 561431274, 558192635, 555417900, 553544922, 551949234, 551258888, 551580963, 552611885, 553404655, 553490906, 554990082, 555855026, 555236511, 555080795, 555737610, 556472206, 556637573, 557309647, 558575974, 561359367, 565065498, 567690163, 569831505, 571948624, 573598785, 574498291, 574632568, 574420662, 574079895, 571676445, 568444328, 566374397, 564547806]
950.9E64547806j564446k934303m025078m191093n936775o805039p036400o639328
958.6E25415344o199989o487579o149674n919723n289765n623779n776711o312446
966.3D77655678p085839p913017r138222p842483q541107r005776q940620q492050
974.1D10696564p330246q800812q386612q459854p610016p697792q049736p204971
981.8C47156525p519722o168022o297417m905510m935475m086570k745323k540226
989.5C07958260j225567k586327j339092k065411j802597r90810j011486o2790p48959
998.2B96125221O81401o72112P45506O30741p68165J98612q19130K10552j203060n92251
1007.8B94537315p76195j080761j092377j765499M3678j283588m5891j025066n98412
$$ y = [564547806, 562983360, 560049057, 556023979, 551832886, 545896111, 539091072, 532054672, 525415344, 519215355, 512727776, 506578102, 500658379, 495368614, 489744835, 483968124, 477655678, 470569839, 462656822, 453518600, 445676117, 437135010, 428129234, 419188614, 410696564, 403366318, 394565506, 386178894, 377719040, 370109024, 362411232, 354361496, 347156525, 339636803, 333468781, 327171364, 322265854, 317330379, 313243809, 310498486, 307958260, 306732693, 304146366, 302807274, 300741863, 298939266, 297948456, 296936970, 296874180, 296125221, 296806622, 296134510, 296880016, 297510757, 296742592, 296941204, 296122074, 296332626, 295129566, 294537315, 293761120, 292680359, 291587982, 289822483, 289866161, 288582573, 288536682, 287511616, 286913204]
1016.5B86913204J32332p46708J122742k90299O09608n10406M83036J792297R88197
1025.2B90494003J166745J06983K010097Q13580J423664J310959J377105J720429j75858
1033.8C00247707J466599N52521J280326K34833L55034L62854p85389P61490r99660
1042.5C03476315Q06484n89276j083030n17445l86429J438275p34368R42955P63073
1051.2C04116554K332764K635479J779156K515220J822815M069634J957550K704391
1058.9C23933563K719689K968063M242134K899895M727211M215202M500199K452697
1066.6C52658653J723595Q40912j286392j732140m519005l326607m367866l929939
1074.4C36061211k832680k437821q47396j064568J396599L48167J128578M01497J261864
$$ y = [286913204, 287045536, 286298828, 287421570, 287131271, 287740879, 287230473, 287713509, 289505806, 290494003, 291660748, 291767731, 293777828, 294591408, 296015072, 297326031, 298703136, 300423565, 300247707, 301714306, 302266827, 303547153, 303781986, 304137020, 304499874, 303714485, 304475975, 303476315, 304282799, 303693523, 302610493, 302093048, 301706619, 303144894, 302410526, 303353481, 304116554, 306449318, 309084797, 310863953, 313379173, 315201988, 319271622, 321229172, 323933563, 326653252, 329621315, 333863449, 336763344, 341490555, 345705757, 350205956, 352658653, 354382248, 355223160, 353936768, 352204628, 347685623, 344359016, 339991150, 336061211, 333228531, 330790710, 329943314, 328878746, 330275345, 330623512, 331752090, 332153587, 333415451]
1083C33415451K789078J319580L694687K795181L531876K928543L837051M206085K371025
1091.7C60888557L471299K277755L021889J416550J385727J341324N13458J182709
1099.4C75499268Q468J333695k02179N493J10054K9602P23877Q1558J653328Q77724
1109.1C80120888K246170K617760L022346J992989J703338M566536K667732K584534
1116.8D01522293J496353J825447J610184K27127J708832P09305N93223K0829J893196
1125.5D11606789K205009J397095J836052J451378K834472R99642J372070J435356
1133.2D25137863J164971J554908O3439L79944n32265k61192j257554j597671k437439
1141.9D22215004l565826k261239l789901k911034l201446k778550j481895j315003
$$ y = [333415451, 336204529, 337524109, 341218796, 344013977, 347545853, 350474396, 354311447, 358517532, 360888557, 364359856, 366637611, 369659500, 371076050, 372461777, 373803101, 374316559, 375499268, 375507736, 376841431, 376639252, 376644745, 376754799, 376784401, 377508278, 377589836, 379243164, 380120888, 382367058, 384984818, 388007164, 390000153, 391703491, 396270027, 398937759, 401522293, 403018646, 404844093, 406454277, 406681404, 408390236, 409099541, 409692764, 409713593, 411606789, 413811798, 415208893, 417044945, 418496323, 421330795, 422330437, 423702507, 425137863, 426302834, 427857742, 427921181, 428301125, 427768860, 427507668, 426250114, 424652443, 422215004, 418649178, 416387939, 412598038, 409687004, 406485558, 403707008, 402225113, 400910110]
1149.6D00910110r23461j563683L28293q83713m10995l66784o82411Q43544L87917
1158.3C97638817J610603R85756K207489K231369L355713N366478M350929N260315
1166D23007469M955788N514984M977798N386811N750465N153999O600762O471863O419525
1174.6D74239464O289482O861916O445350N975113N607109M302712M765167M381866
1182.4E18868179L727036L627434L717537L565368L200112L390274L259697L332786
1190.1E46688423K634735J616860J071281J39771j94664k24381m46472J71127Q03299
1198.8E52259979Q28972J267395J357956O59256j53m55818j96724M60358P50313O20498
1208.4E57552032M73328P28722J361007J956330J767463J459351J848755J639252K89840
$$ y = [400910110, 399986649, 398422966, 398751259, 397867546, 397456551, 397089767, 396407356, 397250900, 397638817, 399249420, 400235176, 402442665, 404674034, 408029747, 413396225, 417747154, 423007469, 427963257, 433478241, 438456039, 443842850, 449593315, 454747314, 461348076, 467819939, 474239464, 480528946, 487390862, 493836212, 499811325, 505418434, 509721146, 514486313, 518868179, 522595215, 526222649, 529940186, 533505554, 536705666, 540095940, 543355637, 546688423, 549323158, 550940018, 552011299, 552151070, 551956406, 551732025, 551285553, 551456680, 552259979, 553088951, 554356346, 555714302, 556373558, 556373405, 555917587, 555720863, 556181221, 556931534, 557552032, 558025360, 558754082, 560115089, 562071419, 563838882, 565298233, 567146988, 568786240, 569076080]
1217.1E69076080j95198K3155m1465o29807p35893K5940J87683M58679O72188k17285
1226.7E68624077q93135q93555j096573j454277j902962k045021j283416p08619m51049
1235.4E57895470j17722n1231L20167K14730k71340m03595j010208j188660j257400
1244.1E54130211o98204L92570l3188K68860J160775J438713J623268J152725P26738
1252.8E60162468M05960k24953n12581q04405o32019M7608L68805Q18176J224022J082763
1262.4E61935844J095429J222267P75795J86539J99966J2894k24152j10168L61747
1271.1E65456161J038018J595115J684533J524734J577301R95140N71938K17132o57386
1279.8E74002686j205254j075211o73828m15535M09508M34227L16238J133309J226845
$$ y = [569076080, 568880882, 568904037, 568862572, 568232765, 567496872, 567522812, 567710495, 568169174, 568841362, 568624077, 567730942, 566837387, 565740814, 564286537, 562383575, 560338554, 559055138, 558346519, 557895470, 557777748, 557726517, 558046684, 558261414, 557990074, 557586479, 556576271, 555387611, 554130211, 553432007, 553824577, 553791389, 554060249, 555221024, 556659737, 558283005, 559435730, 560162468, 560568428, 560343475, 559830894, 559026489, 558394470, 558442078, 558810883, 559629059, 560853081, 561935844, 563031273, 564253540, 565029335, 565215874, 565415840, 565428734, 565204582, 565094414, 565456161, 566494179, 568089294, 569773827, 571298561, 572875862, 573871002, 574442940, 574660072, 574002686, 572797432, 571722221, 571048393, 570632858, 571042366, 571476593, 571792831, 572926140, 574152985]
1288.4E74152985O86226J75056o6490o34270r68819j546478j678161r15452o81610
1297.1E68522987l26233k70729N6458n1689r04198q99811q79783j107750j483345j769371
1306.8E60886536j894417j222153r63592j049614j98822J84745L51563o6185r81560
1315.4E55046501j396408j433296j154747j338577p45125l07236n09682m93393p15828
1324.1E46952209o72416j095505j529922j783524k198601k268753k783356k685203
1331.8E31934929j873093j373329j091232r83696p2861m45442q80051p15561j6861
1340.5E24482803Q72040k45094o16875n05676j08566K70805Q52280J132354M22593
1349.2E26556664P34291O21528M70772l42751r41505p53899r42154o85501q56933l57514
$$ y = [574152985, 574839211, 575014267, 574947777, 574313507, 573344688, 571798210, 570120049, 569204597, 568522987, 568196754, 567926025, 567982483, 567930794, 567026596, 566126785, 565247002, 564139252, 562655907, 560886536, 558992119, 557769966, 556806374, 555756760, 555557938, 555742683, 556094246, 556028061, 555046501, 553650093, 552216797, 551062050, 549723473, 548978348, 548671112, 548161430, 547668037, 546952209, 546279793, 545184288, 543654366, 541870842, 539672241, 537403488, 534620132, 531934929, 530061836, 528688507, 527597275, 526613579, 526540718, 526095276, 525215225, 524499664, 524482803, 525354843, 525109749, 524492874, 523987198, 523878632, 524149437, 525001717, 526134071, 526556664, 527290955, 527912483, 528383255, 528040504, 527098999, 526345100, 525402946, 524717445, 523860512, 523502998]
1358.8E23502998j22032j0605O4736n15404J99509N51796M04358q43812q86459q70552
1368.5E21474533j017380q1710l05481N15480R52911J429749J605606J323433J000251
1377.2E26897392L26577M80270l18298k07329k60201k82821N86776J238861K182274
1385.8E30643501J723671K028160K119599J854934Q30498L42331j08566n82733m15840
1394.5E38435555j638833P096l65525n63850j9493j82915L90854p07512o00509j276131
1404.2E33478737k470055j235084o59333p65495j805229o79817o5460m12560m34456
1412.8E24951248m55398m7264q95081j315727j286621j33210k153053K33994J949424
1421.5E20848312M88739P05033K10762J408844J214752K90184O15234m33235J28899
$$ y = [523502998, 523380966, 523370361, 523435097, 522919693, 523119202, 523670998, 524075356, 523231544, 522345085, 521474533, 520457153, 520375443, 520069962, 520585442, 521538353, 522968102, 524573708, 525897141, 526897392, 527223969, 527704239, 527385941, 527178612, 526918411, 526635590, 527222366, 528461227, 530643501, 532367172, 534395332, 536514931, 538369865, 539200363, 539542694, 539434128, 538851395, 538435555, 536796722, 536803818, 536438293, 535874443, 535854950, 535672035, 536062889, 535355377, 534754868, 533478737, 531008682, 529773598, 529114265, 528348770, 526543541, 525863724, 525798264, 525385704, 524951248, 524495850, 524448586, 523553505, 522237778, 520951157, 520817947, 518664894, 518898888, 520848312, 521337051, 522042084, 522252846, 523661690, 524876442, 525166626, 525781860, 525348625, 525477524]
1430.2E25477524L37219J049690N94178L35464J089172j9340J64108J943970K216072
1438.9E33188057L17230K91710K34108o65283K79617j47552P10678N4588L55873j29204
1448.5E34489822K42386O77490j095809N0964r59778l59039j438828k255172j700020
1457.2E27652016k382431M418525J415635L103790J539879J309623K258721k01645
1464.9E39114113K720642J494980L271332J900520K833061M086075K111740N593834
1472.6E63126297L682899O802292M209938M946061M440994L193130K775231J173095
1480.3E94349937L137436K267723L363610K973976K797394L788490K199554L206406
1488.1F18084526R77135J009140J201134K120780J868935N82275J297532n53513p9193
$$ y = [525477524, 525814743, 526864433, 527458611, 527794075, 528883247, 528863907, 529028015, 530971985, 533188057, 533505287, 533796997, 534031105, 533365822, 533645439, 533497887, 534208565, 534263153, 534619026, 534489822, 534732208, 535409698, 534313889, 534364853, 533405075, 533046036, 531607208, 529352036, 527652016, 525269585, 529688110, 531103745, 534207535, 535747414, 537057037, 539315758, 539114113, 541834755, 543329735, 546601067, 548501587, 551334648, 555420723, 557532463, 563126297, 566809196, 573611488, 577821426, 582767487, 587208481, 590401611, 593176842, 594349937, 597487373, 599755096, 603118706, 606092682, 608890076, 612678566, 614878120, 618084526, 619061661, 620070801, 621271935, 623392715, 625261650, 625843925, 627141457, 626587944, 626508751]
1496.7F26508751K455940K108650J320038J792031J465644r5405J030121J83029M34303
1505.4F37203102o047630o883087N558128K380257L083534J630058J343231P22618
1513.1F38990211J187096p3852r93119M19236j550904L000412J249466j609268j116753
1521.8F39502525J717873M731979J335221n1880R71222K039871K68326l77045O74667
1530.5F50812759p48519N87539j252975j065979K683944J451111J094818j87835l373032
1539.2F50001831k323379M477539L3187j830825J378250o39649Q98438K500992J721649
1547.9F56218033N23987o10886J20010J709900J054306n86319k296142N72586L115845
1556.5F59821320J677780p288742j346817J717300M224701K525330Q49685k90603j444779
$$ y = [626508751, 628964691, 631073341, 632393379, 634185410, 635651054, 635555649, 636585770, 636768799, 637203102, 631155472, 624272385, 629830513, 632210770, 635294304, 636924362, 638267593, 638990211, 640177307, 640103455, 639110336, 639529572, 637978668, 640979080, 642228546, 640619278, 639502525, 641220398, 645952377, 647287598, 647235718, 648206940, 650246811, 650515137, 650138092, 650812759, 650064240, 650651779, 649398804, 648332825, 651016769, 652467880, 653562698, 653374863, 650001831, 647678452, 652155991, 652189178, 650358353, 651736603, 651096954, 651995392, 654496384, 656218033, 656742020, 656131134, 656251144, 657961044, 659015350, 658429031, 656132889, 656705475, 659821320, 661499100, 654210358, 652863541, 654580841, 658805542, 661330872, 662180557, 661889954, 660445175]
1565.2F60445175m14276K91824k72598k095260l699570J642380J272201Q2016r8114
1573.9F57153778R6130j821746n988388J705856N76095j264267j544570j599274r01871
1582.6F46411743j381454r63135r55582j028213j123886j855393j828193k528573k348861
1591.2F32398453l176308k322197k269897k327881j129608j737709r35479j934967
1599F16564407j623497k361946k701645k100906l245392j900329k628174k047272k508469
1607.6E95446777j898422k140388k326889r16k264862k102280k785377j540108j633072
1616.3E78754463q082199L82q06466k47840j530571m83704j455040l434410K71149
1625E62985764p13006k41432l641472j641616m77219j154633o02455r88388N89104
$$ y = [660445175, 660030899, 660322723, 660050125, 657954865, 654255295, 655897675, 657169876, 657251892, 657153778, 657249908, 655428162, 649439774, 651145630, 651721725, 650457458, 648912888, 647313614, 646411743, 645030289, 644067154, 643111572, 642083359, 640959473, 639104080, 637275887, 634747314, 632398453, 629222145, 626899948, 624630051, 622302170, 621172562, 619434853, 618499374, 616564407, 614940910, 612578964, 609877319, 607776413, 604531021, 602630692, 600002518, 597955246, 595446777, 593548355, 591407967, 589081078, 589080162, 586815300, 584713020, 581927643, 580387535, 578754463, 570672264, 570672646, 569866180, 569618340, 568087769, 567604065, 566149025, 562714615, 562985764, 562272758, 562031326, 558389854, 556748238, 556271019, 555116386, 554513931, 553525543, 554114647]
1633.7E54114647p73354j059265j690483O96335P82432N09224R40552m02374J269264
1642.4E54386978l37448O21910O91261j373443J758423M17289L027649J575470K603684
1651E63371773K093849J037102k676659o12907K941856J673622K529221J561546J750641
1659.7E73670044J971168J983796K317314J033287L257446J829414J790162J845321
1667.4E89697952J726189J624947J557235M054680L100472L849907L003616K117729
1675.1F10732727L645592L583526L212395J966553K429771K297592L474122L000640
1682.9F34342918O02189L296890M349174N113297L759460K739868K820740K051087
1690.6F59075623K042007K359009J925354K397613K351914p29294L171844L299485
$$ y = [554114647, 553341293, 552282028, 550591545, 551287880, 552070312, 552579536, 553520088, 553117714, 554386978, 554049530, 554671440, 555362701, 553989258, 555747681, 556164970, 559192619, 560768089, 563371773, 565465622, 566502724, 563826065, 563213158, 566155014, 567828636, 570357857, 571919403, 573670044, 575641212, 577625008, 579942322, 580975609, 584233055, 586062469, 587852631, 589697952, 591424141, 593049088, 594606323, 598661003, 601761475, 605611382, 608614998, 610732727, 614378319, 617961845, 621174240, 623140793, 625570564, 627868156, 631342278, 634342918, 634945107, 638241997, 642591171, 647704468, 651463928, 654203796, 657024536, 659075623, 661117630, 663476639, 665401993, 667799606, 670151520, 669422226, 672594070, 675893555]
1698.3F75893555M255294L889924m168625L656921L048248M85917r39713J092911k81143
1707F86933289J083526K073975N35507R6664J429749J729584N22155q85925o61011
1715.6F92857513J346817j101760l911591L834457K150193J045303P62863N21317N70526
1724.3F98075638J060333Q38623J4038K64740K32926j038208p39518J417694J539994
1733G01666260k393494k798157K934723K827072J252137J173935n3254p98721K307510
1741.7G06118011P90329o25839J176911K175369J638183J280213J643982N51529K844619
1750.4G17593307J439820Q34656L100814J546936J883088J845092l6850J483460K082291
1759G31772614J733627J809082K80304J067734K485199J106414O32553J055375N57861
$$ y = [675893555, 680148849, 684038773, 679870148, 683527069, 686575317, 687061234, 686121521, 687214432, 686933289, 688016815, 690090790, 690626297, 690722961, 692152710, 693882294, 694404449, 693518524, 692857513, 694204330, 693102570, 689190979, 693025436, 695175629, 696220932, 696983795, 697505112, 698075638, 699135971, 699974594, 699988632, 700253372, 700486298, 699448090, 698708572, 700126266, 701666260, 699272766, 696474609, 699409332, 702236404, 703488541, 704662476, 704609222, 703810501, 706118011, 706908340, 706282501, 707459412, 709634781, 711272964, 712553177, 714197159, 714748688, 717593307, 719033127, 719867783, 722968597, 724515533, 726398621, 728243713, 728206863, 729690323, 731772614, 733506241, 735315323, 735595627, 736663361, 739148560, 740254974, 740887527, 741942902, 742500763]
1767.7G42500763j077728J593322K618638J18408r51844Q25577K905197J216889m51355
1776.4G49297867J100159L84521M47922o74057l03726J469345J233596J103669N8288
1785.1G54117584P14417J081695K53296r3841K51007n13459l47747j140213J15280
1793.8G54438019K823639P35473l93448Q67310J086502L41034o09512Q73413n24063
1802.4G59638367M39758R88770k05689P9575k93885M22593J260681J018524o85349
1811.1G62663345K93198J081772K28576N23453k00577j24130m81262J03912N99671
1819.8G64687958p4692K96326k8992J041183P96280j259002o256R21630O62156r55582
1829.4G66081009k102890Q91418J864548N17883J75934K34986n8594R9716L4180Q38089
$$ y = [742500763, 741423035, 743016357, 745634995, 745753403, 744801559, 745627136, 748532333, 749749222, 749297867, 750398026, 750782547, 751230469, 750556412, 750252686, 751722031, 752955627, 754059296, 754117584, 754832001, 755913696, 756166992, 756073151, 756324158, 755810699, 755462952, 754322739, 754438019, 757261658, 757997131, 757603683, 758470993, 759557495, 759898529, 759289017, 760162430, 759638367, 760078125, 761066895, 760861206, 760940781, 760646896, 761069489, 762330170, 763348694, 762663345, 762956543, 764038315, 764266891, 764790344, 764589767, 764465637, 763984375, 764088287, 764687958, 764613266, 764909592, 764880600, 765921783, 766718063, 765459061, 765452805, 766374435, 767036591, 766081009, 763978119, 764869537, 766734085, 767251968, 767427902, 767662888, 767604294, 767704010, 767738190, 768576279]
1839.1G68576279K52151k12402p88040K20108J00174l178559K188645J805420q9112
1847.8G68874664l78570k9984M79431O2790L03803l72162o2103K26211J14289N74035
1857.4G69792404p4158l5324M23890M30984n24139j80970j26037m04358J1139o11420
1867.1G68702011J8234p69043M5853J266556J084900Q14056m2648M1351o64444k24380
1876.7G70272446k2202j26419K87094n5847L62778L9062M94004J01318j14136N22537
1886.3G71760635P477M38080p77740j486054N77622Q42361n3177o2103M8523l49274
1896G70946350N25818M68140N78308L32641R8572j78375q88672q9951j57013l51181
1905.6G71284637l60031Q8806L55530N04151O09817Q9188Q27560l44314l74833j00097
$$ y = [768576279, 768828430, 768616028, 767827988, 768048096, 768148270, 764969711, 767158356, 768963776, 768874664, 768496094, 768466110, 768945541, 769008331, 769312134, 768939972, 768877869, 769104080, 769218369, 769792404, 769718246, 769682922, 770106812, 770537796, 770013657, 769832687, 769706650, 769302292, 769313431, 768702011, 768720245, 767951202, 767997055, 769263611, 770348511, 771162567, 771119919, 771161270, 770496826, 770272446, 770250244, 770123825, 770410919, 770355072, 770717850, 770756912, 771250916, 771352234, 771238098, 771760635, 771768112, 772206192, 771428452, 769942398, 770520020, 771362381, 771309204, 771247101, 771295624, 770946350, 771472168, 771940308, 772518616, 772851257, 772949829, 772771454, 771882782, 771792831, 771635818, 771284637, 770924606, 771013412, 771368942, 771873093, 772482910, 772572098, 773399658, 773055344, 772680511, 772580414]
1915.3G72580414l90625J73111j684494Q7356R04312K96784r4757q67386O99081R51996
1924.9G72655792M94614k58331n7831k96707m88205J00097l84140m7149l83225j5411
1934.6G71319504O23779M51965J69526j93711L78342K05994J46408j145630j564408
1943.2G70391769O79017N24292k15149j73264M85611L34930M66309L27683m2420j12228
1952.9G72666550l39127K3728m47159j77307M3411n4398J3809k9525M71649q7357K55127
1963.5G72339401M18015J35650j02005q77838j18942L90854L83301k96326l77121L0136
1973.1G71925125j52740o9275k0676L66516K77863J96075j24512j84860J22071k7924
1982.8G72307663P0343j60370j55258n36270k71454J75247J12915N79834k33688o07987
$$ y = [772580414, 772189789, 772362900, 770678406, 770765762, 771670074, 771966858, 771872101, 771004715, 771703796, 772655792, 773150406, 772892075, 772834244, 772537537, 772049332, 772149429, 771765289, 771718140, 771334915, 771319504, 771943283, 772395248, 772564774, 772371063, 772749405, 772955399, 773101807, 771956177, 770391769, 771070786, 771595078, 771379929, 771206665, 771692276, 772027206, 772493515, 772821198, 772778778, 772666550, 772327423, 772351151, 771903992, 771726685, 771770096, 771715698, 771729507, 771699982, 772171631, 772084274, 772339401, 772757416, 772893066, 772791061, 771913223, 771794281, 772185135, 772568436, 772272110, 771894989, 771925125, 771772385, 771703110, 771682434, 772048950, 772326813, 772522888, 772398376, 772213516, 772335587, 772307663, 772378006, 772217636, 772062378, 771526108, 771254654, 771429901, 771542816, 772122650, 771888962, 771280975]
1992.4G71280975L84674O87104R9716j32599Q4381j2741j19324o35833j50834n1727
2002.1G71433792j01776j33514m26026L09906J24893m1351k01492j95465m2496k25372
2011.7G70501099o9123l59573P1487J22834m26331n01633j0299O027j25885M42047
2021.3G69650650N7602J19705k12784n56793p2708J59454M9973r69544l01742K48794
2031G68172607k20642m43039j33133M69513k32849j79138k99606j23673K99378k60315
2040.6G67049103n02091k79312K05612m16793n1651M8446k18963L94287Q3694M66919
2050.3G66779251M9896l62930r6741J11389N7679m05808j25580m47921J12838L02887
2059.9G65974960J27335K09503m69131Q4610J61361L32184L99780k30712m16565k76795
$$ y = [771280975, 771665649, 772352753, 772452469, 772319870, 772404251, 772391510, 772272186, 771636353, 771485519, 771433792, 771332016, 771198502, 770772476, 771082382, 771207275, 771165924, 770964432, 770768967, 770726471, 770501099, 770431976, 770072403, 770143890, 770266724, 769840393, 769338760, 769328461, 769334488, 769208603, 769650650, 769708252, 769827957, 769615173, 769058380, 768985672, 769145126, 769195099, 768225555, 767923813, 768172607, 767951965, 767508926, 767375793, 767845306, 767612457, 767433319, 767133713, 767010040, 767309418, 767049103, 766547012, 766267700, 766473312, 766056519, 766004868, 766053314, 765834351, 766228638, 766312332, 766779251, 766829147, 766466217, 766369476, 766480865, 766538544, 766132736, 766007156, 765559235, 765672073, 765974960, 766102295, 766311798, 765842667, 765927277, 766088638, 766420822, 766820602, 766589890, 766173325, 765896530]
2069.6G65896530K7466k43683P5302J40305J17798L00750Q4687j67771j38626N87006
2079.2G66679764R1476l37829k45362k59475N5923j71204L2273O05240M57153l94897
2088.9G66513062m36402K4185L08228J53808k01263J00937q3466N5085R1934K90756
2098.5G66816864L49808k70767j61591j23901M88739J54113j14669R5977n10482J8692
2108.1G66742783J75399P6294j71203j19553K54593J35117J99890j068Q1787j84098
2117.8G67189941l2348J05133n6000n2032k22550J94245j35880j7090K05536J34277
2127.4G67313232N5695j2283L97415j17340k9984o28967o13709L73688L7308L29437
2137.1G67104492K75421M12140L64228P7819p2097k73667o1798n29861j86081k15988
$$ y = [765896530, 765923996, 765680313, 765755615, 765895920, 766013718, 766314468, 766399155, 766231384, 766092758, 766679764, 766771240, 766433411, 766188049, 765928574, 765984497, 765813293, 765845566, 766450806, 766907959, 766513062, 766076660, 766100845, 766409073, 766562881, 766361618, 766462555, 766379089, 766434174, 766526108, 766816864, 767166672, 766895905, 766734314, 766610413, 767099152, 767253265, 767138596, 767234573, 766724091, 766742783, 766918182, 766994476, 766823273, 766703720, 766958313, 767093430, 767293320, 767292252, 767374039, 767189941, 767157593, 767262726, 767206726, 767154694, 766932144, 767126389, 766990509, 766973419, 767178955, 767313232, 767368927, 767356644, 767754059, 767636719, 767606735, 766977768, 766364059, 766737747, 766775055, 767104492, 767379913, 767792053, 768156281, 768234100, 768162003, 767888336, 767826538, 767296677, 767110596, 766894608]
2146.7G66894608j22147M03824M4937K64664K76565J27487k1972j03760m6005L16467
2156.4G68034668J3123m17328K09427l0594J41525M53720M55246J84250q9646K08970
2166G69163361k17133J30081j38473l80783K68325J00708l967k37961J92871N75943
2175.6G69452972K97547J38702M93164K49176l00140J02005n16358k31170N72357K70615
2185.3G70528870J91345J97906N02549L21044P2403K17362L91159k70844n27420J84021
2194.9G71808395r1781j70288M1275M40368K66495k02560J83410M64096M65546P3853
2204.6G73278809P0114l28217l63159r7122j13068N19104L33328L71781K38190K1514
2214.2G73931274Q9112J2588K80152l43857l65448K03552L68881J02616P63R3231M196
$$ y = [766894608, 766772461, 767176285, 767221222, 767485886, 767762451, 767889938, 767867966, 767764206, 767718201, 768034668, 768047791, 767630463, 767839890, 767809296, 767950821, 768404541, 768859787, 769044037, 768954391, 769163361, 768946228, 769076309, 768937836, 768557053, 768825378, 768926086, 768922119, 768684158, 768877029, 769452972, 769750519, 769889221, 770382385, 770631561, 770331421, 770433426, 769917068, 769685898, 770258255, 770528870, 770720215, 770918121, 771420670, 771741714, 771814117, 772031479, 772422638, 772151794, 771624374, 771808395, 771716614, 771546326, 771587601, 772027969, 772294464, 772091904, 772275314, 772739410, 773204956, 773278809, 773348923, 773020706, 772657547, 772560425, 772447357, 772966461, 773299789, 773671570, 773909760, 773931274, 774020386, 774032974, 774313126, 773969269, 773603821, 773807373, 774176254, 774278870, 774279633, 774372864, 774377060]
2224.8G74377060N27649K44064p0038j08719J7090N8899l58276r6283j66550O0807
2234.5G74485703J12991k7008J63269L17383M82635J94168J43738k79312k61231j81121
2244.1G75151215j53046k04849m28315O20499M09088J2741K14463L11279M25568K23083
2253.8G76581726J43051q50296n81436j02005l30048n9967J92795L19443M8370O12336
2263.4G75973969L95278J56403J85471O4621Q6669q00552k13699K0981r0256N3406
2273G75832291L6544L02964J75018O99615N8518k63062j56784j37176j68915o59027
2282.7G75719986J77460j86920J23367M04281O1264O69709M0283k8153j41220J34430
2292.3G76974487k1591l13721J54801m23126J54800r079k74429K94113M09851M43268
$$ y = [774377060, 774904709, 775148773, 775078735, 774970016, 774987106, 775046005, 774687729, 774591446, 774424896, 774485703, 774598694, 774571686, 774734955, 775052338, 775534973, 775729141, 775872879, 775593567, 775332336, 775151215, 774998169, 774793320, 774365005, 774985504, 775394592, 775407333, 775621796, 775933075, 776358643, 776581726, 776724777, 775874481, 775293045, 775191040, 774860992, 774801025, 774993820, 775313263, 775361633, 775973969, 776369247, 776525650, 776711121, 776775742, 776862411, 776061859, 775848160, 775869141, 775778885, 775832291, 775868835, 776171799, 776346817, 777046432, 777104950, 776841888, 776685104, 776547928, 776379013, 775719986, 775897446, 775710526, 775833893, 776238174, 776299438, 776969147, 777009430, 776981277, 776840057, 776974487, 776952896, 776639175, 776793976, 776370850, 776525650, 776516571, 776242142, 776536255, 776946106, 777389374]
2302G77389374l4180J54724J28098K19650L14331l39661o27517K5711P82089O05316
2311.6G78617935N47028K70233K1820l53775k42920o0196j43356M50210l3035J69296
2321.3G79243240k84958m87823L39508K94647R16443N85327P16782M40063l57360j063996
2330.9G80341873q33053M31518k21405J47629L60718M80499J34811r7503P11670K4185
2340.6G81480942p1182l281K01263p35016j451034j008072j137009n57861N54276J670227
2350.2G78943253O61468r613M72336K93045J88599p02363R87397K80761j075668l76663
2359.8G79662552N23376N23835J29928R72061j205215l95737j73340j177673p27463
2368.5G78132324o26602m80957k032166j04293P02667p03888m10767n10711k42615
$$ y = [777389374, 777355194, 777509918, 777638016, 777857666, 778171997, 777832336, 777204819, 777230530, 778012619, 778617935, 779164963, 779435196, 779457016, 779103241, 778860321, 778800125, 778656769, 779106979, 779073944, 779243240, 778958282, 778470459, 778809967, 779104614, 780021057, 780606384, 781323166, 781763229, 781405869, 780341873, 779508820, 779940338, 779718933, 779866562, 780227280, 780707779, 780842590, 780745087, 781456757, 781480942, 781409760, 781406479, 781607742, 780872726, 779421692, 778413620, 777276611, 776718750, 777273026, 778943253, 779604721, 779595108, 780067444, 780360489, 780549088, 779846725, 780834122, 781114883, 780039215, 779662552, 780185928, 780709763, 780839691, 781811752, 780606537, 780210800, 780037460, 778859787, 778132324, 777505722, 777024765, 774992599, 774888306, 775590973, 774887085, 774476318, 773965607, 773722992]
2377.2G73722992m20837o62156p81860m75998j67618l13568m83475n97991R8495j8921
2386.8G69899063k79922M1198Q7433j70898l00446M1886l53089l62472n47409n10559
2396.5G67544785M18777J54037J7701J28708j67237m81262l04642J90201l6087m89960
2406.1G66975021m01916k44599l23715J41907N8136j14517k5635k46201M4022k11487
2415.8G65651016n84717p08389m43420j61209j40305J48316j59684j33590l1281J61896
2425.4G63598633L58352k18277o42623o43082l29971l75138k77557m06036o07834k12479
2435.1G60243988J71433M20150L1662k38266l79257k45438k80075m35562k77252n69076
2444.7G58442307l71628n38025m31366o3400n1346L26614J86844L5172l21885k68707
$$ y = [773722992, 773302155, 772639999, 771858139, 771382141, 771214523, 770900955, 770417480, 769819489, 769917984, 769899063, 769619141, 769660339, 769747772, 769576874, 769276428, 769318314, 768965225, 768602753, 768055344, 767544785, 767963562, 768117599, 768135300, 768264008, 768096771, 767615509, 767310867, 767501068, 767464981, 766975021, 766573105, 766328506, 766004791, 766146698, 766204834, 766090317, 766064682, 765818481, 765862503, 765651016, 765066299, 764357910, 763914490, 763753281, 763612976, 763761292, 763601608, 763468018, 763436737, 763598633, 763956985, 763738708, 763096085, 762453003, 762123032, 761747894, 761470337, 761064301, 760456467, 760243988, 760415421, 760835571, 760867233, 760628967, 760249710, 760004272, 759724197, 759288635, 759011383, 758442307, 758070679, 757532654, 757101288, 757037888, 756986542, 757313156, 757500000, 757535172, 757213287, 756944580]
2454.3G56944580l35770p08694q85925r57718Q1787M00925K94799n9280l95813j9302
2464G54359589L7765k18124r86939n19256L967l43781o55517m72565L54920l6698j9455
2474.6G51503906K58332P2860p8659k59323k47421p74689o29959n69153m09241p5531
2484.2G48791122k71682J24206L53165L20663j27105l62397k53295j08719k3423l75595
2493.9G48066940m83627o37360n18264k52152K64130M10690O8893N7984J449j144q27408
2504.5G46150131r59625m13361K137K28500m38538r5062K56958K54669J28556k09961
2514.1G44904404n4398j91116n66330o82526J04218o3935m96597j33667j43127N0354
2523.8G42727280n0965J08109r3155n55954o90689m37851J8463l49731k38877l98254
$$ y = [756944580, 756608810, 755900116, 755014191, 754056473, 754138260, 754539185, 754833984, 754774704, 754378891, 754359589, 754397354, 754179230, 753192291, 752673035, 752677002, 752333221, 751677704, 751205139, 751560059, 751523361, 751503906, 751762238, 751835098, 751756439, 751497116, 751249695, 750475006, 749845047, 749275894, 748866653, 748791122, 748519440, 748643646, 748996811, 749317474, 749190369, 748827972, 748574677, 748465958, 748442535, 748066940, 747583313, 746945953, 746427689, 746175537, 746439667, 746850357, 746919250, 746977234, 746978683, 746977539, 746150131, 745190506, 744777145, 744779282, 745007782, 744569244, 744474182, 744731140, 744985809, 745114365, 744904404, 744850006, 744658890, 744092560, 743410034, 743514252, 743450317, 742953720, 742820053, 742676926, 742727280, 742676315, 742784424, 742691269, 742135315, 741444626, 741006775, 741025238, 740675507, 740436630, 740038376]
2533.4G40038376l67127N3482K67106M27322k18124l24555m86755l33557j27259m73022
2543.1G38455887n46570o67572j95770n1422l4562P3700J34964j04599m39300r1019
2552.7G36533737l88031m74243n94635p19299m42353l06778q6364j3886M38004J13907
2562.4G34060059q1177m3869m27933l46756m75845m24576p55539n64270k40555l49655
2572G30349884J14670J35422J75781M0741o3324j61057k79770n19867j046905n96771
2581.6G28148804k72217r8724Q5449N111j10702l40424k65121O866J36490l13644l13797
2592.2G26668091k69470l48816l42942n66635j45645k14615j90811J37787P7362j25656
2601.9G24678650l59955k02637m06570l95126m06418n19104m49677m62417j53580j90964
$$ y = [740038376, 739671249, 739724731, 739991837, 740419159, 740201035, 739876480, 739389725, 739056168, 738928909, 738455887, 737909317, 737241745, 737045975, 736994553, 736959991, 737033691, 737168655, 737064056, 736624756, 736533737, 736145706, 735671463, 735076828, 734357529, 733915176, 733608398, 733522034, 733508148, 733946152, 734060059, 733978882, 733935013, 733507080, 733160324, 732684479, 732259903, 731504364, 730940094, 730699539, 730349884, 730464554, 730599976, 730775757, 730816498, 730753174, 730592117, 730312347, 729792480, 728745575, 728148804, 727876587, 727777863, 727863312, 727868423, 727757721, 727417297, 727152176, 727159042, 727295532, 726981888, 726668091, 726398621, 726049805, 725706863, 725140228, 724994583, 724779968, 724589157, 724726944, 724804306, 724678650, 724318695, 724116058, 723709488, 723314362, 722907944, 722388840, 721939163, 721476746, 721323166, 721132202]
2611.5G21132202k39868j7929N3635m35105l74451q6288n60074n44662p69196p65686
2621.2G17392578l25470O2637J45875n40467m66156J99204r8343j045532p62558l47290
2630.8G14214478l45231l69491q03986l86886l69110j95542J52970k12327l92150q03376
2640.5G10489349o45370m19235m57917n59845m49142k65198l85055m64020q24967k61688
2650.1G05756912J67694j08795m84161q12149o42929m77829l05024p66448k37961q4000
2659.8G02005310o44760j1520k07139l14636n80978n01175k41318o34537n47485p95746
2669.4F97526016l09982L4409N2795l20053r45816l05252O408J4115k01950l61786
2679F95188904o95648j002579o18744l39890j49612l19519p0572j55182j01776Q8501
$$ y = [721132202, 720892334, 720874405, 720928040, 720492935, 720118484, 720032196, 719472122, 718927460, 718158264, 717392578, 717067108, 717129745, 717275620, 716735153, 716268997, 716468201, 716369858, 715324326, 714561768, 714214478, 713869247, 713499756, 712695770, 712308884, 711939774, 711744232, 711897202, 711684875, 711292725, 710489349, 709843979, 709424744, 708966827, 708406982, 707957840, 707692642, 707307587, 706843567, 706018600, 705756912, 705924606, 705815811, 705331650, 704519501, 703876572, 703398743, 703093719, 702327271, 702089310, 702005310, 701360550, 701349030, 701141891, 700827255, 700246277, 699745102, 699503784, 698869247, 698321762, 697526016, 697216034, 697250443, 697303238, 696983185, 696037369, 695732117, 695738525, 695752640, 695550690, 695188904, 694493256, 693490677, 692871933, 692532043, 692382431, 692062912, 691992340, 691837158, 691735382, 691823883]
2688.7F91823883n56793p25861o96106k1972j56098p15027k98614q5373j27487n15976
2698.3F87924576k75421k30332l93982l34854n41229p73621q29773j13220k19955n21851
2708F83690338m90341k74582k212o17829o68182p50199l79028J08948j81046l20434
2717.6F80115433o71463m27323l56292k27662p5836m94842J068R4299o88019p15408
2727.3F76553955j90811k23312l39280l95507p68433k78549M07791l16086n64117K40554
2736.9F74126205j53808o92673o31409l64608j80588m14124j31683l10898n39245k39029
2746.5F70468140j45569j14441q0567j4038j91726k63291p65762p40128k60391l04184
2756.2F67588043k29111o15005k11487l0823k43988J51062k30789l48358k73819k59476
$$ y = [691823883, 691267090, 690541229, 689845123, 689823151, 689667053, 688952026, 688653412, 688568039, 688440552, 687924576, 687649155, 687418823, 687024841, 686689987, 686148758, 685375137, 684545364, 684432144, 684212189, 683690338, 683199997, 682925415, 682923203, 682305374, 681637192, 680886993, 680507965, 680616913, 680435867, 680115433, 679443970, 679016647, 678660355, 678432693, 678356857, 677862015, 677863083, 677957382, 677269363, 676553955, 676363144, 676139832, 675800552, 675405045, 674636612, 674358063, 674765854, 674449768, 673885651, 674126205, 673972397, 673279724, 672648315, 672283707, 672103119, 671688995, 671557312, 671246414, 670707169, 670468140, 670322571, 670208130, 670127563, 670113525, 669921799, 669658508, 668892746, 668152618, 667892227, 667588043, 667358932, 666743927, 666532440, 666501617, 666257629, 666408691, 666177902, 665829544, 665555725, 665296249]
2765.8F65296249l31421o07833n84107k11944K3040j09176K32544Q8424l48358o46515
2775.5F62800903q36715p92466p22045l09449m54483m20990l81393k34146P5454k88467
2785.1F58436203l83224n99595j85470j91117r77401r24759n83878n49087p01294j93558
2794.8F53146820n18036l97949J28403q38166j060104r54437n62287l63693p47299
2803.4F47833252r52988j004410n83496o45217n19867m31061o33240j038895j085510
2812.1F40938568l56750q53653j080094j009178j201057p14684o93741p93228j011276
2820.8F33224907r23958m37050q81576j332856q73107o51856j048317j327324j394195
2829.5F24354668j351090j056557o20307p44172j215705j594391j433449r41391r60007
$$ y = [665296249, 664964828, 664356995, 663772888, 663560944, 663583984, 663474808, 663707352, 663795776, 663447418, 662800903, 661964188, 661171722, 660449677, 660140228, 659685745, 659264755, 658883362, 658649216, 658724670, 658436203, 658052979, 657453384, 657267914, 657076797, 656099396, 655174637, 654590759, 654041672, 653340378, 653146820, 652628784, 652230835, 652359238, 651521072, 650460968, 649506531, 648944244, 648580551, 647833252, 646880264, 645875854, 645292358, 644647141, 644127274, 643696213, 643062973, 642024078, 640938568, 640581818, 639728165, 638648071, 637638893, 636437836, 635723152, 635029411, 634236183, 633224907, 632300949, 631863899, 630982323, 629649467, 628776360, 628124504, 627076187, 625748863, 624354668, 623003578, 621947021, 621326714, 620582542, 619366837, 617772446, 616338997, 615397606, 614437599]
2838.2F14437599j197014k005119k262802j724434j385498j370888j938400j910362
2845.9F00643082k023506k092438j860848j990509j481933j572228j771850j150513
2853.6E86699257p63092j081581j216240l08876J57547j95503q06427j166687j147156
2862.3E80171242j091919j341553j613808j401100j605987j781349j825295j932945
2870E67577286j592331j308251j478042j931801k058640j851310j616249k057534k076072
2878.7E51607056j599083j763878j414375j206780q18329o30417j398430j395225m91257
2887.3E40889282M7798p93724r37042o55632p41081l49312l20282J63956j19896o45714
2897E36538353m18930n24788l54271j69105k02828q91037j164818q86573n76973k31858
$$ y = [614437599, 613240585, 611235466, 608972664, 607248230, 605862732, 604491844, 602553444, 600643082, 598619576, 596527138, 594666290, 592675781, 591193848, 589621620, 587849770, 586699257, 585936165, 584854584, 583638344, 583329468, 583487015, 583291512, 582485085, 581318398, 580171242, 579079323, 577737770, 576123962, 574722862, 573116875, 571335526, 569510231, 567577286, 565984955, 564676704, 563198662, 561266861, 559208221, 557356911, 555740662, 553683128, 551607056, 550007973, 548244095, 546829720, 545622940, 544804611, 544174194, 542775764, 541380539, 540889282, 540937080, 540143356, 539206314, 538550682, 537809601, 537460289, 537140007, 537303963, 537184067, 536538353, 536119423, 535594635, 535240364, 535071259, 534868431, 533977394, 532812576, 531926003, 531349030, 531117172]
2906.6E31117172p54432j078263j223068j232147j371536j632500j509857j814423
2914.3E20500946k104225k011299j489144j516037j573295j359062j781273j561318
2922.1E07105293j130752q27408o17714n19676m79775p68432p80373m07715J26000
2930.7E01699448Q27369J488915M93240K05307J449509J422119J803932K142945J792411
2939.4E13325195J564789J952896K985039K748604J817856J934433K645111K200508
2947.1E31174431K049751K686577K591934K196465J785736K067528K136230J894875
2954.8E48583527J785736K032051K409706K237015K454986J962815J567154J554412
2962.6E64587402J584359K175407J578674J328469J881218J735687J576805J676483
$$ y = [531117172, 530362740, 529284477, 528061409, 526829262, 525457726, 523825226, 522315369, 520500946, 518396721, 516385422, 514896278, 513380241, 511806946, 510447884, 508666611, 507105293, 505974541, 505147133, 504529419, 504009743, 503529968, 502761536, 501981163, 501573448, 501699448, 502526817, 504015732, 504508972, 504714279, 506163788, 507585907, 509389839, 511532784, 513325195, 514889984, 516842880, 519827919, 522576523, 524394379, 526328812, 528973923, 531174431, 533224182, 535910759, 538502693, 540699158, 542484894, 544552422, 546688652, 548583527, 550369263, 552401314, 554811020, 557048035, 559503021, 561465836, 563032990, 564587402, 566171761, 568347168, 569925842, 571254311, 573135529, 574871216, 576448021, 578124504]
2970.3E78124504J593514J375045J357918J695748J930427J443100J133270J096039
2978E89749565J264267J545105J249237J047058J390572J451225J306839J685181J034775
2986.7F01723824O34040P90520J51520L25851N40238R97238P24945K28996N28679L56636
2996.3F07002487Q16651K75802m387J84746k84195J07956L2959k35176n66940k14043
3006F07115860J37176j39274K19536p7629m45099n79911p38143n99060m23966p46880
3015.6F03722610r51385n88608p57026m98810l09983l40004l37944p80639r50394r62868
3025.2E97244949j018867j487999r61037n18837q89663l63274n95360r79347q65784
3033.9E89564781r74388q46062j014022j288949j092300j295662j423683q70628p74384
$$ y = [578124504, 579718018, 581093063, 582450981, 584146729, 586077156, 587520256, 588653526, 589749565, 591013832, 592558937, 593808174, 594855232, 596245804, 597697029, 599003868, 600689049, 601723824, 602357864, 603148384, 603299904, 603625755, 604165993, 605163231, 605888176, 606117172, 606645851, 607002487, 607819138, 608094940, 608090553, 608275299, 607991104, 608099060, 608132019, 607896843, 607329903, 607115860, 607253036, 607113762, 607333298, 607255669, 606810570, 606230659, 605492516, 604893456, 604469490, 603722610, 602771225, 602182617, 601425591, 600926781, 600616798, 600276794, 599938850, 599158211, 598207817, 597244949, 596226082, 594738083, 593777046, 593258209, 592368546, 592005272, 591409912, 590430565, 589564781, 588590393, 587744331, 586730309, 585441360, 584349060, 583053398, 581629715, 580759087, 579984703]
3042.6E79984703n45006r98573j137276o08101j344871j100769q58307j182556j256600
3051.3E70952644j335563j152878j617966j421203j119500q81996m80194o93474o40907
3060E61608963r78508j548157j530266j118431j148033j219406j399689j650085q59222
3068.6E50157166m09852m65431o79245r90906j465110j435700r86595j236114j006813
3077.3E41481400j179581j104050q24585j546325j317406r58176r97238q53424p38373
3086E31962242j148682j580734j442566j277809j173591j252404j026420j003228q04100
3094.7E21252708r25293j295509q87756j228600j222915j138993j155662j115761j176109
3103.4E11106110q79517j575546j279488o94580j177216j289405q26187o92902j359177
$$ y = [579984703, 579439697, 578441124, 577303848, 576695747, 575350876, 574250107, 573391800, 572209244, 570952644, 569617081, 568464203, 566846237, 565425034, 564305534, 563423538, 562943344, 562249870, 561608963, 560630455, 559082298, 557552032, 556433601, 555285568, 554066162, 552666473, 551016388, 550157166, 549747314, 549281883, 548602638, 547611732, 546146622, 544710922, 543724327, 542488213, 541481400, 540301819, 539197769, 538373184, 536826859, 535509453, 534551277, 533554039, 532700615, 531962242, 530813560, 529232826, 527790260, 526512451, 525338860, 524086456, 523060036, 522056808, 521252708, 520327415, 519031906, 518144150, 516915550, 515692635, 514553642, 513397980, 512282219, 511106110, 510226593, 508651047, 507371559, 506676979, 505499763, 504210358, 503384171, 502691269, 501332092]
3112E01332092q65135r20792j594848j514893j173782o73218j204796j197281r27963
3120.7D91259384j027870j229019j621018j056556p11060j356583j875228r23539o19888
3129.4D80838623j102905r97658j305466r79347o88286q47511j309395j503105j085281
3138.1D71019669j385765j596718j533394p86133m56886j062813j157875j382561j210098
3146.8D60447426o49033q17337j382408j417389j291885r75685q21343j311645j009980
3155.4D50770721o23931o27175r81216j429863j069298r77860j371841j441727j185646
3164.1D41062164j042633r13009j162911j301956q14514m14963o07681j356583j333771
3172.8D32114143j563339j291656m62876j114502j357040j253357o29234m05808j096115
$$ y = [501332092, 500466957, 499546165, 497951317, 496436424, 495262642, 494589424, 493384628, 492187347, 491259384, 490231514, 489002495, 487381477, 486324921, 485613861, 484257278, 482382050, 481458511, 480838623, 479735718, 478738060, 477432594, 476453247, 475764961, 474917450, 473608055, 472104950, 471019669, 469633904, 468037186, 466503792, 465717659, 465260773, 464197960, 463040085, 461657524, 460447426, 459798393, 458981056, 457598648, 456181259, 454889374, 453913689, 453092346, 451780701, 450770721, 450146790, 449519615, 448538399, 447108536, 446039238, 445061378, 443689537, 442247810, 441062164, 440019531, 439106522, 437943611, 436641655, 435827141, 435412178, 434804497, 433447914, 432114143, 430550804, 429259148, 428796272, 427681770, 426324730, 425071373, 424442139, 424036331, 422940216]
3181.5D22940216p54394o53611j070709j219253r60732q16307o25038q54798j606826
3190.1D14378548j378708j077881q17070o59371q51669j039696p84530o88439j016693
3198.8D06064491o10885j062813j206856p81746j131515j194916q39920n55229j094284
3207.5C97586327m84963k83966j156540p75337q66280r68704r82017o89507o03104
3216.2C90775909j033248o67878n17654q55332j019248l15133n08766j064796p43485
3224.9C84050369r83925q45604n30700m52194o91071r36012j061211j075325o29654
3233.5C76844673o04858k54555l81737j252556j287231q07533o96373p68166o47201
3242.2C70144463n95665k53296n35317q15391p88231r84345n80558m33999o44989q50563
$$ y = [422940216, 422185822, 421532211, 420461502, 419242249, 418281517, 417465210, 416840172, 415985374, 414378548, 412999840, 411921959, 411104889, 410445518, 409593849, 408554153, 407769623, 407081184, 406064491, 405453606, 404390793, 403183937, 402402191, 401270676, 400075760, 399235840, 398680611, 397586327, 397101364, 396817398, 395660858, 394885521, 394019241, 393050537, 392068520, 391379013, 390775909, 389742661, 389074783, 388557129, 387701797, 386682549, 386367416, 385858650, 384793854, 384050369, 383066444, 382220840, 381690140, 381237946, 380546875, 379610863, 378549652, 377474327, 376844673, 376239815, 375985260, 375603523, 374350967, 373063736, 372256203, 371559830, 370791664, 370144463, 369548798, 369295502, 368760185, 367944794, 367156563, 366172218, 365591660, 365157661, 364512672, 363662109]
3251.9C63662109n25016o09284o30112n83114r79157j35040m73556o71425l78647j036797
3261.5C57639961q10508o55709k75383l46870o35796o11381o55861n34897m33083l8490
3271.2C52641983n32989p13196n08766l26844o21605j261787m81453l92113m13551
3279.8C47389679m70200m58488l30544o70166k73323o10962o68449o91986m56276R6817
3289.5C42856102l90472n19257p66525m93660o23436n96047j59111o18057m98505l13034
3299.1C37877998k3994o86417r16557k80418o35949k55851k24457l96576l06091p38335
3308.8C33413353p27005m50020n84755o30951k77481n16052q32672n84946j22948l75289
3318.4C28311234p08848p50579q29087J2360j51520p98759p11746n81589n64766o65512
$$ y = [363662109, 363137093, 362527809, 361897697, 361314583, 360335426, 360200386, 359726830, 359055405, 358676758, 357639961, 356829453, 356173744, 355898361, 355551491, 354915695, 354304314, 353648453, 353113556, 352680473, 352641983, 352108994, 351395798, 350887032, 350560188, 349938583, 348676796, 348195343, 347803230, 347389679, 346919479, 346460991, 346130447, 345460281, 345186958, 344575996, 343907547, 343215561, 342759285, 342856102, 342465630, 341946373, 341179848, 340686188, 340062752, 339466705, 339307594, 338689537, 338191032, 337877998, 337854004, 337167587, 336251030, 335970612, 335334663, 335078812, 334854355, 334457779, 334151688, 333413353, 332686348, 332236328, 331651573, 331020622, 330743141, 330227089, 329394417, 328809471, 328686523, 328311234, 327602386, 326851807, 326022720, 326035080, 325883560, 325084801, 324373055, 323791466, 323226700, 322561188]
3328.1C22561188j89896p30858r73739k53182K0104j60485q19587m06990k92244q05741
3337.7C17948570r85012j015816o85081p23953l49198j21021n47466m64421k84042
3346.4C12772560p25937q50410o96354o80771l53470m46358l27816l02009l78361l69358
3356C07641716q03242l32679j71624q57238j158333q50468n48878k20794j55011j010074
3365.7C01533375q57945k34050n7812j73607n45654r33953p83844L6812k94952l95584
3375.3B97292786o59180r05228j13773k19250k12555m38747k99530k11449n96771k99587
3384.9B93336716m29802j32351n33753p00054K77558N2375n82237o00262k31056j63688
3394.6B90293446O7062J33305m71096p46651k34718J63898k02084k99244k6912o6033
$$ y = [322561188, 322371292, 321640434, 320666695, 320413513, 320433617, 320273132, 319453545, 319046555, 318754311, 317948570, 316963558, 315947742, 315262661, 314538708, 314189510, 314068489, 313521023, 313056602, 312772560, 312046623, 311196213, 310499859, 309819088, 309465618, 309019260, 308691444, 308389435, 308011074, 307641716, 306838474, 306505795, 306334171, 305476933, 304318600, 303468132, 302919254, 302698460, 302543449, 301533375, 300675430, 300441380, 300383568, 300209961, 299664307, 298730354, 297946510, 297983322, 297688370, 297292786, 296633606, 295728378, 295614605, 295395355, 295182800, 294744053, 294444523, 294233074, 293636303, 293336716, 292906914, 292774563, 292240810, 291540756, 291818314, 291870689, 291288452, 290688190, 290457134, 290293446, 290360508, 290493813, 290022717, 289276066, 289041348, 289205246, 289003162, 288703918, 288677006, 288610973]
3404.2B88610973m80384O1244L89863k50512j07746k08511k77729j61801K6818j9398
3413.9B87582817n15118j70917K93274K92950J47895K90394j54610j25350J57489j03798
3423.5B87695026L39623j4858J73854j51844m10823O64940J26991k45362k08492L38497
3433.2B88307552L97950R746M69589L89099N32723N7602K70061Q95977N01595R9182
3442.8B91931076j56574K86236M81147M58165Q3313O77146J010647M98829P84264L07636
3452.5B96361885J09158L1986K62050Q73147N49678M97609O63547Q04501N85346N95798
3462.1C01334705L20835N01786Q82892M58355N95894R3117J94092P67803J025009P81345
3471.7C06955833N10407J090870N17959O59180J036930Q26855N81283M27418J011696
$$ y = [288610973, 288130589, 288191833, 288581696, 288331184, 288223438, 288014927, 287737198, 287575397, 287602215, 287582817, 287067699, 286896782, 287190056, 287483006, 287630901, 287921295, 287766685, 287641335, 287798824, 287695026, 288034649, 288019791, 288193645, 288041801, 287630978, 288295918, 288422909, 288177547, 287969055, 288307552, 288705502, 288715248, 289184837, 289573936, 290106659, 290164261, 290434322, 291330299, 291831894, 291931076, 291774502, 292060738, 292541885, 293000050, 293083363, 293760509, 294771156, 295269985, 296054249, 296361885, 296471043, 296503029, 296765079, 297638226, 298187904, 298685513, 299349060, 300153561, 300738907, 301334705, 301655540, 302157326, 303040218, 303498573, 304094467, 304187584, 304381676, 305149479, 306174488, 306955833, 307466240, 308557110, 309075069, 309734249, 310771179, 311598034, 312179317, 312606735, 313618431]
3480.4C13618431P39803M69342L31859J238175J402263N84107P47413J57700J068764
3489.1C20357857J566658O98967M05845N91774J130715R32579Q80356N32417N60570
3497.8C27657738J200294J437264J073723O71577R26514P37953O78863L62549P84569
3506.5C35531044J495438J563110J128311P51610J274910J44539O14509J371270J209564
3515.1C45084305J981735J051941N74989L94554J042252J529770P46193O20651L06358
3523.8C53332748J466561J706505R02557P14798J097755J566162J394463J193390Q76350
3532.5C64251289J463013J442452J306228P53327M66423J570243J298104J260147Q91266
3541.2C74702492Q92334J222992J637535J184006O68220K173729J281281K044334J348419
$$ y = [313618431, 314358234, 314827576, 315159435, 316397610, 317799873, 318383980, 319131393, 319289093, 320357857, 321924515, 322623482, 323029327, 323621101, 324751816, 325684395, 326564751, 327097168, 327657738, 328858032, 330295296, 331369019, 332040596, 332967110, 333705063, 334383926, 334746475, 335531044, 337026482, 338589592, 339717903, 340469513, 341744423, 341888962, 342503471, 343874741, 345084305, 347066040, 348117981, 348692970, 349087524, 350129776, 351659546, 352405739, 353026390, 353332748, 354799309, 356505814, 357408371, 358123169, 359220924, 360787086, 362181549, 363374939, 364251289, 365714302, 367156754, 368462982, 369216309, 369682732, 371252975, 372551079, 373811226, 374702492, 375594826, 376817818, 378455353, 379639359, 380307579, 382481308, 383762589, 385806923, 387155342]
3549.9C87155342J087265J795464j24665K769547K027893J282959J934433Q89892K456017
3558.5D01274147J735306J047401J285324K703896J980171Q52623L287010J70403J516571
3567.2D15852852K270050M64401K785912J677589K340660K347031J704140J466903
3574.9D30909538J854019K699128J991043K773437K239037J603393J839333K231560
3582.6D48140488K136840J501427M058914K359467l04871J934738M48761L360558L835983
3591.3D67472305L210411J859436J345673L564568N69915K569428L673057J045876
3599D85310669L262215K239036J480827K245293K033386K780342L480988L310738l4676
3607.7E06108818L023377N53970K17323P014351J240540j038590M921723J333503M035836
$$ y = [387155342, 388242607, 390038071, 389913406, 392682953, 394710846, 395993805, 397928238, 398818130, 401274147, 403009453, 404056854, 405342178, 408046074, 410026245, 410878868, 414165878, 414336281, 415852852, 418122902, 418587303, 421373215, 423050804, 425391464, 427738495, 429442635, 430909538, 432763557, 435462685, 437453728, 440227165, 442466202, 444069595, 445908928, 448140488, 450277328, 451778755, 455837669, 458197136, 457892265, 459827003, 460275764, 463636322, 467472305, 470682716, 472542152, 473887825, 477452393, 478022308, 480591736, 484264793, 485310669, 488572884, 490811920, 492292747, 494538040, 496571426, 499351768, 502832756, 506143494, 506108818, 509132195, 509686165, 509903488, 516917839, 518158379, 517119789, 522041512, 523375015, 527410851]
3616.4E27410851L614578j450K460785O04096Q91838L772964L318024J995544K895851
3625.1E46963081K956162K816505N685387j515656q781356O058731O100769M853592
3632.8E65137215J148567o63338K529259K735138K198486O07262J109123K650452K683067
3641.5E80135231J115265O49605K829055M340477N802041j167527l509102N798340
3649.2E95993385q5411l466415N88760N490685M205780L271217L503952o241150K400208
3657.9F05661011M890823J243477J524620Q77876J952553J184921J432038J630134
3665.6F20397453P72477L936920K282066j936684j806335l577690M804115Q161240
3673.3F33033562P200432l334237j6220016N231018Q142471M300766j711349P76710
$$ y = [527410851, 531025429, 531023979, 533484764, 534088860, 534980698, 538753662, 542071686, 544067230, 546963081, 549919243, 552735748, 558421135, 556905479, 548124123, 554182854, 560283623, 565137215, 566285782, 565622444, 568151703, 570886841, 573085327, 573692589, 574801712, 577452164, 580135231, 581250496, 581900101, 584729156, 589069633, 594871674, 593704147, 590195045, 595993385, 595907974, 592441559, 593030319, 598521004, 602726784, 605998001, 609501953, 603260803, 605661011, 610551834, 611795311, 613319931, 614197807, 616150360, 617335281, 618767319, 620397453, 621169930, 625106850, 627388916, 625452232, 623645897, 620068207, 624872322, 633033562, 640233994, 636899757, 620679741, 625910759, 634053230, 638353996, 636642647, 637419357]
3681F37419357L206559J395263R48334K2964J46256M684296N120010j0013809k201157
3689.7F40728073P788696l256912J87302M524841J016007K137451R02633p00073Q34427
3698.4F54162445P30286K567138K430497m711686j329727M592896J457519j0071R86710
3707F60876007K960587L255462p403793K462387L747787j0407714M374923M413834
3714.8F64279480Q44116N48630J664276J175842k180404J656265N045547l419723m204559
3723.4F65409470M582443J363067J41068j869583L72543L790589Q50067N035934k396622
3732.1F77278976p456665Q098679R55811q553238L08227K115326L39737K910309L278885
3740.8F79276047l492050L051986J0968704o934280j6134720P086258M778595O133423
$$ y = [637419357, 640625916, 642021179, 642969513, 642992477, 643138733, 647823029, 652943039, 642929230, 640728073, 648516769, 645259857, 645447159, 649972000, 650988007, 653125458, 654028091, 653328018, 654162445, 654892731, 657459869, 659890366, 655178680, 653848953, 658441849, 659899368, 659889297, 660876007, 663836594, 667092056, 659688263, 662150650, 665898437, 655490723, 659865646, 664279480, 665123596, 665672226, 667336502, 668512344, 666331940, 667988205, 673033752, 669614029, 665409470, 669991913, 671354980, 671496048, 669626465, 669999008, 673789597, 674639664, 679675598, 677278976, 669822311, 677920990, 678876801, 670323563, 670631790, 672747116, 673086853, 675997162, 679276047, 675783997, 678835983, 689804687, 682870407, 666735687, 673821945, 678600540, 684733963]
3748.5F84733963l590622j0342636J0724640m273834m216614O191101L920669K506867
3756.2F85653534m679871K824555M839935q207855j709061M503708K370682M93088
3763.9F86088715K973938k826310m222412L664170M979324K49176q341446J736908
3771.7F84302063K413177K9755J629105Q47473J247787O2943J678543o20422n216752
3780.3F86373672K720719J926422J265869J252289l318024j080169J523132J100769
3788F91764679N47790K52762J72959L11584Q36106j65711J216583K551270m168778
3796.7F93319244l240051L391953M698333N362473n726318j0058518K832947L460693
3804.4F94040756M702225L612518r054413k077941N153045J468277n99441Q40377R04923
$$ y = [684733963, 681143341, 670800705, 681525345, 677251511, 673034897, 679225998, 683146667, 685653534, 680973663, 683798218, 688638153, 680430298, 678721237, 683224945, 685595627, 686088715, 689062653, 686236343, 682013931, 685678101, 690657425, 690906601, 682565155, 684302063, 686715240, 686744995, 688374100, 689221573, 690469360, 690532303, 692210846, 691590424, 686373672, 689094391, 691020813, 692286682, 693538971, 690220947, 689140778, 690663910, 691764679, 692312469, 692565231, 692738190, 693049774, 693885880, 693720169, 694936752, 697488022, 693319244, 690079193, 693471146, 698169479, 703531952, 697805634, 687747116, 690580063, 694040756, 698742981, 702355499, 693301086, 691223145, 696376190, 697844467, 697245026, 698085403, 698990326]
3813.1F98990326J201248M235535k863770j2631912N132751N907898L796997O66047
3820.8G04435120j4418488J795883M929276K047271K964325J551438l219376k77405
3828.6F99808044J789170K412338Q44574p016983J714935N479203n033188J26037P738648
3837.2G07862778o602860l483276P077865m864578p65152N698090j779251l708039
3844.9F99435577J682282J659469R01032J827011j378708J374817N201035o924820
3852.7G03777695m96292q559571K254105Q143539j543274j226501J856689K017441
3860.4G06223831K420654m471969j79978N573426m293976m877548L700714N061111
3868.1G09156265M426422q022842o251450M237748M785614J643676q316650J808929
$$ y = [698990326, 700191574, 704427109, 701563339, 688931427, 694064178, 699972076, 703769073, 704435120, 690016632, 691812515, 696741791, 698789062, 701753387, 703304825, 700085449, 699808044, 701597214, 704009552, 704854126, 697837143, 699552078, 705031281, 699998093, 700124130, 707862778, 701259918, 697776642, 704854507, 699989929, 699224777, 704922867, 703143616, 699435577, 701117859, 702777328, 703678360, 705505371, 704126663, 705501480, 710702515, 703777695, 703281403, 694721832, 696975937, 705119476, 703576202, 702349701, 704206390, 706223831, 708644485, 704172516, 703992538, 709565964, 705271988, 700394440, 704095154, 709156265, 713582687, 705559845, 699308395, 703546143, 708331757, 709975433, 701658783, 703467712]
3875.8G03467712M390946K78931J604614L508301n308304o083985N696564J210403
3883.5G08765182J061554L476487j1651764J247482M011002J424484L975296q40683
3891.2G11469040p551804J143799L034058j404267P20520J112061K622910K108840
3898.9G13255157p513504M633255J942292m803162L173752k707901n71747J040802
3906.7G08448944N97305J337586l43628n1270N7984O67877K02866l12729J249313J690292
3916.3G13544540l435974k731018M009247l58505l077469K065658J350708P40967j596527
3925G10511627j488190J940918O87943K31705o75278N0888K354355j978989k075500
3933.7G09559479O27899N3863J263657Q03757r93881o97327q698J489640J369476k007828
$$ y = [703467712, 707858658, 708137589, 709742203, 713250504, 707942200, 701858215, 707554779, 708765182, 709826736, 713303223, 701651459, 702898941, 706909943, 708334427, 712309723, 711469040, 703917236, 705061035, 708095093, 706690826, 707411346, 708523407, 711146317, 713255157, 705741653, 710374908, 712317200, 707514038, 710687790, 707979889, 707408142, 708448944, 709046249, 710383835, 710040207, 709988937, 710046921, 710714798, 710917664, 710604935, 711854248, 713544540, 710108566, 707377548, 711386795, 711028290, 707950821, 710016479, 711367187, 712108154, 710511627, 709023437, 710964355, 711652298, 711884003, 711208725, 711259613, 713613968, 711634979, 709559479, 710187378, 710241241, 711504898, 712308655, 711314774, 710617447, 710608749, 712098389, 713467865, 711460037]
3943.3G11460037m18701Q85468O32171M71268j899719N93033J27029j704865K203904
3952G12349625R76486p34329l0518K29950M24271k92359J88446k73742K33383Q04901
3961.6G13876114p06482m69132j46713l34244K29187J017151Q18711o35453q52508
3970.3G12796631P62787K36892o05850K12021j14212K62299N49163N02778n26352j320801
3980G12755356P28073J167755j2588j007767n29556L45001M68826K90299n76249L45078
3989.6G13974228j0223k75879Q26873J37482J69296l01284n25513k4796o0730K41776
3999.2G14151230M31137
4000.2G14582367
$$ y = [711460037, 711041336, 711926804, 712558975, 713030243, 711130524, 711723557, 711850586, 710145721, 712349625, 713326111, 712591782, 712561264, 712791214, 713215485, 712923126, 713111572, 712837830, 713071213, 713876114, 713169632, 712700500, 712553787, 712219543, 712448730, 713465881, 714284592, 713649139, 712796631, 713559418, 713796310, 713190460, 713402481, 713288269, 713550568, 714099731, 714602509, 714076157, 712755356, 713483429, 714651184, 714638596, 713630829, 713101273, 713446274, 713915100, 714205399, 713629150, 713974228, 713964005, 713688126, 714514999, 714652481, 714821777, 714520493, 713994980, 713970184, 713909454, 714151230, 714582367]
##END=$$ End of the data block
