##TITLE=$$ Begin of the data block
##JCAMP-DX=5.00 $$ ACD/SpecManager v 10.08
##SPECTROMETER/DATA SYSTEM=Varian
##DATE=20 Nov 2012 10:35:00
##DATA TYPE=INFRARED SPECTRUM
##DATA CLASS=XYDATA
##ORIGIN=
##OWNER=
##NPOINTS=3735
##FIRSTX=399.26403809
##LASTX=4000.35498047
##MAXX=4000.35498047
##MINX=399.26403809
##MAXY=78.52765656
##MINY=28.69873428
##XFACTOR=1.0000000000
##YFACTOR=0.000000100000000
##FIRSTY=58.18152618
##DELTAX=0.96440572
##XUNITS=1/CM
##YUNITS=TRANSMITTANCE
##XYDATA=(X++(Y..Y))
399.3E81815262o964150k1905899M151306J2582245N147744P53021n338288p981109
407E62260132l991814O818161j068954r446526j783371K649117L997459J784783N375709
415.7E66594696q27026q075371j171379p690773K652092M543800M566956R09843q162193
424.3E53340645n014954Q74405O086540K548256k513427j262169l049279k203674m69322
433E48337021k798462l556595l67126j036263j964226K292786L821220K351723K28653
441.7E47308731J67656j154594j756478K581520K357064l202019j087341Q416900R940262
450.4E63571701L222237k206421l938942r46999j772423l906669l084870m000282J366806
459.1E48304138K662087J395759M155731J193657m411163J387215J272430o086235
$$ y = [581815262, 574851112, 552945213, 557096519, 569678764, 574826508, 575579529, 570241241, 562260132, 558268318, 565086479, 564017525, 554570999, 552787628, 555436745, 559434204, 561218987, 566594696, 565767670, 557692299, 556520920, 548830147, 551482239, 556026039, 560592995, 561502838, 553340645, 548325691, 549200096, 555286636, 557834892, 555321465, 554059296, 551010017, 548806343, 548337021, 545538559, 541981964, 541614838, 540578575, 538614349, 540907135, 544728355, 547080078, 547308731, 547476387, 546321793, 544565315, 547146835, 549503899, 546301880, 545214539, 553631439, 563571701, 566793938, 564587517, 560648575, 559701576, 557929153, 554022484, 550937614, 546937332, 548304138, 550966225, 552361984, 556517715, 557711372, 553300209, 554687424, 555959854, 549873619]
466.8E49873619n829163l132171q15468K8152k208595j771927J646920J674995K017860
475.5E41484222J0720k151337j741600q68416L995629n57404q235741m453697k384872
484.1E25097504J037368L785210L938675J346436M10308J318016k975235k145385k303467
492.8E29509430m675713k640113l094674J716118O346207K283592k994728n16548K239914
501.5E28173485j692887l049774k360496j555062j786117m332771l923722q56094J201210
510.2E09817772M43306j75285j567955N1155p37763m386864o509170l823891m53720
518.9D92657585m363518j130256J928138J577950J379051R47228L144416j440734j890259
527.5D92809601l97453k350235m180260l353043K085572J321487J568336K763138K516899
$$ y = [549873619, 544044456, 540912285, 540096817, 540124969, 537916374, 536144447, 537791367, 539466362, 541484222, 541494942, 539343605, 537602005, 536733589, 540729218, 540171814, 531936073, 527482376, 525097504, 526134872, 529920082, 533858757, 535205193, 535615501, 536933517, 533958282, 531812897, 529509430, 524833717, 522193604, 519098930, 520815048, 527161255, 529444847, 526450119, 525933571, 528173485, 526480598, 523430824, 521070328, 519515266, 517729149, 513396378, 509472656, 508616562, 509817772, 510261078, 510085793, 508517838, 508568993, 507831230, 503444366, 496935196, 493111305, 492657585, 488294067, 487163811, 489091949, 490669899, 492048950, 492996178, 496140594, 494699860, 492809601, 492412148, 490061913, 485881653, 482528610, 484614182, 485935669, 487504005, 490267143, 492784042]
536.2D92784042M258843L717537J853332m01153j501656k10190O60515p54318K22702
544.9E00629654J628494K221642L529701J338806J248131p93076l360672k931823l870392
553.6D99640465j734505p93533q52623j105271m96368J768188Q78678j072884j478157
562.3D94753990j97601k689896l991852k907791m125213k821884k139855j289139j991119
570.9D72599640j106567K71072K21481J163330K8649k57187r39980j1253m13437j92223
580.6D71363525K999268L301125L211746K765121N080071L886947K020607J559639
588.3D96188049o01616p84301j569748l21732M15535O05354K228318J854667J746445
597D99760971J245461M88357j046028p73735j31416j182518j474991j583519L05786
$$ y = [492784042, 497042885, 500760422, 502613754, 502212601, 500710945, 500500755, 501161270, 500406952, 500629654, 502258148, 504479790, 508009491, 509348297, 510596428, 509803352, 506442680, 503510857, 499640465, 497905960, 497112427, 496259804, 495154533, 494658165, 496426353, 497305031, 496232147, 494753990, 494556389, 491866493, 487874641, 484966850, 480841637, 478019753, 475879898, 474590759, 472599640, 471493073, 471764145, 471985626, 473148956, 473177605, 472920418, 471980438, 471969185, 471555748, 471363525, 474362793, 477663918, 480875664, 483640785, 488720856, 492607803, 494628410, 496188049, 495586433, 494802132, 493232384, 492910652, 493326187, 493931541, 496159859, 498014526, 499760971, 501006432, 501494789, 500448761, 499675026, 499543610, 498361092, 496886101, 495302582, 495608368]
605.6D95608368R86671O21491J842384K989083J916847L53164j043663j986999L22609
614.3E01609955k48528j521682q5755P98531J481361J899033M247322L942566K037468
623E14160271N20935n48325K31056n7907k4376O0616L95508J380348K277870L155136
632.7E21551132K916718K154083J695862J369514r35554j088028N47600q86956p78541
641.3E26545830J035499K062569J567497J491738K035865J367264J575775J386605
649E39068642K61802l87725n85442k44942j181984j199836J583480L273354L061142
657.7E43648491K946548J577683k53906o42395j05439o90612j221581n19371O69212
666.4E45408630J334114p53898K252960K950554J935043K290917J643753j62049p92503
$$ y = [495608368, 496595039, 497216530, 499058914, 502047997, 503964844, 504318008, 503274345, 501287346, 501609955, 501361427, 499839745, 499753990, 500552521, 502033882, 503932915, 508180237, 512122803, 514160271, 514681206, 514132881, 514363937, 514306030, 514281654, 514342270, 514737778, 516118126, 518395996, 521551132, 524467850, 526621933, 528317795, 529687309, 528751755, 527663727, 528211327, 527324371, 526545830, 527581329, 529643898, 531211395, 532703133, 534738998, 536106262, 537682037, 539068642, 539330444, 538942719, 538357277, 538112335, 536930351, 535730515, 537313995, 540587349, 543648491, 546595039, 548172722, 547918816, 547276421, 547170982, 546480370, 545258789, 544739418, 545408630, 546742744, 545988846, 548241806, 551192360, 553127403, 555418320, 557062073, 556900024, 556107521]
675.1E56107521j119995j218834q28247j60446R03587K337799K618447J995658K142144
683.8E62777634K014923L85132p08466j400413j000481o2866j380997r82018L47634
692.4E59990082R13429J784744O17676k8725q7661o88782j995316l084449j964226
701.1E55456772j900902j156616k44332j092109J96266J806793J841049M18930O25954
709.8E55951805R05800p71256K02408M38156k04391J105461J878090K799530L650055
718.5E65955658L792915L434830K833481K456627J226539L91236l25432j69220J307030
727.2E80903664K558250L553200K917747K906571L755188L014679J614761R13200J03875
735.8F02241135j427002j70403L33901j132508l24325J986847L343658K024956O35605
$$ y = [556107521, 554987526, 553768692, 552940445, 552779999, 553683586, 556021385, 558639832, 560635490, 562777634, 564792557, 565177689, 564469223, 563068810, 562068329, 562005463, 560624466, 559642448, 559990082, 560903511, 562688255, 563305931, 563277206, 563189545, 562500763, 560505447, 557420998, 555456772, 553555870, 552399254, 552154922, 551062813, 551259079, 553065872, 554906921, 555325851, 555951805, 556857605, 556086349, 556288757, 556726913, 556522522, 557627983, 559506073, 562305603, 565955658, 569748573, 573183403, 576016884, 578473511, 579700050, 580091286, 579765854, 579596634, 580903664, 583461914, 587015114, 589932861, 592839432, 596594620, 599609299, 601224060, 602137260, 602241135, 600814133, 600643730, 600977631, 599845123, 599520798, 601507645, 604851303, 606876259, 607511864]
744.5F07511864L82080j09406j112709j710052k518463l097954k442131k197609r85794
753.2E93719826k77787Q36831K437172R25788j328010k465973l365364m850235l585968
761.9E82046280j266632j163674j196708r93462J87149J856804L175354K697373J863670
770.6E87206154J512489k56691M9744M79545M25568J099510J966286L221245L654098
779.2E99357948N334969N838890M707260K464676J945152L142853Q80318J082420J411247
787.9F26165733Q79822J796112L393593M897270K739220K789307L911743K645797P97730
796.6F50016327o5689k95563r94644n35507o41785J47476J984329L796006L210754
805.3F56621704J262817Q96302n99137j681060l177872l374558j967468j091690o53458
$$ y = [607511864, 607893944, 607784538, 606671829, 604961777, 602443314, 599345360, 596903229, 594705620, 593719826, 593442039, 594278870, 596716042, 597641830, 596313820, 593847847, 590482483, 585632248, 582046280, 580779648, 579615974, 578419266, 577425804, 577612953, 579469757, 582645111, 585342484, 587206154, 588718643, 588461952, 588511696, 588991241, 589416809, 590516319, 592482605, 595703850, 599357948, 604692917, 610531807, 615239067, 617703743, 619648895, 622791748, 623672066, 624754486, 626165733, 627045555, 628841667, 632235260, 637132530, 639871750, 642661057, 646572800, 649218597, 650016327, 649950638, 649655075, 648660431, 648124924, 647483139, 647630615, 649614944, 653410950, 656621704, 657884521, 658780823, 658181686, 656500626, 653322754, 649948196, 647980728, 646889038, 646235580]
814F46235580k12631J051636Q77151J067811J440658J128998j77689j155548j133880
822.6F49122086k418595l90091J005860k4491M10080P71790R48868P20062L55377q13904
832.3F49687042j207504k608643l561859k253113k317810k093010j270217M14848J338844
841F36128578J065407J059914l18718j548119j947822k721329l520966k487259k019043
849.6F23690643j973762j057434j86310R12399J033478l04108l062668k977104k839088
858.3F13236046m167900k783203k854004j167145K031288K439423K769165L755569
866F13259239N182381M962616M950218M372673K386055K036171J834030J861344K079010
874.7F42923737K522735L490143M245987K921905K512207J889496k48108k77786k013092
$$ y = [646235580, 646022949, 647074585, 647951736, 649019547, 650460205, 651589203, 651411514, 650255966, 649122086, 646703491, 646313400, 647319260, 647294769, 647704849, 648476639, 649425507, 650145569, 650500946, 649687042, 648479538, 645870895, 642309036, 640055923, 637738113, 635645103, 634374886, 634789734, 636128578, 637193985, 638253899, 637935181, 636387062, 634439240, 631717911, 628196945, 625709686, 623690643, 621716881, 620659447, 620473137, 621385536, 622419014, 622114906, 619052238, 616075134, 613236046, 609068146, 606284943, 603430939, 602263794, 604295082, 606734505, 609503670, 613259239, 618441620, 623404236, 628354454, 632727127, 635113182, 637149353, 638983383, 640844727, 642923737, 645446472, 648936615, 653182602, 656104507, 658616714, 660506210, 660258102, 659980316, 657967224]
883.4F57967224k761230l297348l560791k218628j664276o51474p22580k30027q60977
892.1F41999893k098732k500229l089485k849579k943344k447204k804566k413292
899.8F20853462j343536p94411l36723j066818r65958j213951k018700l668327m669380
908.5F04775658m251671m172745l598709l625755l158646l040276l481025l323212
916.2E76123619l322563l201904l852578m022598l586387l337899k231292r50013K3270
924.9E51641655M79774M78592O70052J168442J147079q240l07655J31264M50554K93693
934.5E56145210K11067Q22907J414757K851829L537140K624245J756439K052651K419433
943.2E73835678J254311k47727q56514j081428k360001k075310j292572k012214j707535
$$ y = [657967224, 655205994, 651908646, 648347855, 646129227, 644464951, 643813477, 643090897, 642860870, 641999893, 639901161, 637400932, 634311447, 631461868, 628518524, 626071320, 623266754, 620853462, 619509926, 618715515, 618378792, 617311974, 616346016, 615132065, 613113365, 609445038, 604775658, 600523987, 596351242, 592752533, 589126778, 585968132, 582927856, 579446831, 576123619, 572801056, 569599152, 565746574, 561723976, 558137589, 554799690, 552568398, 551618385, 551641655, 552121429, 552600021, 553270073, 554438515, 555585594, 555577354, 555269699, 555400963, 555851517, 556145210, 556356277, 557179184, 558593941, 561445770, 564982910, 567607155, 569363594, 571416245, 573835678, 575089989, 574842262, 573985748, 572904320, 570544319, 568469009, 567176437, 565164223, 563456688]
951.9E63456688k788315m748268n137863n647011o128197p138710p233619n944558
959.6E18690147o040878o256790n734444n055542n893058o774254o878472o491508
967.3D69565201o650620q831749r108314q711434q642921q541718p892685q260536
975D02925224q924484p680550q517570p488213p896614q162880p418785p802124n588836
983.7C33445168n894585m773140m971123m290504k771683k944527j514721k134285
991.4C04150600j019134k522945j937542o70815o36635O05431j116009M11949o53591
1000.1B96611309l47309R09004J38550j3180r72099K82860j035748n45139r97849j440982
1009.7B92589417r23653j538849J45035j128960p14016j224956q6728O12546o79322
$$ y = [563456688, 560668373, 555920105, 550782242, 545135231, 539007034, 531868324, 524634705, 518690147, 512649269, 506392479, 500658035, 495602493, 489709435, 482935181, 476056709, 469565201, 462914581, 454082832, 444974518, 436263084, 427620163, 419078445, 411185760, 402925224, 394000740, 386320190, 377802620, 370314407, 362417793, 354254913, 346836128, 339034004, 333445168, 327550583, 322777443, 317806320, 313515816, 310744133, 307799606, 306284885, 304150600, 303131466, 300608521, 298670979, 298000164, 297363529, 297968960, 296852951, 297264900, 296611309, 296264000, 297173004, 297311554, 297298374, 296326275, 296609135, 295573387, 295028248, 294030399, 292589417, 291665764, 290126915, 290271950, 289142990, 288428974, 287204018, 287117290, 287729836, 287050514]
1018.4B87050514N31903n95074N76687K61306P11403N08004R70058K208977K87227
1027.1B92511005J723195P93743J491718J239471Q92334J142178K07024K265682M69227
1035.8C02735577N99994m1618K25429K75803l28026J215725j281929L54653m12159
1044.5C03343449p44610k33746p84015N14926n32684J804924J344948K300396J740456
1053.1C08754044J097259L267079K401847L230362J652241K827683K199325K181625
1060.9C27611465M456864M822235N949974L702087L782998K265625K054939Q29620
1068.6C55475807k136307j702308l812638l858451m563523l050079k414932k386170
1076.3C31551399o17294j244583J015625K78854R49745J000595J952553K736626O99348
$$ y = [287050514, 287582417, 286987343, 287564030, 287825336, 288536739, 289044743, 290014801, 292223778, 292511005, 294234200, 295027943, 296519661, 297759132, 298651466, 299793644, 300000668, 302266350, 302735577, 303335571, 303293953, 303519382, 303795185, 303467159, 304682884, 303400955, 303755608, 303343449, 302598839, 302365093, 301581078, 302096004, 301563320, 303368244, 304713192, 307013588, 308754044, 309851303, 313118382, 315520229, 318750591, 320402832, 323230515, 325429840, 327611465, 332068329, 336890564, 342840538, 346542625, 350325623, 352591248, 354646187, 355475807, 353339500, 351637192, 347824554, 343966103, 339402580, 336352501, 333937569, 331551399, 330934105, 329689522, 330705147, 330984001, 331933746, 332934341, 334886894, 337623520, 338322868]
1085C38322868K439003K553521L927040L219223L504333L764954L350258L944358K044602
1093.6C67070160K716293J100540J505127J145478Q31184J516380o09016J098099j11580
1102.3C76262665j50337M72984P92198Q30765J22909K067948P75070K101097K530022
1111C85805321K690124K618981K048492L689423J905021K156754J654282J933631J938019
1119.7D06440048N26810O34842N29480K058601O81381J128769J401215J363640K491989
1128.4D17256775J452370K100982J475754J611671J150208J155281J127625K93769
1136.1D27624435N25933q99582M4823l31154j231308k869110l895340k566414l456726
1144.8D12945557k741051l543472k472458j437340j703758r23386j464653p1983q43048
$$ y = [338322868, 340761871, 343315392, 347242432, 350461655, 353965988, 357730942, 361081200, 365025558, 367070160, 369786453, 370886993, 372392120, 373537598, 374368782, 375885162, 375276146, 376374245, 376262665, 376112328, 376585312, 377377510, 378208275, 378331184, 380399132, 381174202, 383275299, 385805321, 388495445, 391114426, 393162918, 396852341, 398757362, 400914116, 402568398, 404502029, 406440048, 406966858, 407601700, 408131180, 410189781, 410871162, 411999931, 413401146, 414764786, 417256775, 418709145, 420810127, 422285881, 423897552, 425047760, 426203041, 427330666, 427624435, 428150368, 427250786, 427295609, 426964455, 425733147, 422864037, 418968697, 416402283, 412945557, 410204506, 406661034, 404188576, 402751236, 401047478, 400124092, 398659439, 398587456, 397744408]
1153.4C97744408R1781K25983j12763M883l49045J957551J311111K371407K458992
1162.1D05704308L543281M814263M152603N355148M589615N838127N463181M922447
1169.8D44382973N157242N752754P355537O276436O342888O648521O796532O095810
1177.5D94808693N559235M801330M416428N328979L834725L168068L205947L764077
1185.3E28887482M678459M148788L723259L168717K925338K172966R81789Q77609P99752
1193.9E52364159K36549k69966k72522L52135M80537M56734J278496J285552N17655
1202.6E56429329K48032j39809m90799k251L78647K57301Q97751J417961J499596J617088
1212.3E62112846J721955K127723J919480J434860L21121o30760l23181j40114o03599
$$ y = [397744408, 397836189, 398062172, 397949409, 397954292, 397605247, 399562798, 400873909, 403245316, 405704308, 409247589, 414061852, 418214455, 423569603, 428159218, 433997345, 439460526, 444382973, 449540215, 455292969, 462648506, 468924942, 475267830, 481916351, 488712883, 494808693, 500367928, 505169258, 509585686, 514914665, 518749390, 521917458, 525123405, 528887482, 533565941, 537714729, 541437988, 544606705, 547532043, 549705009, 550686798, 551564407, 552364159, 552600708, 552330742, 552058220, 552410355, 552890892, 553347626, 554626122, 555911674, 556429329, 556677361, 556537552, 556046753, 556044502, 556423149, 556680450, 557578201, 558996162, 560495758, 562112846, 563834801, 565962524, 567882004, 569316864, 569637985, 569007225, 568684044, 568543930, 567940331]
1220.9E67940331l74451M81529N61066K27775J47553p5569q13523r07173j105995j983223
1230.6E64098320k083969j979752j154442m50973l44734J16043k08626r8762J45645
1239.3E58038750o9962m49257j008110p01637j103592r04427j4724Q0757P51457J104202
1248.9E55723457J569100J715431J161728N97000P2708l42865m47349k59133n48897
1257.6E59241180k96516K62260O41137J173439R11369R01794J148339J128654P72820
1266.3E65884476J28097m5128K51923K90680K58331M08631P87735J683120J962204
1274.9E71610069J345787J183510Q62389k17171o24084j127129j248779n58014o30951
1283.6E70595627K73399R94263Q37173J248322J284523P19337k89764l87688o63376
$$ y = [567940331, 567565880, 568047409, 568608475, 568836250, 568983803, 568908234, 568094711, 567187538, 566081543, 564098320, 562014351, 560034599, 558880157, 558429184, 558084450, 558200493, 557991867, 557893105, 558038750, 557968788, 557519531, 556511421, 555809784, 554706192, 553801765, 553787041, 553867798, 554619255, 555723457, 557292557, 559007988, 560169716, 560766716, 560839424, 560496559, 560049210, 559790077, 559241180, 558944664, 559206924, 559848061, 561021500, 561932869, 562834663, 563983002, 565111656, 565884476, 566012573, 565967445, 566219368, 566510048, 566768379, 567177010, 567964745, 569647865, 571610069, 572955856, 574139366, 575001755, 574784584, 574160500, 573033371, 571784592, 571226578, 570595627, 570869026, 571863289, 572700462, 573948784, 575233307, 575952644, 575662880, 575275192, 574611816]
1292.3E74611816j377334j443253j430702j094360n23110k58751j84669K77366M6082
1301E68623085n06515p73812j515236j351013p99408j477280k458915j758385j104355
1309.7E56878166o75735K49214j32218j12304M9515o88706r94377j559219j784096
1318.3E51230240j598206p84530o180m55361o90193m01802n39322r92355j429977j865921
1328E42466393k041321k285881k856522k537918j880379j805839j005974m84734m09393
1336.7E27158432m27856m07258p51876m28429K68173k86255n37529m53605K83470N29365
1346.3E24946632O34270P81136N24597Q09402N25551M42009j23711m51126q82911j372147
1355.9E25833702r22813r82781q2130J64032o0349K45209J1101j38932J96305L62854
$$ y = [574611816, 573234482, 571791229, 570360527, 569266167, 568743057, 568484306, 568299637, 568577003, 568623085, 568116570, 567342758, 565827522, 564476509, 563677101, 562199821, 559740906, 557982521, 556878166, 556202431, 556451645, 556319427, 556207123, 556256638, 555567932, 554573555, 553014336, 551230240, 549632034, 548847504, 548841324, 548385963, 547695770, 547293968, 546754646, 545762291, 544332314, 542466393, 540425072, 538139191, 535282669, 532744751, 530864372, 529058533, 528052559, 527567825, 527158432, 526730576, 526323318, 525571442, 525143013, 525411186, 525124931, 524587402, 524133797, 524417267, 524946632, 525580902, 526362038, 526886635, 527696037, 528221588, 528663597, 528539886, 528088760, 527205849, 525833702, 524910889, 523928108, 523845978, 524010010, 523949661, 524194870, 524205971, 524067039, 524263344, 524626198]
1365.6E24626198q09326r71947j164589o87714l13377n23338J071243R04655R75190
1374.3E23106995J320877J820869J581307K22511L25699m56543j98136l49273l17726
1382.9E27056580N64804Q13141K088356K001953K531967K134361J618347O62270J24321
1391.6E39596100L0899m35715q32100j914787J05591l25814m17060K25753J49918O37474
1401.3E36820259j129646j062966j308403k517356j022034m67606n02243j322250o99692
1409.9E26788063n90858k28119r880o77834l47519o67953p95861j531906k90336k212067
1419.6E19435730m46472J950302O26221R83085K75154J275406R96132R4757J193810
1428.3E26384125k96746k38914M40559P45049L93677O58836J357994N4436N54428J455917
$$ y = [524626198, 523816872, 522844925, 521680336, 520992622, 520679245, 520155907, 521227150, 522131805, 523106995, 524427872, 526248741, 527830048, 528052559, 528378258, 527921715, 527723579, 527374306, 527056580, 527621384, 528434525, 530522881, 532524834, 535056801, 537191162, 538809509, 539471779, 539596100, 539626999, 539191284, 538359184, 536444397, 536549988, 536224174, 535807114, 536032867, 536182785, 536820259, 535690613, 534627647, 533319244, 530801888, 529779854, 529312248, 528810005, 527487755, 526788063, 526197205, 525969086, 525959206, 525281372, 524933853, 524265900, 523470039, 521938133, 521647797, 519435730, 518989258, 520939560, 521565781, 522548866, 522824020, 524099426, 525095558, 525190315, 526384125, 526087379, 525848465, 526289024, 527034073, 527427750, 528086586, 529444580, 529499016, 530053444, 531509361]
1437.9E31509361J773834L99094L47138M50553l49311L09829m91562M87061J22719
1446.6E34558716M234J73264L56636N59196p04498k90032j121177M4975j044578j057435
1456.2E31479301r91821l783798L502006J137543L096009J630821J611557K347374
1464E40028992l55339K737541J315918L105240K289047K972107L351822J860237O853180
1472.6E64158745L774185O600075L844108M857293M538459K953644L166046J488075
1480.3E95380630K828026K187271L287583K789955K838325M117356K012520K722282
1488.1F18163948J265717J114692J263314K389717J797752K75154J316109l31192k98576
1496.7F26956635K498207J955795J337814J781769J357651O8168R07250J84402J58158
$$ y = [531509361, 533283195, 533682289, 534029427, 534479980, 534130669, 534440498, 533948936, 534435997, 534558716, 534562950, 534736214, 535092850, 535652046, 534947548, 534657516, 533536339, 533581314, 532536736, 531479301, 530487480, 526703682, 530205688, 531343231, 534439240, 536070061, 537681618, 540028992, 539673653, 542411194, 543727112, 546832352, 549121399, 552093506, 555445328, 557305565, 564158745, 567932930, 574533005, 578377113, 583234406, 587772865, 590726509, 593892555, 595380630, 598208656, 600395927, 603683510, 606473465, 609311790, 613429146, 615441666, 618163948, 619429665, 620544357, 621807671, 624197388, 625995140, 626270294, 627586403, 627255211, 626956635, 629454842, 631410637, 632748451, 634530220, 635887871, 635956039, 636863289, 637047691, 637205849]
1505.4F37205849p513161n068817N747795K296638L079796J922989J551438L03764
1513.1F39526291J235886L67813q12149L89938j417160K887039P60193k819824n37339
1521.8F39580688K561646M647903J648255L20206L71780J369247R3232j06125J128921
1530.5F51615753m78439N6457j522064r49173K820740J982193J234360o86112o153946
1539.2F47919769k866058O657638N24064j543198J843643p18918N08881K780075J932297
1547.9F57038193O50940o68717J92414K036895J212235j52741k530212j04294K724838
1556.5F60399551J174393m867554o032638L784714N612411K210693Q10166R384j092377
1565.2F62008743r48486n19409l42484r07287l280716Q33969J265564j00708j41220
$$ y = [637205849, 629692688, 624623871, 630371666, 632668304, 635748100, 637671089, 639222527, 639526291, 640762177, 641129990, 640317841, 640707779, 639290619, 642177658, 642937851, 640118027, 639580688, 642142334, 646790237, 648438492, 648758698, 649130478, 650499725, 650592957, 650486832, 651615753, 651137314, 651193771, 649671707, 648722534, 651543274, 653525467, 654759827, 654073715, 647919769, 645053711, 651711349, 652235413, 650692215, 652535858, 651816940, 652325821, 655105896, 657038193, 657689133, 657020416, 657212830, 659249725, 660461960, 660309219, 657779007, 657674713, 660399551, 661573944, 656706390, 650673752, 654458466, 660070877, 662281570, 663091736, 663101120, 662008743, 661060257, 660540848, 660198364, 659291077, 656010361, 656844330, 658109894, 658009186, 657867966]
1573.9F57867966M14047j236267o253967Q70742M11988j426545j506958j224212p63016
1582.6F47153778j321716r71833r32846p10449j133957k147026k161751k927169j914406
1591.2F32932625k739906k419320k285995k645073j203880j665383r83886j817284
1599F17171898j307945k179108l170586k393837l094215j821518k771339j978264k180481
1607.6E96274605j983376j761551k111740m30145k274933k001419l056412j963997
1615.4E80691032k027244p620697O48842p44400n13687j567383m33350j363144l455505
1624E63614464J21536j037712l65524l214569j477509n49698j413231p01599r62334
1632.7E54013824P49627k3537j667290k010994J796265Q63266L27873R65614q21685
$$ y = [657867966, 658282013, 657045746, 650791779, 651662521, 652074509, 650647964, 649141006, 647916794, 647153778, 645832062, 644860229, 643927383, 643216934, 642082977, 639935951, 637774200, 634847031, 632932625, 630192719, 627773399, 625487404, 622842331, 621638451, 619973068, 618989182, 617171898, 615863953, 613684845, 610514259, 608120422, 605026207, 603204689, 600433350, 598455086, 596274605, 594291229, 592529678, 590417938, 589987793, 587712860, 585711441, 582655029, 580691032, 578663788, 571043091, 571691933, 570947533, 570433846, 568866463, 568433113, 567069969, 563614464, 563736000, 562698288, 562332764, 559118195, 557640686, 557090988, 555677757, 554976158, 554013824, 554763451, 554739914, 553072624, 551061630, 552857895, 553721161, 554049034, 555014648, 554192963]
1641.4E54192963O99997j67847J240501J371308j109734J074562P29332L411369J467972
1650.1E62910423K445526K235184j035576k877617J015168L257675J939773K363968
1657.8E72254524J115799J542931K142982K092514K063828Q51822L067321K162591
1665.5E87294312K461929J712570Q48084J451797K391930M167595K845306L844490
1673.2F07018013L532867K230416K644233L828774L396950J939125K152824K143402
1680.9F28886604L957711L439369j8959J694870N795593N583725L552628K271041K532807
1689.6F57695389K448044K505340K076264J769485K504196J977387j862107L361130
1697.3F72475128M271088M465866J678696k562333L665314K833862J106797n28870
$$ y = [554192963, 554892960, 554725113, 555965614, 557336922, 556227188, 557301750, 558031082, 561442451, 562910423, 565355949, 567591133, 566555557, 563677940, 564693108, 567950783, 569890556, 572254524, 573370323, 574913254, 577056236, 579148750, 581212578, 582064400, 585131721, 587294312, 589756241, 591468811, 592316895, 593768692, 596160622, 600328217, 603173523, 607018013, 610550880, 612781296, 615425529, 619254303, 622651253, 624590378, 626743202, 628886604, 632844315, 636283684, 636264725, 637959595, 643755188, 649338913, 652891541, 655162582, 657695389, 660143433, 662648773, 664725037, 666494522, 668998718, 670976105, 669113998, 672475128, 676746216, 681212082, 682890778, 680328445, 683993759, 686827621, 687934418, 687405548]
1705F87405548N70679k47193J453476K224961R09958J73568R22394J439972M64478
1713.7F95317841j471405o98166J688461p32880l258972L164749K247315J414184P60422
1722.4F98431549L08609J34888R57718R65042J97754K65503M6234j121598n50460J653823
1732G01289062J010438l039704j507110K928924K630234J048736J235657n61142j034775
1740.7G04000320K827836J242752m66309O86874J906128J713562J407853J639328J067352
1749.4G16025696L042221P10602O43234L412247J988906J655121J388550J24741J384048
1758.1G30375366K488098K136231J670379r9639M86297K261582J328964J108322J175156
1766.8G42930756M23965q57010K015457K624588n14068r75113Q05282K917710J024093
$$ y = [687405548, 687976227, 687729034, 689182510, 691407471, 692317429, 692490997, 693413391, 694853363, 695317841, 693846436, 693148270, 694836731, 694103851, 690844879, 694009628, 696256943, 697671127, 698431549, 698740158, 698875046, 699832764, 700797806, 700995560, 701261063, 701307297, 700185699, 699635239, 701289062, 702299500, 699259796, 697752686, 700681610, 703311844, 704360580, 705596237, 705035095, 704000320, 706828156, 708070908, 707604599, 708291473, 710197601, 711911163, 713319016, 714958344, 716025696, 719067917, 719778519, 720421753, 723834000, 725822906, 727478027, 728866577, 728991318, 730375366, 732863464, 734999695, 736670074, 736570435, 737056732, 739318314, 740647278, 741755600, 742930756, 743354721, 742497711, 744513168, 747137756, 746623688, 745648575, 746453857, 749371567, 750395660]
1775.4G50395660q53958J371079O12640N00031l32337j88293J294784J342545J047821
1784.1G55189972m06799N63278J154327M59519J94778N54352m83704r14764j476135
1792.8G54834824n2872K653580J010284R2011R99679J202316N19638n01937J069870
1801.5G61827393o93818k77099P44247J45569L05328k45361K91672R55353R54055n02243
1811.1G63505096N92881J335144L20663J54953o52695J36261l29589j22071O13633
1819.8G65554276R0637M17175n3787Q69751M26788j207275N87158J186829N73043j435547
1829.4G67009048k600326J006546J948395L78189K02789N15671K36435J95007O638
1838.1G68898392Q11081j05439k80380l61786O13022L86810l763809J691132J663055
$$ y = [750395660, 749541702, 750912781, 751525421, 752025452, 751693115, 751504822, 752799606, 754142151, 755189972, 754783173, 755346451, 756500778, 756960297, 757155075, 757709427, 757225723, 756310959, 754834824, 754781952, 757435532, 758445816, 758537827, 759537506, 760739822, 761259460, 760757523, 761827393, 761133575, 760856476, 761600723, 761746292, 762051620, 761806259, 762097931, 763053284, 764007339, 763505096, 764097977, 765433121, 765753784, 765908737, 765256042, 765392303, 765062714, 764940643, 765554276, 765644913, 766062088, 766008301, 766878052, 767304840, 766097565, 766684723, 767871552, 768444595, 767009048, 764408722, 765415268, 767363663, 767741852, 767944641, 768460312, 768696747, 768891754, 768898392, 769709473, 769604034, 769323654, 768961868, 769574890, 769961700, 766197891, 767889023, 769552078]
1846.8G69552078r1476k54364K71072O42624n5694K67562l43704N7068R537k53601
1856.4G69801102O48193J96915L204K25830Q45719q7052l03192k96097m83398M67987
1866.1G71019211m22669m03671j154709k17590J383438R27124O03180r9945J14822
1874.8G71749191j52130K4719k04696l30429j6632n7450N96695k7008M55475L04108
1884.4G72341843R8190N91812p5607L53775p32117j516647L67279Q93249J46408J48774
1894.1G72616959O5002n95932P63931L91922J88980J34354k85721p6141n21927k7695
1903.7G72653732k94418k31628P1868K39411M13513K61078L88641J18485P84912l32871
1913.3G74072723p65304m1428q545j2512j771316j6098Q17108M22668L20053n83877
$$ y = [769552078, 769460602, 769206238, 769477310, 770119934, 770064240, 770331802, 769988098, 770045166, 770054703, 769801102, 770449295, 770646210, 770649414, 770875244, 771720963, 771633911, 771330719, 771034622, 770551224, 771019211, 770596542, 770192871, 769038162, 768820572, 770204010, 771131134, 771734314, 771634369, 771749191, 771597061, 771621780, 771417084, 771086655, 771070023, 771012573, 771609268, 771582260, 772037735, 772341843, 772440033, 773031845, 772956238, 773310013, 772577896, 771061249, 771428528, 772321777, 772468185, 772616959, 772681961, 772086029, 772849960, 773241882, 773430862, 773565216, 773279495, 773203354, 772681427, 772653732, 772359314, 772127686, 772199554, 772438965, 772852478, 773113556, 773502197, 773620682, 774405594, 774072723, 773307419, 773265991, 773257446, 773244934, 771473618, 771457520, 772274628, 772697296, 773017349, 772433472]
1923G72433472L09372Q22067M29153m14047p3700O4926l18680m19693m57077J75248
1932.6G72551041P858M50897K13623p1716K02026K05765L76129k91290O5613j065979
1942.3G72643967j439438O20880M82483K29874k77329R9411O18897O61468N6610j29089
1951.9G73567734O6910p2251K13928n45425m47769k56958p3700J34048j32217N29709
1961.6G72984009K18582J35269j83487K8153M42352m09393n2109K64129L26844k53906
1971.2G73500443l00141n0735j97983J20849j09252K9296K79541M64402j78376m18167
1980.8G73139877r4757k80838L88184L33786p3776n01709n00718k25677M3411N95169
1990.5G72822952j34277m79889L16772P47376J19324j02997K18124k50015k83737m03824
$$ y = [772433472, 772742844, 773564911, 773994064, 773580017, 773506317, 773571243, 773252563, 772832870, 772375793, 772551041, 772558899, 773009796, 773223419, 773151703, 773353729, 773559494, 773935623, 773644333, 773709946, 772643967, 771204529, 771825409, 772307892, 772537766, 772260437, 772359848, 772978745, 773640213, 773696823, 773567734, 773634644, 773562393, 773776321, 773230896, 772783127, 772526169, 772452469, 772586517, 772454300, 772984009, 773202591, 773337860, 773154373, 773182526, 773624878, 773215485, 773163376, 773427505, 773754349, 773500443, 773200302, 773149567, 772951584, 773072433, 772963181, 772992477, 773272018, 773736420, 773558044, 773139877, 773045120, 772764282, 773152466, 773486252, 773412476, 772910767, 772410049, 772184372, 772227783, 772822952, 772688675, 772208786, 772525558, 773272934, 773392258, 773289261, 773507385, 773257370, 772973633, 772569809]
2000.1G72569809k4414k10724l67813N5694J75477L98483j81427p7362l69187l59497
2009.8G71609039K8534l10669l3645k68021R918j5335k29111q8882k07825J46179K87705
2020.4G70927887L30887l35999m98581k72064j15814J74179o9275l66287o45142j90735
2030G68939056r8571R7656j4496j92184L55682p2708k6245k31858k68325n0049k01340
2040.6G68236618k34375m33578J9989r1248P1564j15280j20850L78265O2104K73361
2050.3G68046570k08359l01285l17154r7961L91540j67236j82571q0033K51236k13852
2059.9G67120895j71890J23139k42539K88239J67846M23203J89590k27585j31988l28369
2069.6G67210541o3629j92490j50986J33744M21524K41165J20086k27508l71933M68140
$$ y = [772569809, 772545395, 772334671, 771966858, 772022552, 772198029, 772596512, 772415085, 772337723, 771968536, 771609039, 771637573, 771326904, 771293259, 771025238, 771035156, 771019821, 770790710, 770701828, 770494003, 770640182, 770927887, 771258774, 770922775, 770424194, 770152130, 770036316, 770210495, 770141220, 769774933, 769129791, 768939056, 768840485, 768938141, 768923645, 768731461, 769087143, 769014435, 768988190, 768756332, 768488007, 768437958, 768236618, 768002243, 767568665, 767588654, 767497406, 767568970, 767453690, 767332840, 767711105, 767773209, 768046570, 767838211, 767536926, 767219772, 767121811, 767513351, 767346115, 767163544, 767083511, 767334747, 767120895, 766949005, 767072144, 766829605, 767117844, 767285690, 767708893, 767898483, 767670898, 767538910, 767210541, 767146912, 766954422, 766803436, 766937180, 767358704, 767599869, 767719955, 767492447, 767120514, 767588654]
2079.2G67588654K15835J20697j88217l32794k40021m07028K26822J73874J62658p3013
2088.9G67247467k26364k3270L90091L91693l19214M5701M2953J56479j82037l5782
2098.5G67487717O29577j21612k5788n951J92414j49918k31018L96652k3574J84783
2108.1G68333282n9127L9673L2196k87171M0207K45285N98374p2403m79203o2103J96075
2118.7G68525085j48696p1946J34049j27869J23978k36130J10474L50570J69831m425
2128.4G68824921k55890j25809o66733K44599L37066m3182K60086l27911L24020M16870
2138G68988037M5471O409J59378J05057k90756r0561k99683l60489j46026O01959K74582
2148.6G68993378m12522K52152M55780P3700l75672K51236N9510j99204J42059l17611
$$ y = [767588654, 767804489, 767925186, 767736969, 767404175, 767164154, 766757126, 766983948, 767157822, 767320480, 767247467, 767021103, 766997833, 767387924, 767779617, 767460403, 767506104, 767549057, 767705536, 767523499, 767487717, 768117294, 767995682, 767969894, 767963943, 768156357, 768006439, 767775421, 768172073, 768148499, 768333282, 768274155, 768313828, 768346024, 768058853, 768099060, 768344345, 768942719, 768870316, 768391113, 768329010, 768525085, 768376389, 768304443, 768438492, 768310623, 768434601, 768198471, 768308945, 768659515, 768829346, 768824921, 768569031, 768443222, 767776489, 768021088, 768358154, 768314972, 768575058, 768247147, 768571167, 768988037, 769033508, 769039917, 769199295, 769304352, 769013596, 768923035, 768623352, 768262863, 768116837, 768718796, 768993378, 768580856, 768833008, 769288788, 769362488, 768986816, 769238052, 769297562, 769098358, 769240417, 768922806]
2158.3G68922806k00577j37253N07736O80008M76303R3461m22059Q7891J2131K23160
2167.9G70243607j9150k06299n1651p477L09830Q39L48892K68784J47705K65503M57229
2178.5G71757812L64380m12216j44195k67563J16958M55933K38724L92227J51367J24359
2188.2G72777786m3869K60391K98005L05252R3155k59476r232l44925j09481Q6822
2197.8G73054428N32227L65371k21557J33285q6364J68304L26004K40860J33591m2267
2207.5G74603882m13971j71661O02417j03150Q8120M51583N16968J91040l63464K54211
2217.1G75655975j13907k82440l41186j06125J90658M6998N01709L37753L54843L78571
2226.8G76622849M46548k28577n25741O10l27072M425k51312j68228J21536K17285
$$ y = [768922806, 768722229, 768584976, 769092712, 769772720, 770249023, 770342484, 769920425, 770008316, 770020447, 770243607, 770224457, 770018158, 769966507, 769959030, 770268860, 770269699, 770618591, 770887375, 771035080, 771300583, 771757812, 772122192, 771709976, 771565781, 771298218, 771415176, 771871109, 772109833, 772502060, 772653427, 772777786, 772733917, 772994308, 773292313, 773597565, 773690720, 773431244, 773422012, 773077087, 772967606, 773054428, 773586655, 773952026, 773730469, 773863754, 773777390, 773945694, 774271698, 774512558, 774646149, 774603882, 774189911, 774018250, 774620667, 774517517, 774605637, 775057220, 775574188, 775765228, 775401764, 775655975, 775542068, 775259628, 774918442, 774812317, 775002975, 775049973, 775551682, 775889435, 776244278, 776622849, 777069397, 776840820, 776315079, 776315689, 775988617, 775993042, 775741730, 775573502, 775695038, 775912323]
2236.4G75912323O50177K14767J63269L1739K50091J09787n37719l41645j4724k81372
2246G76156693m27475O30569M53949k53830K0523M73709L99475K25754K54517p42493
2255.7G77191391n75104q0185Q8578J05590q3160K31705j35041N17273N26352J68000
2265.3G77955399J77993l49884j91192m08936j58539r1781J68075k3956k71454M36096
2275G77241821M11454Q13293K64587r842k37960m70353j34811p19604m2038j13449
2284.6G77003098N9890M51279J35956K78168Q5067P00379J66244j10855r0103m65546
2294.3G78213577r0255k81907j26953k75879K27662K80380K71454O97555m9133p5989
2303.9G78790512j23062M29611M31671q5525q6365m29687K78015M33960M68292L97720
$$ y = [775912323, 776562500, 776777267, 776940536, 776972275, 777222366, 777332153, 776794434, 776452789, 776438065, 776156693, 775729218, 776359787, 776813736, 776559906, 776580429, 777054138, 777453613, 777679367, 777933884, 777191391, 776616287, 776536102, 776624680, 776730270, 776647110, 776878815, 776743774, 777261047, 777787399, 777955399, 778133392, 777783508, 777592316, 777183380, 777024841, 776933060, 777101135, 777077179, 776805725, 777241821, 777653275, 778466568, 778731155, 778721313, 778483353, 778013000, 777878189, 777158585, 777116547, 777003098, 777062988, 777514267, 777650223, 777928391, 778013458, 778713837, 778880081, 778769226, 778679123, 778213577, 778123322, 777841415, 777714462, 777438583, 777666245, 777946625, 778218079, 778915634, 778866501, 778790512, 778667450, 779097061, 779528732, 779443207, 779356842, 778927155, 779205170, 779639130, 780107422, 780505142]
2313.5G80505142P0954J53884M2725k23465j55792L54538k65503M72336Q33358n08422
2323.2G81279755l88031J91650K13699P9117Q85239N52444M4556o29501r73282l20969
2332.8G80934677q57086O46439J606369R20333J05515j6174o00663j433258K63901
2341.5G81570053N87387J2360k01569k24991j194534j731415n67169P86285K147370
2350.2G81183777M49600o71081L77655N94024J294480R5977j9760j531677q58459J442565
2359.8G82357101J734925J184540o60248m99878j557236n14069n20248r57870l21122
2368.5G80245895o43310r99298k366486K75650Q96225n74035p25327j111679Q4762
2377.2G75082397m24118q49227m89197o65436m68445m12750k43683j29623r1172k12707
$$ y = [780505142, 780576096, 780729980, 780772705, 780549240, 780393448, 780747986, 780482483, 780954819, 781788177, 781279755, 780891724, 781083374, 781297073, 781376190, 782261429, 782813873, 782858429, 782228928, 781255646, 780934677, 780077591, 780724030, 782330399, 783250732, 783356247, 783340073, 782739410, 781306152, 781570053, 782157440, 782169800, 781968231, 781743240, 780548706, 778817291, 778250122, 779036407, 781183777, 781633377, 780962296, 781339951, 781933975, 783228455, 783324432, 783304672, 781772995, 780914536, 782357101, 784092026, 785276566, 784616318, 784116440, 782559204, 782045135, 781524887, 780567017, 780245895, 779602585, 778603287, 776236801, 776512451, 777408676, 776834641, 776109314, 774997635, 775082397, 774658279, 773809052, 773319855, 772654419, 772185974, 771773224, 771529541, 771399918, 771308746, 771096039]
2386.8G71096039J34201J73035j33439k99987l06015J50375l59344m96064l43322k54212
2396.5G69361267j29089j94779N09186M17023L0899m22363m52500j20621n96847n11932
2406.1G67890244p9422J53350j21917k3194P7668j64643l7536k87247l07923k85263
2415.8G66814117k00347m31519m90112j19629k54975j53808j66626p7057j48697M5013
2425.4G64816360K44141l76282m94613l79486l72315p18155n86090L4332J62354N1804
2435.1G62382050J79443J20621n13535L2578R6740n47180o19736q50219m25186l08152
2444.7G59547424m05426l58658k45285r9563R8266L15018m4632O1646k98844m83093
2454.3G58086853k11868p05414q74710n35278O2179L81012L44772m22821m00924N34210
$$ y = [771096039, 771230240, 771403275, 771269836, 770969849, 770663834, 770814209, 770454865, 769958801, 769615479, 769361267, 769232178, 769037399, 769546585, 769963608, 769994507, 769572144, 769119644, 768999023, 768402176, 767890244, 767810822, 767964172, 767842255, 767819061, 767896729, 767732086, 767694550, 767407303, 767099380, 766814117, 766613770, 766182251, 765692139, 765572510, 765317535, 765163727, 764997101, 764920044, 764771347, 764816360, 765060501, 764684219, 764189606, 763810120, 763437805, 762719650, 762133560, 762167892, 762330246, 762382050, 762561493, 762682114, 762168579, 762201157, 762297897, 761750717, 761130981, 760280762, 759855576, 759547424, 759141998, 758783340, 758538055, 758438492, 758536758, 758851776, 758807144, 758868790, 758569946, 758086853, 757874985, 757169571, 756294861, 755759583, 755821762, 756202774, 756547546, 756124725, 755723801, 756258011]
2464G56258011K35367o33011j070557l55911k11258m73404l37143k87399m0131k45743
2473.6G52838821J40534J22909r7732M9896j94855k00424o50101p83767n79529k06070
2483.3G50439682M1962j94474k29950O0425L88489M4098r3689j46790M1733j74331
2492.9G50177155o30036l12195o13479m55628j98822J17188K21481j40991Q774j45111
2502.6G48028336N8670l95127o02264l14331l07312j34049m73785J20697M15344L20587
2512.2G46716766k3803m90952J94626M0054q03680r65271J20773L27149l51410j29471
2521.9G44634781o8054n3101j46789J42822Q926p39364q24967l33633j59684m85458
2531.5G41975479l80630n45121k44140k7085J62507N82199Q8424J38626j72577n38482
$$ y = [756258011, 756493378, 755860367, 754789810, 754433899, 754222641, 753749237, 753412094, 753124695, 753084564, 752838821, 752979355, 753102264, 753004532, 753054428, 752859573, 752659149, 752009048, 751225281, 750645752, 750439682, 750481644, 750287170, 750057220, 750117645, 750506134, 750550232, 750456543, 750309753, 750351486, 750177155, 749547119, 749234924, 748621445, 748165817, 747966995, 748084183, 748305664, 748164673, 748173447, 748028336, 748087006, 747691879, 747089615, 746775284, 746467972, 746333923, 745860138, 745980835, 746396179, 746716766, 746692963, 746202011, 746396637, 746436691, 745633011, 744667740, 744788513, 745115662, 744764252, 744634781, 744566727, 744513626, 744366837, 744509659, 744518585, 743779221, 742954254, 742620621, 742460937, 741975479, 741594849, 741049728, 740805588, 740778503, 740941010, 741523209, 741611633, 741750259, 741577682, 741039200]
2541.1G41039200o66123o59561l25317l64151k07367m49143J6327M32053L37219Q0109
2550.8G39233246n56564m47693p37534o50253m21829l59116l12042m89960j84784k35367
2560.4G34838104K69318L40729J0757J93482j29242n23911p31277n21698m47922l55377
2570.1G32942963m96979m52118m1199J60370M03137O5689J24817j76849m74091m57534
2579.7G31598206j004792p47146l85285j62201k64740k04696j5106O0195N23301J04675
2589.4G29502411n49317o91604k53296p3090k19268o04401q65784j92566j49765J60828
2599G26064148N59082K87781m52500p93838k04697k52304p6523m49066o95877n64194
2608.6G23422012m14581K03400k99073r307Q926l70026j86386k73514K8077n27420
$$ y = [741039200, 740373077, 739713516, 739388199, 739024048, 738816681, 738367538, 738383865, 738815918, 739153137, 739233246, 738676682, 738228989, 737491455, 736841202, 736419373, 736060257, 735748215, 735258255, 735073471, 734838104, 735107422, 735448151, 735458908, 735652390, 735523148, 734999237, 734267960, 733746262, 733298340, 732942963, 732445984, 731993866, 731952667, 732113037, 732516174, 732581863, 732706680, 732529831, 732055740, 731598206, 730593414, 729846268, 729460983, 729298782, 729034042, 728829346, 728814240, 728874435, 729397736, 729502411, 728953094, 728261490, 728008194, 727935104, 727715836, 727111435, 726245651, 726053085, 725903320, 726064148, 726623230, 726911011, 726458511, 725664673, 725459976, 725207672, 725131149, 724682083, 723986206, 723422012, 723007431, 723210831, 722911758, 722902451, 722911377, 722541351, 722354965, 722081451, 722109528, 721582108]
2618.3G21582108p09153p85446j026001l52173K57492N7297m51507o0273k52075n71213
2627.9G17689056o60781p03431l16162m28085n83954q82111n04608q6975J33133J50070
2637.6G13806152n49545m73099p24716o27594k49481q10776p29828k48871k10342l15781
2647.2G08866119l73611l56216R6969k30636p95670l50418l81088o80619l84979l38211
2656.9G05071640q55942m35180k76719p28683k85950L8071K1133m30374n41611n99594
2666.5G00976791o62384n10025o37054o5613r5520j96228k38647n02396o714l6621
2676.1F98025589m36935o52543m32663n68084o78177l90320l17459L0594j06278l69491
2685.8F94104233n48020k75039M8065j52054n78613p28989J755m38233o64596l78647
$$ y = [721582108, 720872955, 720087509, 719061508, 718709335, 718966827, 719024124, 718572617, 718512344, 718260269, 717689056, 717028275, 716324844, 716008682, 715580597, 714996643, 714114532, 713609924, 713522949, 713656082, 713806152, 713256607, 712783508, 712058792, 711431198, 711181717, 710370941, 709641113, 709392242, 709181900, 708866119, 708492508, 708136292, 708233261, 708002625, 707206955, 706856537, 706475449, 705794830, 705409851, 705071640, 704215698, 703780518, 703503799, 702775116, 702489166, 702527237, 702548370, 702117996, 701576385, 700976791, 700314407, 699804382, 699167328, 699101715, 699006195, 698809967, 698571320, 698068924, 698062210, 698025589, 697588654, 696936111, 696503448, 695935364, 695257187, 694866867, 694549408, 694580002, 694473724, 694104233, 693556213, 693281174, 693329239, 693177185, 692598572, 691869583, 691871338, 691433105, 690768509, 690389862]
2695.4F90389862n17654k37198l18146N112k69165l84064k518k69775n82276r45663
2705.1F86868515n80292o01425m73633J30310m7302p32422p88803l1662l82690m17786
2714.7F82942810k24991n40008m49601n97229o84280l50876M02756k2736n23376l83988
2724.4F79568481n18493j00937m80347o98929l10669l79791l65143j06277K50854k9678
2734F76829071n07965k99912R1782m97131o24695j01776l96958o08215n84106l65982
2743.7F72934113n66178l00598M34723M1428M0664K61154k86254o58570m68674o53076
2753.3F70778732p49969k39411o1416j86920l30277o4239j65558m15650j74636k20871
2762.9F68169785k26059J5792k6474o46743q86002n68466K6779n0049m00924K69546
$$ y = [690389862, 689872208, 689635010, 689316864, 689321976, 689052811, 688668747, 688666229, 688396454, 687814178, 686868515, 686288223, 685686798, 685213165, 685343475, 685296173, 684563751, 683774948, 683743286, 683360596, 682942810, 682717819, 682177811, 681728210, 681130981, 680446701, 680095825, 680498581, 680475845, 679952469, 679568481, 679049988, 678949051, 678468704, 677769775, 677459106, 677079315, 676714172, 676607895, 676858749, 676829071, 676321106, 676021194, 676112976, 675615845, 674991150, 674889374, 674492416, 673884201, 673300095, 672934113, 672367935, 672067337, 672502060, 672543488, 672584152, 672845306, 672559052, 671900482, 671431808, 670778732, 670028763, 669789352, 669727936, 669541016, 669210739, 669146500, 668980942, 668565292, 668390656, 668169785, 667943726, 667959518, 667933044, 667286301, 666400299, 665831833, 665858612, 665808563, 665407639, 665677185]
2772.6F65677185L07694N035q13675j344070p70874o42395l95890m82483m37774l94287
2782.2F60708466m05121l0289L281r0332m35105k27966o45523j032944l65524m34036
2791.9F57044907p86896o96030k16217o09588n62592O1035n28793j251145j103286
2800.5F51351395k61460n36117q42438q38165r16977o43845r20868o77566n12543m08325
2810.2F44793091p20215r10568l17383p57599j025238j384430j150169m72946o77109
2818.9F37377434o68869j022072r90257p27234r78165j064682o75659o86226j435699
2827.6F29128571j418610j193886j164169r18465q21533j207695j428413j151734j192779
2836.2F18631287j193657j118698j292954j833305j964722j861763j981468j553650
$$ y = [665677185, 665984879, 665989914, 665176239, 663832169, 663061295, 662418900, 662023010, 661540527, 661102753, 660708466, 660303345, 660273056, 660276337, 660186005, 659750900, 659522934, 658877411, 657844467, 657478943, 657044907, 656258011, 655561981, 655345764, 654736176, 654173584, 654234619, 653705826, 652454681, 651351395, 651089935, 650553818, 649711380, 648873215, 647956238, 647312393, 646391525, 645713959, 645201416, 644793091, 644072876, 643162308, 642844925, 642087326, 641062088, 639677658, 638527489, 638054543, 637377434, 636708565, 635686493, 634696236, 633969002, 632990837, 631926155, 631250496, 630564270, 629128571, 627709961, 626516075, 625351906, 624433441, 623611908, 622404213, 620975800, 619824066, 618631287, 617437630, 616318932, 615025978, 613192673, 611227951, 609366188, 607384720, 605831070]
2843.9F05831070j523361j794091j959381k146873k100220j715469j486206j803284
2851.7E91302185j438179r91516r72481r96284q20389l86543j20125r0447q36296j330566
2861.3E83319359j425057j265716j145134j625710j705627j423683j268883j921578
2869E71537971j733589j381759j905823j624260k078705k042007j561127j991692j983375
2877.7E55235634j728897j504135j879692k083855j365013m70963m80957q70895q27217
2886.4E44024010j154976j082382n97344k53868l80096o55632p48330l72543L87268
2895.1E39166107k89459q26225l57476R2049l98941j076851n29671m07753m85649j040954
2904.7E33845177o39382q7547j111603r88617j132316j212807j502762j914368j182327
$$ y = [605831070, 604307709, 602513618, 600554237, 598407364, 596307144, 594591675, 593105469, 591302185, 589864006, 588872490, 587900009, 586903725, 586083336, 585696793, 585576668, 585486221, 584649925, 583319359, 581894302, 580628586, 579483452, 577857742, 576152115, 574728432, 573459549, 571537971, 569804382, 568422623, 566516800, 564892540, 562813835, 560771828, 559210701, 557219009, 555235634, 553506737, 552002602, 550122910, 548039055, 546674042, 546203079, 545722122, 544851227, 544024010, 542869034, 541786652, 541189308, 540935440, 540555344, 539899712, 539151382, 538778839, 539166107, 538876648, 538050423, 537692947, 537784996, 537386055, 536309204, 535779533, 535371780, 534886131, 533845177, 533205795, 533118248, 532006645, 531018028, 529885712, 528672905, 527170143, 525255775, 524073448]
2913.4E24073448j503334k245560k494278j569557j332092j647949j107559j389809
2921.1E10783310j220932j376495j558075q67043p38258p94945m24690j75057k70920
2929.8E03356895J70632N56640J104432Q47549L93257J302033J784248K167473J761513
2938.5E13444672J089096J468200K165299K651710K545700K476540K263527K284813
2946.2E30389557K216949K180863K615089K361298J832046J903191K290115K247277
2953.9E48036385K235260K013206J860581K301445K894325K594261J440391J685830
2961.6E65061684J689109J662560K126579J550637J272583J410865J879044J788750
2969.3E78441811J366577J448745J918488J898613J303139J595001J423187J409531
$$ y = [524073448, 522570114, 520324554, 517830276, 516260719, 514928627, 513280678, 512173119, 510783310, 509562378, 508185883, 506627808, 505760765, 505022507, 504227562, 503802872, 503627815, 503356895, 503527527, 504084167, 505188599, 506036148, 506429405, 507731438, 509515686, 511683159, 513444672, 514533768, 516001968, 518167267, 520818977, 523364677, 525841217, 528104744, 530389557, 532606506, 534787369, 537402458, 539763756, 541595802, 543498993, 545789108, 548036385, 550271645, 552284851, 554145432, 556446877, 559341202, 561935463, 563375854, 565061684, 566750793, 568413353, 570539932, 572090569, 573363152, 574774017, 576653061, 578441811, 579808388, 581257133, 583175621, 585074234, 586377373, 587972374, 589395561, 590805092]
2977E90805092J378593J107598J434784J139373R95064J358681J975441J476860J002083
2985.7F02673569J374550J074485O87142K16675N02853O52046N28336L45230K69813
2994.4F08324699Q67348O46286N83611J17988m7264K33078l2654K20719r613j23940
3004F10780258n69305p77893j01433J63307J35498k75421l46565m89998n76210m02451
3013.7F07539787k42653n15823j172256p50542k29683m04091j007423o72150j88179
3022.4F02356987q08640p42034o93093j472778j722031o59713k05727m88663n10216
3031E95054092o19163l75748r87243j523552j222802j032257j148109j313591q82874
3039.7E85948753o63108r50470j503411j164055r35859j056099m76647q52852j284675
$$ y = [590805092, 592183685, 593291283, 594726067, 595865440, 596860504, 598219185, 600194626, 601671486, 602673569, 604048119, 605122604, 605809746, 606026421, 606529274, 607181320, 607709656, 608054886, 608324699, 609192047, 609838333, 610421944, 610539932, 610492668, 610725746, 610693092, 610913811, 610904198, 610780258, 610210953, 609433060, 609331627, 609494934, 609630432, 609355011, 609008446, 608518448, 607942238, 607539787, 607297134, 606781311, 605609055, 604858513, 604628830, 604224739, 603217316, 602545166, 602356987, 601548347, 600806313, 600113220, 598640442, 596918411, 596258698, 596052971, 595564308, 595054092, 594434929, 594059181, 593071938, 591548386, 590325584, 589293327, 588145218, 586831627, 585948753, 585285645, 584335175, 582831764, 581667709, 580731850, 579675751, 579199104, 578346252, 577061577]
3048.4E77061577j178856o41594r76295j860924j452446j056557p54585j144028j002655
3057.1E66993637m20113r29336j141281j246033j387596j338654r49134j258774j250038
3065.7E57072678p45469j303787j199760q61016p74269r52835q28743j001663j648407
3074.4E47756729j041450j364212j688996j030006q67844j189842j456871r97734q33206
3083.1E37286568o13442n92994j001931j466560j500321j076011j459656j437111j215401
3091.8E26923141j023445q55941j048775p79495o99273r46121j428184j397743q69675
3100.5E17874489q37937j489334j701126r62295q21534r34410j450080j501160p55959
3109.1E07420654p93686r45358j215019j353569j344490j216278j035080j091995j086503
$$ y = [577061577, 575882721, 575241127, 574264832, 572403908, 570951462, 569894905, 569140320, 567996292, 566993637, 566573524, 565644188, 564502907, 563256874, 561869278, 560530624, 559581490, 558322716, 557072678, 556327209, 555023422, 553823662, 552962646, 552188377, 551235542, 550406799, 549405136, 547756729, 546715279, 545351067, 543662071, 542632065, 541764221, 540574379, 539117508, 538119774, 537286568, 536673126, 536080132, 535078201, 533611641, 532111320, 531035309, 529575653, 528138542, 526923141, 525899696, 525043755, 523994980, 523215485, 522516212, 521570091, 520141907, 518744164, 517874489, 517036552, 515547218, 513846092, 512883797, 512062263, 511127853, 509677773, 508176613, 507420654, 506626968, 505681610, 504466591, 503113022, 501768532, 500552254, 499517174, 498425179, 497338676]
3117.8D97338676j204681r12323p25021j190758j839371j482696q34008j061515j200714
3126.5D86887589j180954j130677j532783j252861n12123p36313q13408j060448j166916
3135.2D77501106j154403j484070j610680j407280j113319r78470r03549j155358j171875
3143.9D66522102r61761o51245r04541j508332j067085r74693j500702j436920q07076
3152.5D56709747r81712j282845j063194r71451o00547r37310j142349j352882j377869
3161.2D46999588j059608j390496j308365j329269p39441j053047j342926k39334m64745
3169.9D38072357o02798q73299j262360j721382j597099q48656j064377o58645q71277
3178.6D28572464j359787j242599o95572m12636r50852r46464j134377p33452r77745
$$ y = [497338676, 496133995, 495221672, 494496651, 493305893, 491466522, 489983826, 489149818, 488088303, 486887589, 485706635, 484575958, 483043175, 481790314, 481278191, 480541878, 479728470, 478668022, 477501106, 476346703, 474862633, 473251953, 471844673, 470731354, 469752884, 468849335, 467693977, 466522102, 465560341, 464909096, 464004555, 462496223, 461429138, 460454445, 458953743, 457516823, 456709747, 455728035, 454445190, 453381996, 452410545, 451809998, 450872688, 449730339, 448377457, 446999588, 445939980, 444549484, 443241119, 441911850, 441172409, 440119362, 438776436, 438537102, 438072357, 437469559, 436596260, 435333900, 433612518, 432015419, 431166763, 430102386, 429443741, 428572464, 427212677, 425970078, 425274506, 424861870, 423911018, 422964554, 421830177, 421096725, 420118980]
3187.3D20118980j540069j380539r52835l72658j371727j357193p04956o83174r85184
3195.9D10770645j170425o53038r70154m87709o39382j167030j091270j329575j015015
3204.6D02247047n86662Q7624r22089j126442n70869j659546j088906l43589m76189
3213.3C95560379r06105j079102r38110q79898q05664r50661o98433p92579n55954
3222C87953873o54335q58574p36656r06563k99378o53343j136627r31854q68607n82580
3231.6C80325356m40293p01980j102181p66106m87899n11399j143112j344566o67954
3240.3C73159866m18815m42391r37118q47473r34258n87578L2769m63105o79283r30023
3249.9C66952591p44934p34902m03556l98331r83772n04914p23037m47350m38042q87794
$$ y = [420118980, 418578911, 417198372, 416245537, 415872879, 414501152, 413143959, 412439003, 411755829, 410770645, 409600220, 408947182, 407977028, 407489319, 406849937, 405682907, 404591637, 403262062, 402247047, 401660385, 401748009, 400825920, 399699478, 399128609, 397469063, 396380157, 396036568, 395560379, 394654274, 393575172, 392637062, 391757164, 390951500, 390000839, 389302406, 388509827, 387953873, 387299538, 386440964, 385704308, 384797745, 384498367, 383845024, 382708397, 381776543, 380907936, 380325356, 379885063, 379183083, 378080902, 377314796, 376826897, 376315498, 375172386, 373827820, 373159866, 372741051, 372298660, 371361542, 370514069, 369579811, 368992233, 369025002, 368561897, 367882614, 366952591, 366207657, 365472755, 365069199, 364670868, 363687096, 363182182, 362459145, 362011795, 361573753, 360685959]
3259.6C60685959o20690m35409p04537j135826m01344n97572n48554o8817n66711o42357
3269.2C54964142p41921l10745m72450q25920r59282o24619J0224o93131o67419j26267
3278.9C49552612r2849q02689q26874j78489l39776k94952q77075q54340j49154k53411
3288.5C44883003o69670m33731k72789o96602l23295r93729r47800K68860j07040q20236
3298.2C39886971o29502j28288o54335p61185q14285o40221N72l29971j26266j11389
3307.8C35692101o28853j335297r01947q6784l24669m62227q81310l50761l88947p84416
3317.4C29546890l99322n29480m92821o75011l95355m41246n04150j01128j97678l17192
3327.1C25493507q08906j351547j421433k84119j98440n52292R842m87366n98392o64921
$$ y = [360685959, 360065269, 359629860, 358925323, 357789497, 357388153, 356790581, 356242027, 356173210, 355606499, 354964142, 354222221, 353911476, 353439026, 352613106, 351653824, 351029205, 351039429, 350346298, 349678879, 349552612, 349459763, 348657074, 347830200, 347651711, 347311935, 347016983, 346139908, 345285568, 345136414, 344883003, 344213333, 343779602, 343506813, 342810211, 342486916, 341493187, 340545387, 340814247, 340707207, 339886971, 339257469, 339129181, 338474846, 337713661, 336899376, 336259155, 336259727, 335929756, 335803490, 335692101, 335063248, 333727951, 332826004, 332739220, 332414551, 331952324, 331071014, 330720253, 330331306, 329546890, 329147568, 328618088, 328125267, 327450256, 327054901, 326613655, 326109505, 326008377, 325810699, 325493507, 324684601, 323333054, 321911621, 321627502, 321429062, 320876770, 320886612, 320399246, 319800854, 319135933]
3336.7C19135933p33662p04212p87029p41177m93660J35937n37930o97898m40674n70450
3346.4C13565178l43857o19774p93819n36442k96955p76386o20842o97670r26190j774
3356C07951469j69334l91922p24258j025429m11587m86374q69026m00734k58579q26111
3365.7C02388115m86298o60515m35428J58424j83067j01852n31178o14376p16324q36639
3375.3B97980862l89710m54902m46606n05982n63812m67453m0989o29959q54931J76335
3384.9B93802853k7924o6814m00563p22351k29168j04675j28784m11701o58455l34873
3394.6B90717545L29399j1483m96501o24085o25000J24035M46567K90242j47248j74656
3404.2B89828815k60009l75538k05460n07946j64184K34565R1496k95715l18585l39241
$$ y = [319135933, 318402271, 317698059, 316911030, 316169853, 315676193, 315812130, 315274200, 314576302, 314135628, 313565178, 313221321, 312601547, 311807728, 311271286, 310974331, 310197945, 309577103, 308879433, 307953243, 307951469, 307782135, 307390213, 306665955, 305640526, 305228939, 304742565, 303873539, 303472805, 303214226, 302388115, 301901817, 301241302, 300805874, 300964298, 300781231, 300679379, 300148201, 299533825, 298817501, 297980862, 297591152, 297136250, 296689644, 296183662, 295619850, 295152397, 295111408, 294481449, 293626518, 293802853, 293774929, 293708115, 293307552, 292585201, 292356033, 292251358, 292122574, 291710873, 291052418, 290717545, 291046944, 291035461, 290538960, 289914875, 289289875, 289413910, 289860477, 290150719, 290003471, 289828815, 289568806, 289193268, 288987808, 288479862, 288315678, 288550243, 288641739, 288346024, 288027439, 287688198]
3413.9B87688198j81541L19442O1894K11334J33476l5476k71244R6931Q40988l3932
3423.5B88830070j90830k90203k57339R1648K0828K46830K48833K95677j97353N5141
3433.2B88853302K22187L38020O30093l18546j24436O06041Q53634L79391L25603N50099
3442.8B92315388M89044P22713Q4420K27317n18341J56937J588192O53343P72763P59410
3452.5B97251186M75045L00598J38016K82306K69280L00846k2202Q80680J135140Q45394
3462.1C01856289O40774N50098J180801K95411l32318M6788P95631P15504N15403J244793
3471.7C07509174Q22564Q01105P76577M19350Q66699P77683L03421Q81405J124878
3480.4C14282856P57942Q97198J68877J185169J501217K64759O52141O76079R12285
$$ y = [287688198, 287506657, 287826099, 287887993, 288099327, 288232803, 288197327, 287926083, 288023014, 288864002, 288830070, 288639240, 288349037, 288091698, 288183346, 288204174, 288451004, 288699837, 288995514, 288798161, 288853302, 289075489, 289413509, 290043602, 289725056, 289600620, 290206661, 291060295, 291439686, 291765289, 292315388, 292804432, 293527145, 293611565, 293838882, 293320541, 293477478, 295065670, 295719013, 296491776, 297251186, 297726231, 298026829, 298164845, 298447151, 298716431, 299017277, 298995075, 299875755, 301010895, 301856289, 302497063, 303047161, 304227962, 304523373, 304191055, 304237843, 305033474, 305748978, 306264381, 307509174, 308331738, 309132843, 309909420, 310328770, 311195469, 311973152, 312276573, 313157978, 314282856, 315040798, 315937996, 316106873, 317292042, 318793259, 319058018, 319710159, 320386238, 321298523]
3489.1C21298523P59354Q86726J122093O89507Q98056O36444N58319O07223J098862
3497.8C28555107J425858J426696J153298M71954M95873K55203R26743J223602J175918
3506.5C37110252J353112R33075Q99391Q70933Q97446O29425J103210J324006J513519
3515.1C46634369J940498P73201L87650P07245J286621J331405Q78601M84162L86696
3523.8C54810448J664886J482353Q06351N74570R12094J212845J830139J635208K40746
3532.5C65169640J250915J366654J023597P19223N59082K093735K016792J431160J013871
3541.2C76644669J439552J079597Q82798O92787O76803K505455Q61550K022857K382126
3549.9C89188194J650391J799889j52092J724548J259079K141991K628974N08995J865960
$$ y = [321298523, 322057877, 322944603, 324066696, 324756203, 325654259, 326290703, 326849022, 327456245, 328555107, 329980965, 331407661, 332560959, 333032913, 333528786, 333783989, 334710732, 335934334, 337110252, 338463364, 339396439, 340295830, 341166763, 342064209, 342693634, 343796844, 345120850, 346634369, 348574867, 349348068, 349735718, 350442963, 351729584, 353060989, 353939590, 354423752, 354810448, 356475334, 357957687, 358764038, 359338608, 360250702, 361463547, 363293686, 364928894, 365169640, 366420555, 367787209, 368810806, 369530029, 370089111, 372182846, 374199638, 375630798, 376644669, 378084221, 379163818, 380046616, 380739403, 381416206, 383921661, 384783211, 386806068, 389188194, 390838585, 392638474, 392486382, 394210930, 395470009, 397612000, 400240974, 400749969, 402615929]
3558.5D02615929J877861J291351K86980K411003K777366J004563L263740R72214J693535
3567.2D18194542J749496N48211K714653J625404K413826K575989K445488J897201
3574.9D34164810J258393J861572K072563L035278J851616J276589J919098K861671
3582.6D50301590K517891J194878M048461L179474K68326J083756J32446L502083L764114
3591.3D69993019L299523J575126J093788L669052L49808K690621L748283Q38585L162460
3600D90420265K041588J863785K982635K107125K514038L719520L685685k46277L137855
3608.7E12226219M11759M49600Q110351J647759j453514L791046n10368M470253N065383
3617.4E34208488R53598J277581o25534J653633M012718L481522K199745K758217K806892
$$ y = [402615929, 404493790, 405785141, 406072121, 408483124, 411260490, 412265053, 415528793, 416501007, 418194542, 419944038, 420492249, 423206902, 424832306, 427246132, 429822121, 432267609, 434164810, 435423203, 437284775, 439357338, 442392616, 444244232, 445520821, 447439919, 450301590, 452819481, 454014359, 458062820, 461242294, 461510620, 462594376, 462726822, 466228905, 469993019, 473292542, 474867668, 475961456, 479630508, 479980316, 482670937, 486419220, 487257805, 490420265, 492461853, 494325638, 497308273, 499415398, 501929436, 505648956, 509334641, 509088364, 512226219, 512637978, 513087578, 521197929, 522845688, 521392174, 525183220, 524672852, 529143105, 534208488, 535162086, 536439667, 535814133, 537467766, 541480484, 544962006, 547161751, 549919968, 552726860]
3626E52726860K620468N997162j354065r013023N995903O030540N579567J223335j537666
3634.7E68269081K880135L229065J885910j8311J116524K986183L027992J551514R60655
3643.4E85888748K411766K994728N221825N37910k736587L832588k448158j462097
3651.1E94240723J747322N069694M832878M169197L142739p308655K794037N112038
3658.8F13799973R49478J520385N17006J278077J369361K075386K016068J036873L919487
3667.5F28482094J768532j644822P5417l862381L578568P543296O964569r01870j6241112
3676.2F25762291K873459P088508L672295n79071J407661K992325J541977O82526o6300
3684.9F45375671K72980L913193M597168p288208j143418O434632m315796M15420M610062
$$ y = [552726860, 555347328, 561344490, 559990425, 550977402, 556973305, 563003845, 568583412, 569806747, 568269081, 571149216, 574378281, 576264191, 576245880, 577362404, 580348587, 583376579, 584928093, 585888748, 588300514, 591295242, 596517067, 597054977, 594318390, 598150978, 595702820, 594240723, 595988045, 601057739, 605890617, 610059814, 613202553, 605893898, 608687935, 613799973, 614749451, 616269836, 616786842, 618064919, 619434280, 621509666, 623525734, 624562607, 628482094, 630250626, 628605804, 628681221, 624818840, 628397408, 635940704, 642905273, 642003403, 625762291, 628635750, 635724258, 639396553, 638817482, 640225143, 643217468, 644759445, 645441971, 645375671, 645648651, 649561844, 654159012, 646870804, 645727386, 652162018, 647846222, 648261642, 652871704]
3693.5F52871704R80835J967316N79834P5683J379090p6905K517395L174668m153748
3702.2F59315872j679153L806152J148300J11771J076584L032531L311387p543488
3709.9F62579956K867661L748703j1749878M761276M701233R31549P64236J970749
3717.7F70575485J398545k314072J431885L632965m092484k977218M625473J653289
3725.4F73933868r8571j647568L02124L393402J497803M397735l249969n924225Q421783
3734F81026382J446991q379287q66776K052460R86252K562484L139801l133087K952881
3742.7F81788101J1003494q282394j5430527Q684998M616470L916474l718949p584152
3750.4F74993515J1091537m153137p219772N560608M862442L316116m399643K379608
$$ y = [652871704, 653852539, 655819855, 656399689, 656475372, 657854462, 657777557, 660294952, 663469620, 659315872, 657636719, 661442871, 662591171, 662702942, 663779526, 666812057, 670123444, 662579956, 665447617, 669196320, 657446442, 662207718, 666908951, 667840500, 668604736, 670575485, 671974030, 669659958, 671091843, 674724808, 670632324, 667655106, 672280579, 673933868, 673835297, 672187729, 672489853, 675883255, 677381058, 681778793, 678528824, 672604599, 681026382, 682473373, 674094086, 673227310, 675279770, 676266022, 678828506, 681968307, 678835220, 681788101, 692791595, 684509201, 669078674, 677763672, 682380142, 686296616, 682577667, 674993515, 686085052, 681931915, 674712143, 680272751, 685135193, 688451309, 684051666, 686431274]
3758.2F86431274M926911q256912j307755M828644J892471P05414L526459k189179
3765.9F90557327m749450K885589N081558J45493q474731K114486K768326o8359J281051
3774.5F91541290K42691P61185L57056K021484j048737o567535L381500K916489P07169
3783.2F94312592J071090k680969o06613J259384J032562J118698K19880J50222j81579
3791.9F95695267L32412J99891J574020K879410l746567l139725K555847L722535M661331
3800.6G04734421o012726q944702L368377L391877M604873M591446r114914l022613
3808.3F93596039N372391J475830j99204Q67081N38330J209412M486084j486969j2820435
3817F93038559M081268N708161M371261J03150j6250916L464356N889206J618042J802139
$$ y = [686431274, 691358185, 683101273, 681793518, 686622162, 688514633, 689220047, 692746506, 690557327, 685807877, 688693466, 693775024, 693920517, 685445786, 687560272, 690328598, 690260239, 691541290, 691783981, 692545166, 692902222, 694923706, 693874969, 687307434, 690688934, 693605423, 694312592, 695383682, 692702713, 692096100, 693355484, 694388046, 695506744, 695726624, 695876846, 695695267, 696027679, 696227570, 697801590, 700681000, 696934433, 693794708, 696350555, 700073090, 704734421, 698721695, 689776993, 693145370, 696537247, 701142120, 705733566, 696618652, 693596039, 698968430, 700444260, 700245056, 701112137, 701650467, 702859879, 707345963, 705858994, 693038559, 697119827, 702827988, 707199249, 707302399, 691051483, 694515839, 700405045, 702023087, 703825226]
3825.7G03825226j72806m230118J075058L220902K700119K92740p172699L215713N601196
3834.3G08355331o066665J150131P988663p070694m010620O718597m858017k33154
3842.1G01973572O720199k204513m606171J711579J709671R00344J937638o81076J619644
3850.7G09080887M912033p025452p46994j0466156K032624Q558654j000824m31442
3858.4G04913330K192841K134018K538910m193039Q63189N556107n837555m591065
3866.2G03576736L538590M393082M867782p533874o912003M857712N254440J633072
3873.9G13675537r571457R22089M521332P03048K500992M482346n705719o769715N643616
3882.6G10402069J277466J074524L821106j1571503O88553M084167J621094M176941
$$ y = [703825226, 703652420, 699422302, 700497360, 703718262, 706418381, 706711121, 699538422, 702754135, 708355331, 702288666, 703438797, 711427460, 704356766, 700346146, 707064743, 702206726, 701973572, 708693771, 706489258, 701883087, 703594666, 705304337, 706204681, 708142319, 707461243, 709080887, 713992920, 706967468, 706220474, 695754318, 697786942, 706345596, 705344772, 704913330, 707106171, 709240189, 711779099, 707586060, 708449249, 714005356, 708167801, 703576736, 707115326, 711508408, 716376190, 708842316, 701930313, 706788025, 712042465, 713675537, 704104080, 705026169, 709547501, 710250549, 712751541, 717233887, 711528168, 704758453, 710402069, 711679535, 712754059, 716575165, 705003662, 705692215, 709776382, 711397476, 715574417]
3890.3G15574417j026764q017273J991272L734360j287308J64414L00140K613449J449127
3898.9G15495834q487243N285644K014618m658050L928222k720718j273728O08292
3906.7G10192871N58472J653900k1744n1880o10O75507O03179J88294J165848J597824
3916.3G16561661l399887k825623M233551j34582l606110J495285J504288J115570
3924G14944153j770706j638871K407151J520004M01993j183319o53458J644745k122727
3932.7G13548965k022705J280594P93610J188354P78656q88061n35736k54517J410904
3941.4G15300064J452637l079071l77121J117019K57493Q85162j121063R47113K93121
3950.1G15675354j630936J542740N15442j033020o64520R63898M85839p83310P04346
$$ y = [715574417, 714547653, 706530380, 708521652, 712256012, 710968704, 711133118, 711433258, 714046707, 715495834, 707008591, 712294235, 714308853, 709650803, 713579025, 710858307, 709584579, 710192871, 710751343, 712405243, 712383499, 712331619, 712331009, 713006516, 713609695, 713797989, 714963837, 716561661, 713161774, 710336151, 714569702, 714435120, 710829010, 712324295, 713828583, 714944153, 713173447, 711534576, 713941727, 715461731, 715863724, 714680405, 714026947, 715671692, 713548965, 711526260, 712806854, 713600464, 714788818, 715567474, 714679413, 714143677, 713889160, 715300064, 716752701, 713673630, 713296509, 714413528, 714671021, 715556183, 714435120, 715382233, 715675354, 714044418, 715587158, 716102600, 715069580, 714405060, 715368958, 715854797, 715071487, 715775833]
3958.7G15775833m12292M63256Q95386j280441j72043P60193L48892j77383P4463Q2168
3968.4G16358032r13772j013337Q09021R45969j87607O34308K67258l9902l1052j9836
3978G16809082R460k09579L51639k84348n08880l67508N24749P78046j74026J75018
3987.7G17103653k29721M66080K80075n62439m4022m73785l4714P9880k3651K7923
3997.3G16589279L36304M37546O4239
4000.2G17427368
$$ y = [715775833, 715363541, 715826797, 716722183, 715441742, 715269699, 716029892, 716378784, 716201401, 716275864, 716358032, 715444260, 714430923, 715239944, 716185913, 715998306, 716632614, 716899872, 716859970, 716828918, 716809082, 716818542, 716608963, 716960602, 716676254, 716167374, 715799866, 716324615, 717102661, 716928635, 717103653, 716873932, 717340012, 717620087, 717057648, 717013626, 716539841, 716505127, 716585007, 716561356, 716589279, 716925583, 717363129, 717427368]
##END=$$ End of the data block
