##TITLE=$$ Begin of the data block
##JCAMP-DX=5.00 $$ ACD/SpecManager v 10.08
##SPECTROMETER/DATA SYSTEM=Varian
##DATE=20 Nov 2012 10:34:52
##DATA TYPE=INFRARED SPECTRUM
##DATA CLASS=XYDATA
##ORIGIN=
##OWNER=
##NPOINTS=3735
##FIRSTX=399.26403809
##LASTX=4000.35498047
##MAXX=4000.35498047
##MINX=399.26403809
##MAXY=78.64654541
##MINY=28.69416237
##XFACTOR=1.0000000000
##YFACTOR=0.000000100000000
##FIRSTY=55.71848679
##DELTAX=0.96440572
##XUNITS=1/CM
##YUNITS=TRANSMITTANCE
##XYDATA=(X++(Y..Y))
399.3E57184868Q161011l884621j296578N186005J19591L903198L795929o986465n614434
407.9E60568504L185044r444619p912406N613937j269264J363678K135849L86428O869698
416.6E61496849J664848k192115N251007o895867m449768j003761j600227K85492k367669
425.3E50188789j680069M189110N94406N363083M335289q867264o322441j931648j891403
434E43977852q23517J749954J08834j635972M634705M089699N495720O777382l389588
442.7E60985069n819244j998482n5351l630448l074188M888611M493332q54378P60117
451.3E55695038L708038K612267m77715j282005K751579j884079p452431J406136k678871
460E52397957j487389K869454J496505q43124O85387K458954l409157m895935m180565
$$ y = [557184868, 565345879, 561461258, 560164680, 565350685, 565470276, 569373474, 573169403, 566182938, 560568504, 563753548, 554308929, 546396523, 552010460, 550741196, 552104874, 554240723, 554627151, 561496849, 563161697, 560969582, 566220589, 559324722, 554874954, 553871193, 552270966, 552556458, 550188789, 548508720, 552697830, 553292236, 558655319, 562990608, 554123344, 547800903, 545869255, 543977852, 543154335, 544904289, 545013123, 543377151, 548011856, 552101555, 557597275, 564374657, 560985069, 555165825, 553167343, 553111992, 549481544, 546407356, 551295967, 555789299, 554934921, 555695038, 559403076, 562015343, 561537628, 560255623, 563007202, 561123123, 553670692, 555076828, 552397957, 550910568, 553780022, 555276527, 554433403, 555118790, 557577744, 554168587, 549272652, 545092087]
468.7E45092087l858643q84132j223602P1792o88438j208267N019340P178307k551995
477.4E46946449n724411l648910j372147N22423m207611m452591k358627K39982J771622
486.1E27716179L752861M354629j513481k640114L61062K153968l990860p020530K09617
494.7E23383331K400894J153679k055320q62160L014221K768021L782386j241416o190072
503.4E26153564k836189k991485m356652m648742l860894J177941L487549o74744r42879
512.1E10507469j951561p2479N16357k840385o555252o053887J823998l08838l807983
520.8D91257439j601181L261032K429924k653160J69296q94280j62200j104508k979927
529.5D87722435l51486l78876J404305j072045k09961M574089M177819K026176J197357
$$ y = [545092087, 541233444, 540349312, 539125710, 539197502, 538509064, 537300797, 542320137, 549498444, 546946449, 541222038, 537573128, 536200981, 536723404, 532515793, 528063202, 525704575, 525944557, 527716179, 531469040, 535823669, 534310188, 531670074, 532031136, 534185104, 530194244, 523173714, 523383331, 525784225, 526937904, 524882584, 524020424, 527034645, 529802666, 533585052, 532343636, 526153564, 523317375, 520325890, 515969238, 511320496, 507459602, 508637543, 512125092, 511450348, 510507469, 508555908, 508483429, 508999786, 506159401, 499604149, 493550262, 495374260, 495065422, 491257439, 489656258, 492917290, 495347214, 492694054, 492863350, 491969070, 491806870, 490702362, 487722435, 487370949, 486992073, 488396378, 487324333, 487114372, 491688461, 495866280, 497892456, 499089813]
538.1D99089813O97785J67427Q34160n87731O03028P25173o90956J334610J902008
546.8E04075317L543091K977638J576806p24602k974129k764473k640381j897087l915863
555.5D97256317j034775P64847j575126K07061J387940o9504k785378O62880J26152
564.2D94940414m924011m453201n116654k841606j156082j416206j224518O24504l19137
572.9D74113503j447106O24123j293946j65939J13602m83666l60870q5106L235397
581.5D74249992L133088L524246L967476M009895K661705J644936J446037N57937K47078
590.2D95442390j151504p93686j230888k16561L030014L462296K474251P63130J114654
598.9E02894096P07245M3831j037598k447853j587638j416665j1291n303O46401K449036
$$ y = [499089813, 499787598, 499955025, 500789185, 500201454, 500804482, 501529655, 500838699, 502173309, 504075317, 507618408, 510596046, 512172852, 511448250, 508474121, 505709648, 503069267, 501172180, 497256317, 496221542, 496986389, 495411263, 495618324, 497006264, 496936760, 494151382, 494814262, 494940414, 490016403, 485563202, 480446548, 477604942, 476448860, 475032654, 473808136, 474432640, 474113503, 472666397, 473290520, 471996574, 471830635, 471944237, 471460571, 471099701, 471014595, 474249992, 477383080, 480907326, 484874802, 488884697, 491546402, 493191338, 494637375, 495195312, 495442390, 494290886, 493497200, 492266312, 492049751, 495079765, 498542061, 501016312, 501779442, 502894096, 503601341, 503645172, 502607574, 500159721, 498572083, 497155418, 497144127, 497138824, 497785225, 500234261]
608.5E00234261J246604M88129R65881L81928p00912p46727k148629o86226J305962
617.2E00340271J497383K968445J701279L104362L937302K645950J604309o66962j67655
625.9E16964684J87606j159973j203537J392365K670555J894951L219757L183059J409150
634.6E28558617P46917J014252k86598k012711k110214j147613R71107J405373J430397
643.3E28569527J770324K882080L713875K395630R74541M90684R04160l69530j099777
651.9E40231514j33667p01523o04324J068725K858506J989135J399880K244835Q79287
660.6E49232368o45179r60541j058922j698913j390229L46299J249694M272995L050309
669.3E52397881J986732P91931R22394J486664L3226n4283o29883j280098n63469m0360
$$ y = [500234261, 501480865, 501968994, 502934875, 503316803, 502615891, 501869164, 499720535, 499034309, 500340271, 501837654, 504806099, 506507378, 509611740, 513549042, 516194992, 517799301, 517132339, 516964684, 517152290, 515992317, 514788780, 516181145, 518851700, 520746651, 523966408, 527149467, 528558617, 529305534, 530319786, 530033188, 528020477, 525910263, 524762650, 525733757, 527139130, 528569527, 530339851, 533221931, 536935806, 539331436, 540305977, 540796661, 541700821, 541331291, 540231514, 540097847, 539396324, 538792000, 539860725, 542719231, 544708366, 546108246, 548353081, 549232368, 548587189, 547626648, 546567726, 544868813, 543478584, 543824883, 545074577, 549347572, 552397881, 554384613, 555176544, 556098938, 557585602, 557618828, 557564545, 556934662, 555654564, 555091095, 555050735]
678.9E55050735R83506J936569K376480K617073K114868J081581O37322k13890j629906
687.6E64954338j258583r81369j365623r89914k41509O94275J450386K243462J577186
696.3E66082649p92846j738549k308731k688293j890908k129669j455497j13221q0681
705E52884254Q24471J667938J760788Q33779L85131J29013o88552M13322M70238p8354
714.6E58602028M11415J130562L669395M995728L460960J871071K434502K947769J312523
723.3E80835953O99730K41890J12877J717224K824897K557640K613831L956375L348503
732E98908920K623024J951447L29666n4932j117897q67767l58391k41394L15170J071816
741.6F02559662K749634L134117K303352N39704m89846j645546k724189k297440k081833
$$ y = [555050735, 556034241, 557970810, 560347290, 562964363, 565079231, 566160812, 566798134, 566584244, 564954338, 563695755, 562714386, 561348763, 560358849, 560117340, 560811615, 562262001, 564505463, 566082649, 565289803, 563551254, 561242523, 558554230, 556663322, 554533653, 553078156, 552964935, 552884254, 553708725, 555376663, 557137451, 557971230, 558356361, 558485374, 557796822, 558210144, 558680382, 558602028, 559013443, 560144005, 563813400, 568809128, 572270088, 574141159, 576575661, 579523430, 580835953, 581535683, 581777573, 581890450, 583607674, 586432571, 588990211, 591604042, 595560417, 598908920, 601531944, 603483391, 603813057, 603758125, 602640228, 601772461, 601414070, 601172676, 601487846, 602559662, 605309296, 608443413, 610746765, 611286469, 610796623, 609151077, 606426888, 604129448, 602047615]
750.3F02047615k276039l196564j494140L39202P91474J259117k97813j213799j607208
759E94351845k990380m016914k331772k060776l129730r20601k87208L64761K095986
767.7E81075211K498397L037758K765961J893845k37694o60515l891L55034J784897
776.4E92509003J923179L001442M388733M697037M809837M435044L694000K889175
784.1F22347450K204094L32031p24J229972K297440K798920L613090M185334L078117
792.7F42085724K962036K559967J847534J108475J79443o50863n97840N56183J74942
801.4F50225601J42212J793976L111191K155075J781387J146240p54242j396026k818909
810.1F55386505k954330l039933k011108k03552M91180J206818Q95462J640396J060257
$$ y = [602047615, 599771576, 596575012, 595080872, 595420074, 596211548, 597470665, 597172852, 595959053, 594351845, 591361465, 587344551, 585012779, 582952003, 579822273, 578901672, 578614464, 578979225, 581075211, 583573608, 586611366, 589377327, 591271172, 591033478, 590372963, 590369072, 590724106, 592509003, 594432182, 597433624, 601822357, 606519394, 611329231, 615764275, 619458275, 622347450, 624551544, 624883575, 624882851, 626112823, 628410263, 631209183, 634822273, 639007607, 642085724, 645047760, 647607727, 649455261, 650563736, 650743179, 650092316, 649494476, 650050659, 650225601, 650367813, 652161789, 655272980, 657428055, 659209442, 660355682, 659601440, 658205414, 655386505, 652432175, 649392242, 647381134, 647177582, 647668762, 648875580, 649771042, 651411438, 652471695]
818.8F52471695J94855o45371q85391k32697j840972j140976l92838M08096J018830
827.5F48955231O88553R45510l28369k92206p86895r02481j206437k418975k668228
836.1F41985703l261261k517090j026955J139526J016350J03150O46171k41165n87273
844.8F37257156j290664k943878l568039k232438j826858j281433q27866j717682k00119
853.5F21368179M40560k21291j743126l005218l348885m181442k622795j847878j283149
862.2F03554955O16378K472992M247895M286880N323677N831795M222641K548408K208062
870.9F35313683K915420K581520J921234J633759K460022K882614L299637L323822
878.6F56331711L208542J809921p53326p78580k170410l225022l377990k216645j348571
$$ y = [652471695, 652666550, 652021179, 651135788, 650903091, 649062119, 647921143, 647528305, 647936401, 648955231, 649643784, 650589294, 650260925, 649968719, 649181824, 648279343, 647072906, 644653931, 641985703, 638724442, 636207352, 635180397, 636319923, 637336273, 637439423, 638085594, 637844429, 637257156, 635966492, 633022614, 629454575, 627222137, 625395279, 624113846, 623285980, 621568298, 621368179, 621808739, 621587448, 619844322, 616839104, 613490219, 609308777, 606685982, 604838104, 603554955, 604171333, 606644325, 610892220, 615179100, 620502777, 626334572, 630557213, 633105621, 635313683, 638229103, 640810623, 642731857, 644365616, 646825638, 649708252, 653007889, 656331711, 659540253, 661350174, 660596848, 659818268, 657647858, 654422836, 651044846, 648828201, 647479630]
887.3F47479630k394257j467056j160584l68728n57862j708984j858177k689248k668876
895.9F32605858k958031l146973k843589j955071j550064j094742O0730n71823j443329
904.6F17102966j841507k675895m491845m631347l494682l579064l838997m152527
912.3E88397102l466491l085022k996178k879028l425865l466073m018631m150466
920E60909348k915345k388496k269211j318245j28555N01213N69115O67419Q19626
928.7E54446869J051750O35452n01938n90553O33507P57523K24227N82390J387062
937.4E58626289K542992L139114L103676K174034J576996J864701J245651M24957m77600
946.1E74220810j662140k547417k162628j764908j798973j674728l051529m132118
$$ y = [647479630, 645085373, 643618317, 642457733, 642089005, 641531143, 639822159, 637963982, 635274734, 632605858, 629647827, 626500854, 623657265, 621702194, 620152130, 619057388, 619118118, 618546295, 617102966, 615261459, 612585564, 608093719, 603462372, 599967690, 596388626, 592549629, 588397102, 584930611, 581845589, 578849411, 575970383, 572544518, 569078445, 565059814, 560909348, 557994003, 555605507, 553336296, 552018051, 551889496, 552390709, 552959824, 553627243, 554446869, 555498619, 556134071, 555632133, 555041580, 555675087, 556432610, 556656837, 557239227, 558626289, 561169281, 564308395, 567412071, 569586105, 571163101, 573027802, 574273453, 574698410, 574220810, 572558670, 570011253, 567848625, 566083717, 564284744, 562610016, 559558487, 555426369]
953.8E55426369m615593o007653o462669o777649o541939n932960o081963n760727
961.5E07245216o370086o341095n996208n968285o476860o907234p128144q637809
969.2D53419495q184014q666839q730049q379593r073525q414154q468208p766686
976.9C85736427q393593p944984p696762p721405p116776p779121o083870n384025
984.7C27615891m369545m551659m177857l740673l130989j164016k594796j758098
992.4C02128258j254254n03749j575394j807575K45285q12168M86278r8076M76113
1001.1B97284718N07392L97892M43211j176395k87667k000694n94883o45027j102123
1009.7B92826424n74684j749707j72901j254082n98373j075096l71437K98900l87420
$$ y = [555426369, 550810776, 544803123, 538340454, 531562805, 525020866, 519087906, 513005943, 507245216, 500875130, 494534035, 488537827, 482569542, 476092682, 469185448, 462057304, 453419495, 445235481, 436568642, 427838593, 419459000, 410385475, 401971321, 393503113, 385736427, 377342834, 369397850, 361701088, 353979683, 346862907, 339083786, 332999916, 327615891, 323246346, 318694687, 314516830, 310776157, 307645168, 306481152, 303886356, 302128258, 300874004, 300370255, 298794861, 296987286, 297232571, 296420403, 296906681, 296808605, 297284718, 297792110, 298190002, 298633213, 297456818, 297169151, 295168457, 294573574, 293928547, 292826424, 292251740, 290502033, 290329132, 289075050, 288476677, 287401581, 287030144, 287329044, 286941624]
1018.4B86941624P40738n85461O83670J77994J057548R76506O27269J473408J67866
1027.1B92261162J906814Q67730J960468J332817Q96091J263161l82442J650943J19839
1035.8C01876583J140480Q71468M14676M68140r59263L51258q50811O36501j74790
1044.5C03774242M2077l81909j520538R56554J51959J073169K49939J979027L049240
1053.1C09373760K476197K038974J532994M160366K048301K845345K643127K730103
1060.9C29849167L886032L271332M891319M177742M818268K192764J348725L06816
1068.6C54742165j589394j735039m710541l210144m075431l178330k266693k261200
1076.3C31715393p02934j800652O98548L40767J737747J283264N81322K161216K504807
$$ y = [286941624, 287682362, 287096901, 287780571, 287958565, 289016113, 289992619, 290619888, 292093296, 292261162, 294167976, 295035706, 296996174, 298328991, 299225082, 300488243, 300105801, 301756744, 301876583, 303017063, 303888531, 304303207, 304771347, 303812084, 304163342, 303312531, 303949032, 303774242, 303816319, 303434410, 301913872, 302870426, 303022385, 304095554, 304345493, 306324520, 309373760, 311849957, 313888931, 315421925, 319582291, 321630592, 324475937, 327119064, 329849167, 333735199, 337006531, 341897850, 346075592, 350893860, 353086624, 354435349, 354742165, 353152771, 351417732, 346707191, 343497047, 339421616, 336243286, 333976593, 331715393, 331012459, 329211807, 329910355, 330251122, 331988869, 333272133, 333853455, 336014671, 338519478]
1085C38519478L811378J879464M114418L227500K423935L687554L056297L418923K406730
1093.6C66545677L459053P16095J026497J864967R06525J868286L27111R47303m93850
1102.3C77167664L81851Q28018J13640M57153n71594J344337J213189K155380J934738
1111C85024376K085724K731056K557983L882599K697525K980881J376305J252937J831779
1119.7D06421165J013985J256523M42581J551476Q45680J510582K085800J554985J489373
1128.4D18172150J200370K343598J296196J583061J003151R63287J237145M05769O53343
1137D28858070q33740m41589j131821j688156k477074l316345k774849l578567k369576
1145.7D10246353l230247k397461j782952j923904o73180j111717Q1139q46215j15089
$$ y = [338519478, 342330856, 344210320, 348324738, 351552238, 353976173, 357663727, 360720024, 364138947, 366545677, 370004730, 370720825, 371747322, 373612289, 374518814, 376387100, 376714211, 377661514, 377167664, 377549515, 378377533, 378491173, 378948326, 378376732, 379721069, 380934258, 383089638, 385024376, 387110100, 389841156, 392399139, 396281738, 398979263, 401960144, 403336449, 404589386, 406421165, 407435150, 408691673, 409134254, 410685730, 411531410, 413041992, 415127792, 416682777, 418172150, 419372520, 421716118, 423012314, 424595375, 425598526, 426561813, 427798958, 428204727, 428858070, 428024330, 427582741, 426450920, 424762764, 422285690, 418969345, 416194496, 412615929, 410246353, 407016106, 404618645, 402835693, 400911789, 400238609, 399126892, 399208031, 398361816, 398246727]
1154.4C98246727m63257l35769R15603j4152R50698J020546L164139K710495L341561
1163.1D09536591M606170M238968N975304M612541N277710N659637N278016N047073
1170.8D50232010N497017O571083O019325O951561O435585O479073O488075O150207
1178.5E00823936N847321M426231L867493L795967M192734L652687L805733L912925
1186.2E34325027L404770L626976L285218K757949J905251J384621R78660O15959J86806
1194.9E52471237k18353J47781J7357r918Q71696J543045J237679J062736O05240k91862
1204.5E57436638k48642k32544J70784K76680K05688J197777J675568J688309J765518
1213.2E63935776J897773J865731J568222L31535m31022k7390n0125k88811m63409
$$ y = [398246727, 397783470, 397447701, 398363304, 398349152, 399299850, 400320396, 403484535, 406195030, 409536591, 414142761, 418381729, 424357033, 428969574, 434247284, 439906921, 445184937, 450232010, 455729027, 462300110, 468319435, 475270996, 481706581, 488185654, 494673729, 500823936, 506671257, 511097488, 514964981, 518760948, 522953682, 526606369, 530412102, 534325027, 537729797, 541356773, 544641991, 547399940, 549305191, 550689812, 551668472, 552284431, 552471237, 552252884, 552400665, 552418022, 552408104, 553279800, 554822845, 556060524, 557123260, 557728500, 557436638, 557187996, 556955452, 557126236, 557402916, 557608604, 558806381, 560481949, 562170258, 563935776, 565833549, 567699280, 569267502, 569599037, 569168015, 569140625, 569090500, 568801689, 568338280]
1221.9E68338280j80321K09312L38402M63219n226q36144j329498j109352j440315
1230.6E64448357k150917j793404j233521n46531l15476j19857N53359J14060m52919
1239.3E58503151j26877j03836q28514j275444j606407j225281q4076M78630J300087
1247.9E55031433J387711J250496J565017J085549N87349J38626k89040j8844k54136
1256.6E60484161q22029l44734M42352O39077P41996J015931J255989J404991J168060
1265.3E65985794L27988k76108k47269M32434N48363Q8654N40084J409684J601906
1274E70411530J583747J625328R81408N23224J25694m12369j006660j485939r38378
1282.7E71407585l73649L19480N77813N80368J156807J279907Q62961J04866l61328
$$ y = [568338280, 568157959, 568367271, 568705673, 569168892, 569163666, 568327522, 566998024, 565888672, 564448357, 562297440, 560504036, 559270515, 558723984, 558408508, 558288651, 558842010, 558956070, 558503151, 558376274, 558272438, 557443924, 556168480, 554562073, 553336792, 553252716, 553731346, 555031433, 556419144, 557669640, 559234657, 560320206, 560907555, 561046181, 560757141, 560738297, 560484161, 559662132, 559317398, 559759750, 560398827, 561140823, 562156754, 563412743, 564817734, 565985794, 566313782, 566037674, 565790405, 566222839, 566771202, 566859856, 567399940, 568809624, 570411530, 571995277, 573620605, 574602013, 575125237, 575250931, 574838562, 573831902, 572345963, 571407585, 571033936, 571353416, 571931229, 572511597, 573668404, 574948311, 575811272, 575916138, 575554810]
1291.3E75554810q91915j126404j388244j404000q53996o42776j53618j78909P858
1300E68922806J94969m95491r30862j428299j970711k008286j120643j152535j429291
1308.7E58581657p89680m99954j81046j80321n5389k53067j128616j011696q22029
1317.4E53659859j234360j637039j232758o04362m95758l75672l54347m09470p34558
1326E46581535j481590k174797k308578k278405k509842k465553k189026j699219q42857
1334.7E28631668n41992l06435l85399m36706r24912l53431M43077m44069n26276l72925
1344.4E24782600P8125J21270N77926J171837P17659R66416N72166K33459j55448m07868
1354E28658142r74579j424637p93266p43751o6834K4223m1351r4566l94440N1575J50375
$$ y = [575554810, 574662895, 573536491, 572148247, 570744247, 569890251, 569247475, 569093857, 568914948, 568922806, 569117775, 568622284, 567691422, 566263123, 564292412, 562284126, 561163483, 560010948, 558581657, 557791977, 557292023, 557110977, 556930656, 556875267, 556622200, 555493584, 554481888, 553659859, 552425499, 550788460, 549555702, 548951340, 548455582, 548079910, 547725563, 547316093, 546581535, 545099945, 542925148, 540616570, 538338165, 535828323, 533362770, 531173744, 529474525, 528631668, 528089676, 527783241, 527397842, 526961136, 526036224, 525682793, 526125870, 525681801, 525155525, 524782600, 524860725, 524981995, 525559921, 526731758, 527449417, 528415833, 528987999, 529221458, 529066010, 528658142, 527683563, 526258926, 525465660, 524721909, 524655075, 524679298, 524637947, 524543381, 524148941, 524200516, 524350891]
1364.6E24350891L01323q81309j002312p75719l78189j48315m07486J121826Q25767
1373.3E23006477R58786J692620J562500J082229M9744K21176n61676j13068j31645
1382E27767143j05896Q90389J009865J855926J550675K199478K140007J759834R38721
1390.7E40006142O9122k69470o42433j049157j802749N95550K16675p19299m85954
1399.3E35918427M20951O80123r74770q03146j374550k465477j145325o32171l00484
1408E29323578r91249q27904j076889m15268J71089k96058k19956q18138o26640j638680
1417.7E22583885q37707j533509K76566J767692O1303N09643N37987J466179J250687
1426.3E26082726K05421M91409n72662m5471M12025J298676N01785P8621J585083R51958
$$ y = [524350891, 524652214, 523770905, 522768593, 521992874, 521614685, 521466370, 521058884, 522180710, 523006477, 523965263, 525657883, 527220383, 528302612, 528352356, 528573532, 528011856, 527898788, 527767143, 527661247, 528551636, 529561501, 531417427, 532968102, 535167580, 537307587, 539067421, 540006142, 540075264, 539805794, 539163361, 538114204, 536311455, 536907005, 537123680, 536404381, 535918427, 536339378, 537019501, 536044731, 535241585, 533867035, 531401558, 530256233, 529624062, 529323578, 528332329, 527504425, 526427536, 526012268, 526183357, 525887299, 525667343, 524849205, 524222565, 522583885, 521746178, 520212669, 520489235, 522256927, 522318230, 522827873, 523365860, 524832039, 526082726, 526288147, 526779556, 526206894, 526161423, 526573448, 527872124, 528373909, 528452530, 530037613, 530989571]
1436E30989571L58467O83784J849060N89447L62511K68478k42920M20456n79643P28645
1445.6E35427856K39144m15306j96457O43921Q38127p15408n66712j435928K35176
1454.3E34054413n63393j261253j574021k844314L787613P67059L047905J460991J126022
1463E38001022J927491p19719L507156J857224L012084J914521K770729L691635K150268
1471.7E58112411O166916M152756O950302L993492M796639M114799L089180L295861
1479.4E94672356J352081K595367K062264L496475L147698K994422L429909J103211
1487.1F14853783L282699K260628J973610M44145K012482J736336K40707J431236n49507
1495.8F27686119m44145K464905K275772J692009J448173J306992J90277J053047j3199
$$ y = [530989571, 531348038, 532031822, 533880882, 534470329, 534832840, 535101318, 534858398, 535278854, 534699211, 535427856, 535667000, 535251694, 535055237, 535699158, 536537285, 535821877, 535255165, 533819237, 534054413, 533491020, 532229767, 530655746, 527811432, 531599045, 532366104, 535414009, 536875000, 538001022, 539928513, 539208794, 542715950, 544573174, 547585258, 549499779, 552270508, 555962143, 558112411, 564279327, 568432083, 575382385, 579375877, 584172516, 588287315, 591376495, 594672356, 596024437, 598619804, 600682068, 604178543, 607326241, 610320663, 613750572, 614853783, 618136482, 620397110, 622370720, 622814865, 624827347, 626563683, 626804390, 628235626, 627686119, 627241974, 629706879, 631982651, 633674660, 635122833, 636429825, 636620102, 637673149, 637659950]
1504.5F37659950J46942m134292p267304L838959K281494L052864J984330J667442
1512.2F39230385P61032J308250L72925j025314j031838j038704L767853J448136j416703
1520.8F42376022k033691J609573N433502K149430M45709J16806J227951L9444l99475
1529.5F50965271Q36334j84250P00760j991882j103439L247451J857148J438446M59137
1538.2F56224976l054581o375656M098053Q81576n68542K046585o83823P32880K837219
1546.9F56138687J614151Q4839o02036R05838J749421P27768m64402k178726M09622
1555.6F58385162K838288J658020l388672k745056N67932L426437J847916J170959
1563.3F63760986k30407j934357k73285L97186k00348j926117m123840J554947J493683
$$ y = [637659950, 637806892, 633672600, 626405296, 630244255, 632525749, 635578613, 637562943, 639230385, 639991417, 641299667, 641672592, 640647278, 639615440, 638576736, 642344589, 643792725, 642376022, 640342331, 641951904, 647385406, 649534836, 649980545, 650097351, 651325302, 651364746, 650965271, 651801605, 651617355, 652318115, 650326233, 649222794, 652470245, 654327393, 655765839, 656224976, 653170395, 646794739, 650892792, 651774368, 651205826, 653252411, 652568588, 653301468, 656138687, 657752838, 657837677, 657235641, 658141479, 659890900, 660618668, 660154266, 657975540, 658385162, 661223450, 662881470, 659492798, 656747742, 657315674, 660742111, 662590027, 663760986, 663530579, 661596222, 661322937, 661720123, 661519775, 659593658, 655469818, 657024765, 658518448]
1572F58518448L48663j71585k99454j333770n071488J109848N341j562271j202545
1580.6F50341187j708985j021805j005478q13217r42535j030197j140366j894836j831742
1589.3F38952026l006019k452698k707710k468186k340583k379303j169510j540451
1597F20887566q37937j877556j725845k343330k979584k402763k998467j673469k676697
1605.7F01371918k197800k480812j878929j578674k101746n72395k309418k078171
1613.4E86173973l062210j782379j690979p399483J79520q72612n48477j374283k7848
1622.1E69595222j866683m481507P42684j68496j08566l369293j600571p27806j349029
1630.8E56665955n32494q60786N03883n51109j480751j736794J512833Q65783N16396
$$ y = [658518448, 658867111, 658695526, 658396072, 657062302, 651990814, 653100662, 653106003, 651543732, 650341187, 648632202, 647610397, 646604919, 645791702, 644849167, 643818970, 642678604, 640783768, 638952026, 635946007, 633493309, 630785599, 628317413, 625976830, 623597527, 622428017, 620887566, 620049629, 618172073, 616446228, 614102898, 611123314, 608720551, 605722084, 604048615, 601371918, 599174118, 596693306, 594814377, 593235703, 591133957, 590561562, 588252144, 586173973, 583111763, 581329384, 579638405, 572238922, 572418442, 571545830, 570997353, 569623070, 569595222, 567728539, 563247032, 563989716, 563821220, 563712654, 560343361, 558742790, 558014984, 556665955, 556133461, 555272675, 555776558, 555225449, 553744698, 552007904, 553520737, 554386520, 554902916]
1639.5E54902916Q62007n34782J394882k02446R95254J035271j864967J928673J175193
1648.1E59692001L170929J336212J745110Q64372l123893l72124K507858L495369J661758
1656.8E70977592K470322J429863J830292K296448J900062J787987J114616L279686
1664.5E87086868J821022J983643J852722J491737J587334J754341M079628K982292
1672.3F04639587L870354L365288K094841K650299L632507L654671K205238K131996
1680F28244781K451554M130173L574867m81796P79304N679627N463867L882217K279892
1688.6F56004486K361069K668686K792968K398301J731796K344513K014313j018982
1696.4F71297150L281784L685531M264222J253128k769547M039002K999649R65805
$$ y = [554902916, 555764923, 555230141, 556625023, 556422577, 557417831, 558453102, 556588135, 558516808, 559692001, 562862930, 564199142, 565944252, 566808624, 563684731, 563312607, 565820465, 569315834, 570977592, 573447914, 574877777, 576708069, 579004517, 580904579, 582692566, 583807182, 587086868, 588907890, 590891533, 592744255, 594235992, 595823326, 597577667, 601657295, 604639587, 608509941, 611875229, 613970070, 616620369, 620252876, 623907547, 626112785, 628244781, 630696335, 634826508, 638401375, 637919579, 638698883, 644378510, 649842377, 653724594, 656004486, 658365555, 661034241, 663827209, 666225510, 667957306, 670301819, 672316132, 671297150, 674578934, 678264465, 682528687, 683781815, 681012268, 685051270, 688050919, 689016724]
1704.1F89016724n71823O39495q53958J650696K582550Q45337K28729J207581J415634
1712.8F96160965L65143p19757j135178J084213m74243l698730L355941J942826J215973
1721.4F98097153P72094J93863P13730J370239R24302k5025M0055j47782q49075j77612
1731.1G00911942J329727J021881l992920k051468M176025K739411J105346J707840
1738.8G06947784k85339j617660K644348J205368n14221J085739K047958J511002J177978
1747.5G14202957J840134J250305K630768P20138R79462L151321J652451J875305J945954
1756.2G30248795K23465J319732K356339J866531J801529R2773M81415K451020J245040
1764.8G42086639P33796J016082O19889j045456J360168K206116l35770m90341O00891
$$ y = [689016724, 688444901, 689084396, 688230438, 689881134, 692463684, 693309021, 693537750, 694745331, 696160965, 696526108, 695806351, 694671173, 695755386, 695281143, 691582413, 694938354, 696881180, 698097153, 698869247, 699063110, 699776840, 701147079, 702071381, 702046356, 702086411, 701938629, 701089554, 700911942, 702241669, 703263550, 699270630, 697219162, 701395187, 704134598, 705239944, 706947784, 706662445, 705044785, 707689133, 708894501, 708380280, 709466019, 711513977, 713024979, 714202957, 716043091, 717293396, 719924164, 720644302, 721623764, 724775085, 726427536, 728302841, 730248795, 730472260, 731791992, 734148331, 736014862, 737816391, 737909164, 738390579, 740841599, 742086639, 742820435, 743836517, 744456406, 743410950, 744771118, 746977234, 746641464, 746151123, 746752014]
1773.5G46752014K896576J442642l42025J300048L30582O42395k57873n06745J306076
1782.2G53563690J339646J235885k49252L05023J082306M34341J85395O30798j70975
1790.9G58356857q62961j723938N12162K868194O00968l06473J000977R96017L47900
1799.5G61789703l54232Q91113m21372K77787P75222k9449K57874k74506p1259Q37098
1809.2G63677979J377182k97547R4452R80835L57361L86734j03226K28424p92694o3782
1818.8G65845718P81784K2355M60586j67847Q08106P43256j503678J26572J155853
1827.5G68272705M85001j262589k068634J192856J840591J86081L50190O49337J04981
1836.2G69750519O9351J29471Q26721l04871m16107n49850L76358K72369l429031J908417
$$ y = [746752014, 749648590, 751091232, 750749207, 752049255, 752379837, 753022232, 752764359, 752257614, 753563690, 754903336, 756139221, 755889969, 756194992, 757277298, 757711639, 757897034, 758527832, 758356857, 757493896, 755769958, 756282120, 759150314, 759751282, 759444809, 760445786, 761441803, 761789703, 761435471, 762326584, 761905212, 762182999, 762958221, 762928772, 763186646, 762912140, 762840881, 763677979, 765055161, 764757614, 764852066, 765832901, 766190262, 766576996, 766473770, 766702194, 765909500, 765845718, 766627502, 766649857, 767110443, 766942596, 767750702, 768493958, 766990280, 767116852, 768272705, 768757706, 767495117, 765426483, 766619339, 768459930, 768646011, 768996201, 769645538, 769750519, 769819870, 769949341, 770776062, 770471191, 770055084, 769505234, 769881592, 770153961, 766724930, 768633347]
1845.8G68633347K027053L24250l63160K24610N68542l81088N0964m83245j9303L22190
1855.5G70904160P8430L76739L2578L78723K86789K93350l81699k65426l89557l39813
1865.1G70974274M06875p36694k70386n81360L16544J449280Q89435L91464j80207
1873.8G72659225K00654j66245r2087l02200l9215j36032l33710P13425Q2855O91605
1883.4G73278275J30157j77002M79736r9182M83475j007385j428223O52313Q65326
1892.1G73177490n5847k08054K59324K07519J102600J59683R4071j1063n83420J15357
1901.8G74257660l54385j71662k80914k17972j81503J63498N36956L27607N32226Q2703
1911.4G74694214O39191l37220n33065l9063j25046J81809j940232k64129Q63342N76019
$$ y = [768633347, 770660400, 770984650, 770621490, 770846100, 771414642, 771033554, 771084518, 770601273, 770581970, 770904160, 770982590, 771359329, 771391907, 771770630, 772057419, 772350769, 771969070, 771703644, 771314087, 770974274, 771381149, 770644455, 770374069, 769792709, 770109253, 771558533, 772447968, 772839432, 772659225, 772859879, 772693634, 772601547, 772299347, 772260132, 772124100, 771790390, 772503815, 772586670, 773278275, 773408432, 773231430, 773711166, 773611984, 774095459, 773088074, 771659851, 772312164, 773177490, 773121643, 772913589, 773172913, 773380432, 774483032, 774642715, 774736786, 774725723, 774142303, 774257660, 773903275, 773731613, 773450699, 773232727, 773051224, 773214722, 773751678, 774079285, 774611511, 774694214, 775333405, 774996185, 774463120, 774424057, 774299011, 774480820, 772540588, 772276459, 773139801, 773715820]
1921.1G73715820M52652p55157K32849Q51898N79224j84403p4081k3346j48773k23465
1930.7G74423218o33774j20621k23922L25393P7133M0207M54941k8534K67792o3858
1940.3G74517975J55334j068649j180725R02252M14429q9340n85709K03552O86569
1949G73955688L87574J87835J39161J95846n7526k3956o57196k49176K6856j56861
1958.7G73748245j02463J4115M89807J4801L03192p7972J4419L46375n00565q5754
1968.3G74164200j32599J24664j7318p172J45111j87149J39618q3313L5934J78986
1978G74360962L54996j05667k59476K518k06070L04260j54114p7743j88294m02679
1987.6G73628693m4632j79139N51758o9885o02722K86713M38842K42081J16653J77536
$$ y = [773715820, 774168472, 773413315, 773646164, 774498062, 775077286, 774892883, 774818802, 774795456, 774646683, 774423218, 773789444, 773668823, 773444901, 773770294, 773847427, 773887634, 774342575, 774314041, 774581833, 774517975, 774673309, 773604660, 772423935, 773326187, 773740616, 773651276, 773065567, 773269119, 773955688, 774343262, 774531097, 774670258, 774866104, 774808578, 774784622, 774127426, 773878250, 773905106, 773748245, 773645782, 773659897, 774149704, 774164505, 774467697, 774389725, 774404144, 774750519, 774249954, 774164200, 774031601, 774156265, 774138947, 774131775, 774276886, 774089737, 774229355, 774146042, 774181976, 774360962, 774715958, 774610291, 774350815, 774353333, 774147263, 774451523, 774297409, 774219666, 774031372, 773628693, 773584061, 773404922, 773956680, 773886795, 773284073, 773570786, 774009628, 774251709, 774368362, 774545898]
1997.2G74545898j63269l29666m82940j90735n8441R8190J40915k34680L7078r91O0272
2007.8G73421631l56445k68174J31150k94876k74354k21405J66703J4801l14408l32031
2017.5G71672592j03607j10397k27509L57208J66092J30768l43017l77274J07269j81427
2027.1G71090698l3340n62058n91430k48032J89743J2894j97525M98199j70898l07160
2036.8G69681091j45874n2261k8915k060p3166n93033p7133n15213j51520K00577m3183
2047.4G68199310M28772K15531L92532m11148n08499R8572J9378k01263j95694L70102
2057G68407593k94113j8082J1063r1324L53546j23291K68173L7766m4632P3547J09100
2067.6G68689346R690m60511j10397j51977k0295J6404L45611M00391J2283j12076
$$ y = [774545898, 774382629, 774052963, 773570023, 773379288, 773320847, 773419037, 773559952, 773325272, 773362350, 773361359, 773421631, 773065186, 772797012, 772928162, 772633286, 772358932, 772137527, 772304230, 772319031, 772004623, 771672592, 771568985, 771458588, 771231079, 771588287, 771754379, 771885147, 771542130, 771164856, 771272125, 771090698, 771057358, 770495300, 769903870, 769655838, 769845581, 769858475, 769660950, 770159149, 769988251, 769681091, 769535217, 769482956, 769454041, 769451981, 769378815, 768785782, 768708649, 768193436, 768041916, 768242493, 768199310, 768628082, 768843613, 769236145, 768824997, 768316498, 768415070, 768434448, 768233185, 768037491, 768407593, 768113480, 768095398, 768106461, 768015137, 768368683, 768245392, 768513565, 768551331, 768506699, 768580246, 768689346, 768699036, 768238525, 768128128, 767976151, 767955856, 767972260, 768317871, 768718262, 768730545, 768618469]
2077.3G68618469k29110N30014J98898N4550J68610l60566m22439l21579K66113K75040
2086.9G68778000L2043m18853l58887L67050P16324K71149n49088j39389j88293p7973
2096.6G68432083K6856J13983O31332k5940l02505j04142N17884L45306K8610n6686
2106.2G69606781n59540J20087J74255R7046l9978J32980L40271l77349j67618J27868
2115.9G69454803L06244j08566k71835k49634j99127L86581L11814L72619j57242k823
2125.5G69842834J33591m00848j29013J01547J94550m18320N4169L01437j24130p9499
2135.1G69476318k33917M36478K47421J39389L67737L32336J36185m16794l12881l92380
2144.8G69779892k09198k15988K18963N37262j4648K79694M96368J78757m72946k40784
$$ y = [768618469, 768389359, 768919373, 769118271, 769172821, 769341431, 768980865, 768558426, 768236847, 768502960, 768778000, 768810043, 768391190, 768032303, 768399353, 769115677, 769386826, 768837738, 768698349, 768510056, 768432083, 768458939, 768572922, 769204254, 769178314, 768875809, 768771667, 769289551, 769634857, 769663467, 769606781, 769047241, 769167328, 769341583, 769438629, 769398651, 769531631, 769871902, 769494553, 769326935, 769454803, 769761047, 769652481, 769380646, 769131012, 768931885, 769318466, 769630280, 770002899, 769845657, 769842834, 769976425, 769575577, 769446564, 769548111, 769742661, 769324341, 769378510, 769679947, 769555817, 769476318, 769242401, 769678879, 769926300, 770065689, 770433426, 770765762, 770901947, 770485153, 770172272, 769779892, 769570694, 769354706, 769573669, 770110931, 770096283, 770375977, 770872345, 771051102, 770578156, 770337372]
2154.4G70337372K1972l6544p4082m03213J91803K82135J32828K83050O19659L22876
2164.1G71677856k13470K15912o7978k5101k4795o5003n8441j99890L29666K19421
2173.7G71788177K16446M0436K08969N31388K41394J70822j26038j77765l99627R3689
2183.4G72587891O42776L11813N7755l6392M08325K86179K6626L86200M43268n15213
2193G74599228n23605M11605o0730k93197K05765P75756K77405m52118k3803L86734
2202.6G75303040M48074l5172n6381j27563o3782J28937R2087K47039j97601k2430
2212.3G75716248K00882O78863P45621L5095j02081o03180k97928P5836P9117n9128
2221.9G76469345O7291M54331J14593L85819L08304K42462Q3160m14200m05121l36914
$$ y = [770337372, 770359344, 770322800, 770248718, 769845505, 770037308, 770319443, 770452271, 770735321, 771354980, 771677856, 771464386, 771680298, 771612320, 771587219, 771562424, 771497421, 771438980, 771239090, 771568756, 771788177, 772004623, 772045059, 772254028, 772785416, 773026810, 773197632, 773071594, 772893829, 772494202, 772587891, 773230667, 773542480, 773600235, 773563843, 773972168, 774258347, 774284973, 774671173, 775114441, 774599228, 774075623, 774487228, 774426498, 774133301, 774339066, 775114822, 775392227, 774940109, 774916306, 775303040, 775751114, 775715942, 775659561, 775531998, 775468216, 775597153, 775689240, 775936279, 775738678, 775716248, 775917130, 776595993, 777341614, 777376709, 777274628, 776671448, 776373520, 776449356, 776528473, 776469345, 776536636, 776990967, 777105560, 777491379, 777799683, 778042145, 778125305, 777711105, 777305984, 776969070]
2231.6G76969070n569j30692N0736J09405J85318M47541L96499L10898k43912l5171
2241.2G78054123l8834j94015q1482N2414R689k35824M22210J42899j602K00958J21460
2251.8G78451996L86429J93329k518n26657n08728l01972j9302k3117k3422M77447
2261.5G78103485J42975M91562M93622L10821m9972l45078J34049n09491l87192j2436
2271.1G78372345K91061J44577j22757K42768J51977N42755J71204R9716j77994n95932
2280.8G79119720m21752m85688J11161j70746K42157J25351j17951O80237M60587M24652
2290.4G79967728j40000R0561j26114l60031o180n80673K39487O9961o0424L71933
2300G79466248N53741O40488j20545Q2474r995K13318J22528l40347j8844j03608K18277
$$ y = [776969070, 776963501, 776832809, 776883545, 776992950, 777178268, 777625809, 778022308, 778333206, 778089294, 778054123, 778015289, 777821274, 777739792, 777792206, 777801895, 777566071, 777988281, 778131180, 778129578, 778330536, 778451996, 778838425, 779031754, 779029236, 778502579, 777993851, 777691879, 777672577, 777649460, 777626038, 778103485, 778246460, 778738022, 779231644, 779542465, 779492493, 779147415, 779281464, 778771973, 778384781, 778372345, 778663406, 778807983, 778685226, 778927994, 779079971, 779622726, 779793930, 779893646, 779715652, 779119720, 778697968, 778212280, 778323441, 778152695, 778394852, 778520203, 778402252, 779082489, 779543076, 779967728, 779827728, 779918289, 779792175, 779432144, 779425964, 778845291, 779084778, 779154739, 779094315, 779466248, 780019989, 780660477, 780539932, 780622406, 780612411, 780825729, 780948257, 780607910, 780589066, 780485458, 780703735]
2310.7G80703735L20130Q61969N52520m65240j72958L5400r308j52359K9450R6130
2320.3G81799469N112J99127O62155L44391q4534M1123L02658J233597N67398n14374
2329.9G84556122q84094k83661p7210r84192k02942K62680J95847K16522J170273K61841
2339.6G84231186j020813N95627j8616j026535r89304l10440n02243p30591j88140
2348.3G80040131M88281J448440J30005K75345J306839N73120J3428o16608J096497
2356.9G84755478o50406j424484r91440P79724L128967Q67615k91977k138290j012192
2365.6G83022995n84412j299057r41314j010895k72446r81598L22342J99051r40323
2374.3G77514343l27759j00021j90964p69500n55344o09360m47998l85971m21753j18332
$$ y = [780703735, 781023865, 781885834, 782438354, 781973114, 781800156, 781835556, 781826248, 781673889, 781703339, 781799469, 781804581, 782003708, 782665863, 783010254, 782925720, 782966843, 783269501, 784503098, 785070496, 784556122, 783672028, 783388367, 783311157, 782326965, 782124023, 782386703, 782582550, 782799072, 783969345, 784231186, 783210373, 783806000, 783787384, 782760849, 781771545, 781461105, 780958862, 780228271, 780040131, 780528412, 781976852, 782106857, 782382202, 783689041, 784262161, 784275589, 783658981, 784755478, 784105072, 782680588, 781689148, 782468872, 785597839, 786465454, 786173477, 784035187, 783022995, 782438583, 781139526, 780198212, 779187317, 778914871, 777933273, 778255615, 778454666, 777514343, 777186584, 777086563, 776895599, 776126099, 775570755, 774961395, 774513397, 774127426, 773705673, 773587341]
2383.9G73587341n15747k77328q4152l4791j90887k51083l1052l08456m22974m13742
2393.6G71057129J09787j50223k04468K10419m7226J00708o8207j7547l50724o06918
2403.2G70032730j99432q7891j82190k75345R0866j55410r9106m6616m6310K42004
2412.9G69273300l30734k56806p0571m28467p88651k89459P782l49045k06299l80172
2422.5G66180878o9733m7379J05820L11814k81907m91943o98318n81971o17981j94091
2432.2G63615189o5995l16085J49917J65100J01319k47879M2877l9215m86069m10461
2441.8G62508698q54722n38482l56903j68610p3547j27945p019k60773L06397L45611
2451.5G60772705j80130n02701o18667n48020o12106n37338n55039k67944k670K37884
$$ y = [773587341, 773071594, 772794266, 772710114, 772675323, 772484436, 772233353, 772202301, 771893845, 771470871, 771057129, 771166916, 771016693, 770812225, 771022644, 770975418, 771076126, 771007919, 770990372, 770639648, 770032730, 769833298, 769745407, 769563217, 769287872, 769378738, 769223328, 769124222, 769077606, 769031296, 769273300, 768942566, 768685760, 768615189, 768186722, 767398071, 767108612, 767116394, 766767349, 766561050, 766180878, 766111145, 766063766, 766169586, 766481400, 766199493, 765707550, 765009232, 764427261, 763809280, 763615189, 763549194, 763233109, 763383026, 763548126, 763649445, 763401566, 763444443, 763405228, 762919159, 762508698, 761653976, 761115494, 760758591, 760589981, 760516434, 760388489, 760381470, 760120697, 760427094, 760772705, 760592575, 760089874, 759471207, 758923187, 758311081, 757773743, 757218704, 756950760, 756948090, 757185974]
2461.1G57185974K48108K60010K54211k47955p10983r52759l04413j37100l39127m44717
2470.7G54811249n00946J00097K48413K82593q1634j17035K0752j56327j71432p74231
2480.4G53661499r64661p04345o2104k29873m97895K52991M69589L23029l22800m16259
2490G51509171j99967J63498p9422q46710j78986k2964r9716l55835l61634J32981
2499.7G49660416J15280K65121j77002k98156o86875q30536K4567L10135O5460m63486
2509.3G47984924j65558Q4916m8371j38931K975K00654k39640n43899o40183k0675
2519G46476212O9046k22474k85339m83398L5553R6206N7373p5760m07714o18363l97796
2529.6G44243546k4415l30657k95182n89828l86811l81J93100M77982k2583m8905k64053
$$ y = [757185974, 757434082, 757694092, 757948303, 757700348, 756989365, 756036606, 755732193, 755595093, 755255966, 754811249, 754310303, 754410400, 754658813, 754941406, 754859772, 754742737, 754763489, 754607162, 754435730, 753661499, 752696838, 751992493, 751930389, 751700516, 751202621, 751455612, 751925201, 752248230, 751925430, 751509171, 751309204, 751472702, 751393280, 750546570, 750367584, 750344620, 750244904, 749889069, 749527435, 749660416, 749775696, 750040817, 749863815, 749565659, 748878784, 748048248, 748072815, 748382950, 748448410, 747984924, 747819366, 747904282, 747855911, 747716980, 747719955, 747920609, 747680969, 747137070, 746496887, 746476212, 746545258, 746322784, 746037445, 745554047, 745589600, 745685806, 745743179, 745667419, 745259705, 744641342, 744243546, 744219131, 743888474, 743593292, 743003464, 742616653, 742616272, 742809372, 743287354, 743264771, 743215866, 742951813]
2540.2G42951813j93939o37894j159821l89785l12119k25372k05384o7215N3788J93252
2549.8G40007324M19617j76087n28640p68891n22613k91596m63333m96444k65885J5030
2559.5G36928482J06278M25338J984j93863k90833m12139j87149n13611p32727q17643
2569.1G34314117k01950r4452j10092N1575l9597N06287O027k39410k55890m40903
2578.7G33495712o28738r38721n01098n95475p5302J66626j31531k15988l98330M33425
2588.4G30610580N65644j54724o23474l85743k91900n44205o49033n59387J09635j65253
2598G27912140j33057K61536L43017Q4992o12564j96457k95258o72760p45010n07889
2607.7G25438690o6757k17133k18887m28543j30310J33362J55868j27258o04172l84750
$$ y = [742951813, 742757874, 742119980, 740960159, 740570374, 740258255, 740032883, 739827499, 739760284, 739814072, 740007324, 740426941, 740250854, 739722214, 738953323, 738430710, 738139114, 737675781, 737179337, 736913452, 736928482, 737034760, 737460098, 737462082, 737268219, 736977386, 736565247, 736378098, 735864487, 735131760, 734314117, 734112167, 734017715, 733907623, 733959198, 733919601, 734425888, 734431915, 734192505, 733936615, 733495712, 732866974, 731928253, 731427155, 730831680, 730756378, 730923004, 730791473, 730575485, 730177155, 730610580, 731176224, 731021500, 730398026, 730012283, 729720383, 729176178, 728527145, 727967758, 728077393, 727912140, 727779083, 728040619, 728383636, 728468628, 727856064, 727659607, 727364349, 726691589, 725946579, 725438690, 725371933, 725154800, 724935913, 724507370, 724377060, 724510422, 724666290, 724539032, 723934860, 723550110]
2617.3G23550110q73337r55887n48324m54636j29623K33459r92o24771m12445n8136
2627G19725418j30920o82450n90286m32510o36597l63617p20901l91694j29928o7444
2636.6G15579071J13678o89545o48880m25796n81818n60913n51300p08008m60663N570
2646.3G11071396n13306p03811k40097r6207m15650k86865j99814n51605l78570j63956
2655.9G07521515m05197j141663n46341p5760n01327j08948k58331l72925m17938j27182
2665.5G03565903l78342j052093m06952m9210q2397o57273m81796k64130o47430l9444
2675.2F99506836o9351k5254j84631o09131o69098p83310k96630l59955n03769O5460
2684.8F96071167r232o24160q7052J08032m68902m24042p30514m15955j71814l77502
$$ y = [723550110, 722676773, 721720886, 721172562, 720717926, 720588303, 720821762, 720820770, 720195999, 719783554, 719725418, 719594498, 718912048, 718321762, 717889252, 717252655, 716889038, 716168137, 715776443, 715646515, 715579071, 715692749, 715003204, 714354324, 713928528, 713346710, 712785797, 712234497, 711526489, 711065826, 711071396, 710558090, 709854279, 709614182, 709517975, 709102325, 708815460, 708615646, 708064041, 707685471, 707521515, 707116318, 705974655, 705428314, 705352554, 704851227, 704742279, 704483948, 704111023, 703693085, 703565903, 703187561, 702135468, 701728516, 701679306, 701596909, 700939636, 700457840, 700193710, 699546280, 699506836, 699437485, 699412231, 699227600, 698618469, 697949371, 697166061, 696869431, 696509476, 696005707, 696071167, 696061935, 695437775, 695350723, 695458755, 694989853, 694565811, 693835297, 693419342, 693247528, 692870026]
2694.5F92870026j89743k82898l16544m27627l26157k45590l52631m84619m96445m34723
2704.1F89313049n94406o26678o09589k93960j08185J34124l35311j013031l14560
2712.8F85551453k51923m63104k74735l43094o36596o13556k51084k04010k4948l65448
2722.4F82122955l16085O3858j13144k43988n37491n34745n26504l87421k98843k69470
2732.1F78959122j69831k91595m17175m94309J15204n4932o63452n76706l84063k84043
2741.7F75738220m73861j58539j90735j31912J55029k62375k83051J3810l98865p37457
2751.4F73270264J45416j65100p68967l45383m14810m11377k92053K83508j64260o03333
2761F70533905j78833k41241J37558k81067n32227l86887p28302m71191J4801k05917
$$ y = [692870026, 692680283, 692397385, 692080841, 691653214, 691327057, 691081467, 690728836, 690244217, 689747772, 689313049, 688718643, 688091965, 687482376, 687188416, 687080231, 687214355, 686879044, 685866013, 685551453, 685299530, 684836426, 684561691, 684218597, 683582001, 682968445, 682717361, 682513351, 682488403, 682122955, 681806870, 681870728, 681757584, 681513596, 680976105, 680441360, 679914856, 679527435, 679228592, 678959122, 678789291, 678497696, 678080521, 677586212, 677701416, 677646484, 676983032, 676406326, 676022263, 675738220, 675264359, 675105820, 674915085, 674783173, 674938202, 674675827, 674392776, 674406586, 674007721, 673270264, 673415680, 673250580, 672481613, 672136230, 671721420, 671310043, 671017990, 671301498, 671137238, 670533905, 670355072, 670113831, 670251389, 669970322, 669438095, 669051208, 668322906, 667851715, 667866516, 667660599]
2770.7F67660599m10156K91900J24817j62201n63736q91571o32477q79287k02790j38626
2780.3F64196472m93545n26581l18604J51673m89579l96881j66397j63116n62439j162567
2789.9F60068436o66352n60989l87573m55246q07343o09054K7160K29q86230j113892
2799.6F54609146j185608o32705l02506n67627o24313r84040j132125q75473j94703
2808.3F48110046m30374q71200p78199q16574n38330p19223j026611j304474r53827
2816.9F40671234m61426p43484n97916p40738j099014r28001p89452r27658j080895
2825.6F33302650j273117j259956r98650j109352j315727j149444o32401p75719j134567
2834.3F23653717j328125j559372j359978j314888j089248j461029k028008k072830
$$ y = [667660599, 667250443, 667542343, 667667160, 667504959, 666941223, 666049652, 665417175, 664537888, 664335098, 664196472, 663702927, 663176346, 662857742, 663009415, 662519836, 662122955, 661956558, 661793442, 661231003, 660068436, 659402084, 658841095, 658453522, 657998276, 657190933, 656581879, 656609039, 656609268, 655723038, 654609146, 653423538, 652790833, 652488327, 651920700, 651296387, 650312347, 649180222, 648304749, 648110046, 647679672, 646808472, 646030273, 645213699, 644675369, 643956146, 642929535, 641625061, 640671234, 640209808, 639466324, 638868408, 638127670, 637028656, 636100655, 635311203, 634383545, 633302650, 632029533, 630769577, 629770927, 628661575, 627345848, 626196404, 625564003, 624788284, 623653717, 622325592, 620766220, 619406242, 618091354, 617002106, 615541077, 613513069, 611440239]
2842F11440239j819992j290588j780053j821365j711884k010765k150726k366142j784859
2850.7E94703865j508255j336479j086579p52029r25369j602860n08537O47163K46048
2859.4E87876968r90600j385384j305084j460686j278419j491242j381340j574898
2867.1E77009315j810569j955376k234917j557273j340638j691856k131233j885796
2874.8E62401657j476707j723290j820717k043190j765594j614800j527900j169014
2882.5E49260445r88121o29082p09038j024666j419220j055107l68309n07278o23017
2891.2E41936607o41479n39704l60107j11694j63346o18362n25589K44980K52914n58243
2900.8E38915977j114921j259003l55644m16946p79915l32299j051979j145401j147117
$$ y = [611440239, 609620247, 608329659, 606549606, 604728241, 603016357, 601005592, 598854866, 596488724, 594703865, 593195610, 591859131, 590772552, 590020523, 589095154, 587492294, 586983757, 587630920, 587876968, 586886368, 585500984, 584195900, 582735214, 581456795, 579965553, 578584213, 577009315, 575198746, 573243370, 571008453, 569451180, 568110542, 566418686, 564287453, 562401657, 560924950, 559201660, 557380943, 555337753, 553572159, 551957359, 550429459, 549260445, 548272324, 547643242, 546934204, 545909538, 544490318, 543435211, 543066902, 542559624, 541936607, 541295128, 540755424, 540395317, 540283623, 540120277, 539501915, 538976326, 539221306, 539474220, 538915977, 537801056, 536542053, 536186409, 535769463, 534989548, 534657249, 533605270, 532459869, 531312752]
2909.5E31312752j536751j639709j482964r13811j495857k194634k596855j879768
2917.2E17572403r45854j661644j569557j380845j363334j261215j534806r48715n29938
2925.9E06376495m40368l57895o34957m32472M9477L31077J298218J545372N36041
2934.6E08270988Q58880J662521J670647J766433K077523K082252J816979K178497
2942.3E22384720K538338K160911K552147K962570K207070K183570K483712K264061
2950E41737099J891479J750717K077523K132530K106247J952972K359772K441368J996803
2958.7E60446510K251816K001305J904106K025986K139511K016601J476021J306801
2966.4E75568657J312828J635475J695976J539154J395112J801872J925926J657333
$$ y = [531312752, 529776001, 528136292, 526653328, 525739517, 524243660, 522049026, 519452171, 517572403, 516626549, 514964905, 513395348, 512014503, 510651169, 509389954, 507855148, 506906433, 506376495, 505936127, 505578232, 504943275, 504510803, 504560280, 504891357, 506189575, 507734947, 508270988, 509129868, 510792389, 512463036, 514229469, 516306992, 518389244, 520206223, 522384720, 524923058, 527083969, 529636116, 532598686, 534805756, 536989326, 539473038, 541737099, 543628578, 545379295, 547456818, 549589348, 551695595, 553648567, 556008339, 558449707, 560446510, 562698326, 564699631, 566603737, 568629723, 570769234, 572785835, 574261856, 575568657, 576881485, 578516960, 580212936, 581752090, 583147202, 584949074, 586875000, 588532333]
2974.1E88532333J669388J116333J733208J656799J160050J611137J089935J222000
2981.8E99791183J382790J338806J288414J270180J314354Q98704O62575J76468Q33016
2990.5F08956490J147880N25208L94630M12178R61685Q01163N20210N3406k79770j96686
3000.2F13296394k85110L98445J92757j96686k12402m67759l74450l27187M30298O38542
3009.8F13092842l19519q78029r29222m38385l04489q53767o77262k87170m84886p91359
3019.5F07128754p18422l45192n92270p75147q76312r83009q20198q90847o72683q55332
3029.1E99599342p37762o75507j322899r33876n72433n98221n84221j006775j725616
3037.8E91442032j415558p62215r33075j077118j041564k39907o55479j473923r18541
$$ y = [588532333, 590201721, 591318054, 593051262, 594708061, 595868111, 597479248, 598569183, 599791183, 601173973, 602512779, 603801193, 605071373, 606385727, 607284431, 607947006, 608123474, 608956490, 610104370, 610629578, 611024208, 611436386, 612398071, 613199234, 613719444, 613772850, 613493080, 613296394, 613011284, 613409729, 613602486, 613405800, 613193398, 612725639, 612351189, 612024002, 612454300, 613092842, 612773323, 611895294, 610966072, 610527687, 610223198, 609369431, 608692169, 608404999, 607920113, 607128754, 606410332, 606065140, 605472870, 604697723, 603821411, 602838402, 602018204, 601127357, 600454674, 599599342, 598861580, 598186073, 596863174, 595929298, 595356865, 594758644, 594174423, 593167648, 591442032, 590026474, 589264259, 588331184, 587254066, 586212502, 585972595, 585317116, 583843193, 582924652]
3046.5E82924652j119194j199875j220474j281052j103935j218605j449165j197129
3054.2E73135223m19349q73947j250267r15604p55501p51762j267243j537590j249161
3062.9E64114799r99450j373367j035080j007920j656303r95751m68864n35851q70399
3071.5E55171814j214638j443100j244545j041069j511345j597328j263618q78067
3079.2E44978104j354981j318054o31676n86242o92635j288834r47914o58416j231194
3087.9E36268158j532593j241836r43909j324501j180115j476974j041642l83644r77249
3096.6E26165695j338539j480408q76121j201744j340218j091499j300774p71522j109734
3105.3E15655136j187553j178093j127320j160430j361733q68034q42553p87506j535568
$$ y = [582924652, 581805458, 580605583, 579385109, 578104057, 577000122, 575781517, 574332352, 573135223, 572715874, 571841927, 570591660, 569676056, 568920555, 568168793, 566901550, 565363960, 564114799, 563115349, 561741982, 560706902, 559698982, 558042679, 557046928, 556578064, 556042213, 555171814, 553957176, 552514076, 551269531, 550228462, 548717117, 547119789, 545856171, 544978104, 543623123, 542305069, 541673393, 541087151, 540394516, 539105682, 538157768, 537499352, 536268158, 534735565, 533493729, 532549820, 531225319, 530045204, 528568230, 527526588, 527142944, 526165695, 524827156, 523346748, 522470627, 521268883, 519928665, 518837166, 517536392, 516764870, 515655136, 514467583, 513289490, 512162170, 511001740, 509640007, 508771973, 507929420, 507141914, 505606346]
3114E05606346j363258p71256j505928j352997j187858j133003j013031p32766j090965
3122.6D95455284j303291r50546j521569j225929j125107j285248j128807j014328
3130.4D85900459p81631j262589j222419q11806p59583j451225j415596o99387j320953
3139D76175270j692429j817092j265831m03672q74443j323280j000748r03854j331406
3147.7D65562515j308403j299858j422577j204872r84917q34999q84933j187287j003379
3156.4D55431290m80461q48046j147880j369782j325226j002693j368866j393013j237411
3165.1D45257912r08738j064300j020355n30663p32612q70896j361847j128998j184349
3173.8D36455154j501350j080818r73244o89430j188355q74557l90892r20029j244316
$$ y = [505606346, 504243088, 503471832, 501965904, 500612907, 499425049, 498292046, 497279015, 496546249, 495455284, 494151993, 493201447, 491679878, 490453949, 489328842, 488043594, 486914787, 485900459, 485118828, 483856239, 482633820, 481822014, 481062431, 479611206, 478195610, 477496223, 476175270, 474482841, 472665749, 471399918, 470996246, 470121803, 468798523, 467797775, 466893921, 465562515, 464254112, 462954254, 461531677, 460326805, 459341888, 458506889, 457621956, 456434669, 455431290, 454950829, 454102783, 452954903, 451585121, 450259895, 449257202, 447888336, 446495323, 445257912, 444349174, 443284874, 442264519, 441733856, 441001244, 440130348, 438768501, 437639503, 436455154, 434953804, 433872986, 432899742, 432210312, 431021957, 430147400, 429756508, 428836479, 427592163]
3182.4D27592163j381264q76197j142083j100921p26281r08393r08547j053619j274033
3191.1D18220825j466255o46248n84640j005059n95626p65801j372490j616287n55802
3199.8D09612617l61480j219406j254006r38606r59053q22868k79541o64826p87773
3208.5D02325058j118088j402893p11021n48859n54466j172409q95119m65851r63402
3217.2C94492950p79075r99375j340675p96852k41394q09250j249657r47723n20554
3225.8C86808395l79943o50712m92935q85353j163673r26819n10368m46930q84667
3234.5C80466995n90400r07937j162719q75244n90401o45943p87658m59176p42149
3243.2C73705368q57201r56306l54538l44849r50966l90129o53534r00116q83216n07431
$$ y = [427592163, 426210899, 425334702, 424192619, 423091698, 422365417, 421457024, 420548477, 419494858, 418220825, 416754570, 416108322, 415523682, 414518623, 413922997, 413157196, 411784706, 410168419, 409612617, 409251137, 408031731, 406777725, 405839119, 404880066, 404057198, 403777657, 403112831, 402325058, 401206970, 399804077, 399093056, 398544197, 397989731, 396817322, 395922203, 395456352, 394492950, 393713875, 392714500, 391373825, 390576973, 390335579, 389526329, 388276672, 387328949, 386808395, 386428452, 385777740, 385284805, 384399452, 383235779, 382308960, 381798592, 381351662, 380466995, 379876595, 378968658, 377805939, 376930695, 376340294, 375694351, 374906693, 374447517, 373705368, 372848167, 371891861, 371537323, 371192474, 370241508, 369851379, 369197845, 368297729, 367414513, 366907082]
3252.8C66907082n96009r04007n76400p73697k65961o09207m23546m62761j513252
3261.5C60782242o38619l92570p45430n73998j84211n74570n67818k23427r96017q61397
3271.2C55024185q51517k51770L3875l46527m84924j102067k32582k50816o74782m54178
3280.8C50408897l94859n38673q86154l33596o32133o74362m94156l98484k86178j040497
3290.4C44729805o73599l45078l06625k33956l08418l45993o44646o93893m53377n4283
3300.1C40669937n01442o30684q15506j014671l39623o02798l54462o48q41065j031074
3309.7C34537964k37961O8626r0866m72412o46934m11568q70171n44853m02603o55022
3319.4C30274200n28984o62155j49231n04760p06978r39980j007614k47307m25873
$$ y = [366907082, 366311073, 365407066, 364830666, 364056969, 363791008, 363181801, 362758255, 362295494, 360782242, 360143623, 359751053, 359005623, 358431625, 358247414, 357672844, 357105026, 356881599, 355885582, 355024185, 354172668, 353920898, 353954773, 353608246, 353123322, 352021255, 351788673, 351537857, 350863075, 350408897, 350014038, 349475365, 348589211, 348255615, 347623482, 346949120, 346454964, 346056480, 345770302, 344729805, 344056206, 343711128, 343404503, 343170547, 342862129, 342516136, 341871490, 341177597, 340724220, 340669937, 340168495, 339537811, 338722305, 337707634, 337368011, 336765213, 336410751, 336410103, 335569038, 334537964, 334300003, 334368629, 334277763, 333805351, 333158417, 332746849, 331876678, 331331825, 330929222, 330274200, 329745216, 329083061, 328933830, 328429070, 327722092, 326782112, 325774498, 325527191, 325101318]
3328.1C25101318k64282m98695p27043j052666r06983j91612p30285o02379o28147
3336.7C19499226n68085m21467n90115n06992q31871n06897k41661j00231k36225n93300
3346.4C14902382q56972r70116n76133m68941m54998q09097m96655j64013k83413l02028
3356C09520016o42395l59268m58985m25453p85961j320896j019898p10697Q411m28257
3365.7C03376617j003799p18632k62737m56905p55234J51100P4768n35088p70988n96924
3375.3B98502178n78346m49829l6545n99441o42128l57552K7618m11319p70665j66683
3384.9B94517288k38933k9908m46224l29208j13602n13897m70772q65936n80120l38554
3394.6B90590134J69830M42448o6853l00579l77407l18794n81284J49460K53982o31561
$$ y = [325101318, 324837036, 324338341, 323611298, 322558632, 321651649, 321460037, 320729752, 320127373, 319499226, 318931141, 318509674, 317919559, 317412567, 316580696, 316073799, 315832138, 315731907, 315495682, 314902382, 314045410, 313075294, 312499161, 312030220, 311575222, 310766125, 310269470, 310105457, 309822044, 309520016, 308877621, 308518353, 308059368, 307633915, 306847954, 305527058, 304507160, 303796463, 303804874, 303376617, 302372818, 301654186, 301391449, 300934544, 300179310, 300330410, 300405178, 299870090, 299099102, 298502178, 297923832, 297474003, 297437458, 296838017, 296195889, 295838337, 295865955, 295454636, 294683971, 294517288, 294278355, 294248447, 293802223, 293473015, 293359413, 292845516, 292374744, 291508808, 290928688, 290590134, 290759964, 291202412, 291135559, 290834980, 290457573, 290138779, 289557495, 289706955, 289960937, 289329376]
3404.2B89329376n15499J37329K76547l84770j47800Q2359q0604m86222o23893m9172
3413.9B87537651L63140O29082k65465j34678M48818n4168k92778k62718K47039r4471
3423.5B88121452p7133J15738j56555L42045M57840J79100L3722L22265M46034K51484
3433.2B90035992n551n6362M07772M58508j07880L8776J122857N92689j63612K04563
3442.8B92527752M10213M47770M28657M25568m45538K75631J088390O78521O20041
3451.5B96457005N16128N97897L46374O67916K16751R3078P55024J33419O50292P72133
3461.1C01206017P84263L66154K86312J304684N90229J62449J76906R67598Q10223
3469.8C06654835K74811J208648J017399P54299M27933P11117N86033J03149M23908
$$ y = [289329376, 288813877, 288951206, 289227753, 288842983, 288695183, 288777542, 288696938, 288210716, 287586823, 287537651, 287900791, 288529873, 288264408, 288129730, 288578548, 288524380, 288231602, 287968884, 288215923, 288121452, 288044319, 288160057, 288003502, 288345547, 288803387, 288982487, 289016209, 289338474, 289784508, 290035992, 290030441, 289974079, 290381851, 290840359, 290732479, 290771255, 291894112, 292486801, 292323189, 292527752, 292937965, 293385735, 293814392, 294239960, 293794422, 294070053, 295158443, 295836964, 296457005, 296973133, 297571030, 297917404, 298585320, 298802071, 298895149, 299650173, 299783592, 300433884, 301206017, 301990280, 302356434, 302642746, 303947430, 304537659, 304700108, 304877014, 305844612, 306654835, 306929646, 308138294, 309155693, 309909992, 310337925, 311049042, 311635075, 311738224, 312162132]
3478.5C12162132N25379J225205J187401Q80127Q19282J134167Q47092M21848Q65078
3487.2C20067711R5367P04651J487770J246567P40051M17366J305199J071434M38652
3495.8C27574768J86462O66008J573410J588784Q35685M01726N21927M48990J251297
3504.5C35049057J286087J023293J122093J771278J326523m26407J174278J259308
3512.2C43585510P55768J238327R47189J274224R40857J285858J367798R29222Q63495
3520.9C53188248Q85048Q31375N41801J334038J293373J540947J044617N16739J594658
3529.6C62770844J913490J422577R60083J546097P65533R93309J271706N16700J553345
3538.3C73713684J200714J412964J277161Q98094R66225J819953K119942K83585J681976
$$ y = [312162132, 312687511, 313912716, 315100117, 315980244, 316799526, 317933693, 318780785, 319202633, 320067711, 320163078, 320867729, 322355499, 323602066, 324342117, 324759483, 326064682, 327136116, 327574768, 327761230, 328427238, 330000648, 331589432, 332425117, 332826843, 333348770, 333797760, 335049057, 336335144, 337358437, 338480530, 340251808, 341578331, 341151924, 342326202, 343585510, 344341278, 345579605, 346526794, 347801018, 348741875, 350027733, 351395531, 352324753, 353188248, 354073296, 354904671, 355446472, 356780510, 358073883, 359614830, 360659447, 361176186, 362770844, 364684334, 366106911, 367066994, 368613091, 369378624, 370371933, 371643639, 372160339, 373713684, 374914398, 376327362, 377604523, 378502617, 379468842, 381288795, 383408737, 383692322, 385374298]
3547C85374298J347656J613427J579132J082191K163277N00717J870308J801910J628914
3555.6C98961830K208634J005020K100639J881676J425552J303597K462768J779175
3563.4D13128891J151314L664551O82144P64312P84302J053467L509140J712914K194595
3572D28645630K656593K733994K104492J775322J969757J103706K756119K217064J413689
3580.7D47376366J825561K531281K558136J897773N110589L345794r10377J317024
3588.4D65052147l8147L284874M134369L345489J648827J393471M088668P56379K049484
3597.1D85715561L244324J043777K946129J712952J875686L145790K600785K785949
3604.8E05070953L185006K913246K54478L868485N26657m66576O764984J863594p1602
$$ y = [385374298, 386721954, 388335381, 389914513, 390996704, 393159981, 393660698, 395531006, 397332916, 398961830, 401170464, 402175484, 404276123, 406157799, 407583351, 408886948, 411349716, 413128891, 414280205, 417944756, 418626900, 419391212, 420175514, 421228981, 424738121, 426451035, 428645630, 431302223, 434036217, 436140709, 437916031, 439885788, 440989494, 443745613, 445962677, 447376366, 449201927, 451733208, 454291344, 456189117, 461299706, 464645500, 463735123, 465052147, 465014000, 468298874, 472433243, 475778732, 477427559, 478821030, 482909698, 483666077, 485715561, 488959885, 490003662, 492949791, 494662743, 496538429, 499684219, 502285004, 505070953, 508255959, 511169205, 511423683, 515292168, 515818825, 515352249, 522117233, 523980827, 523909225]
3613.5E23909225L761178q1673M680405M605827R33151K214699k01988J259269L327942
3622.2E44408035L058434K507553K761421L116722L221741N045242j920509p816811
3629.9E54381828N659256N925217N033798Q47893n37453L355141K681503J429177P42912
3638.6E79519272J807632K637329K496109J357804R04388K503624L365784N101356
3646.3E99693298o17370k300606N074654k884407k480050K587929N549431M253159
3654F08876038L603324L639718o803894K157096M922867J137009J232338P20062K327309
3662.7F21811867J490059R63058J024513J351853N056076K740059j247788o57348n178147
3671.4F27354202K996140Q126488Q665351j558227j8949127L742790Q263054M677048
$$ y = [523909225, 527670403, 527588730, 532269135, 536874962, 537808113, 540022812, 539820824, 541080093, 544408035, 547466469, 549974022, 552735443, 555852165, 559073906, 564119148, 562198639, 554381828, 560041084, 565966301, 571000099, 571847992, 571310539, 574665680, 577347183, 578776360, 579519272, 581326904, 583964233, 586460342, 587818146, 588722534, 591226158, 594591942, 599693298, 599075928, 596775322, 601849976, 598965569, 596485519, 599073448, 604622879, 608876038, 612479362, 616119080, 609315186, 611472282, 616395149, 617532158, 618764496, 619484558, 621811867, 623301926, 624264984, 625289497, 626641350, 631697426, 634437485, 633189697, 632532349, 627354202, 630350342, 638476830, 647142181, 645583954, 626634827, 630377617, 638640671, 643317719]
3679.1F43317719j447831O88248K701416J420212J053543L33023L40576L525314N390702
3687.8F57322922o924591k853012O739883l884811L34625M565506P80105K116700J445312
3696.4F59642639%P97501O39877K493744J750031m905015p55233M436416J059723K68784
3706.1F65428467J069565J957473J568451o986389M887009M182815j1284713M729232
3713.8F65551910M002686O23245J180954K199860J062393k849274J472702M932404
3721.5F78176880l292999m195710M683686K325439J33286k352982m81033L010406J206894
3730.2F79213867M575958l002471o027527Q704605J881103q454284p75605P07932M52957
3738.9F77276535M202957L736420l394089L377609J0607224r887161j5090638Q472214
$$ y = [643317719, 641869888, 642558136, 645259552, 646679764, 647733307, 648066330, 648406906, 651932220, 657322922, 650398331, 647545319, 654285202, 650400391, 650735016, 655300522, 656080627, 658197327, 659642639, 659642639, 660440140, 661080017, 663573761, 665323792, 660418777, 659663544, 664099960, 665159683, 665428467, 666498032, 668455505, 670023956, 663037567, 667924576, 672107391, 660822678, 665551910, 669554596, 670177841, 671358795, 673558655, 674621048, 671771774, 673244476, 678176880, 674883881, 670688171, 675371857, 677697296, 677830582, 675477600, 674996567, 678006973, 679213867, 683789825, 680787354, 674759827, 683464432, 685345535, 676891251, 676115646, 676823578, 677276535, 681479492, 685215912, 681821823, 685199432, 695806656, 685919495, 670828857, 679301071]
3746.6F79301071N204239N529938m390259r619751J0556488m421387m679031N964813
3754.3F83446121N010834L759460n021209K004165M423066p736359o82449L925170
3762F89128799J340180N25741L072968j805573l188400L133316M040833q87223q280258
3770.7F87080383K897339L148270l20969P52258j28707J023559J081391K584686q50983
3779.4F97267227o410827L071975K309571N64041J506271j937103p46231Q78601R54056
3788F97457581P79876k54745J59607P84683P11746n28107J299439K289276m546738
3796.7F98152618k006301K672271K525177L955078n318679p141419L756104K649536
3804.4F99244385L989563N006027p218399m014511L998031J630784R0179M05121K01797
$$ y = [679301071, 684505310, 690035248, 685644989, 676025238, 686581726, 682160339, 677481308, 683446121, 688456955, 692216415, 687195206, 689199371, 693622437, 685886078, 685203629, 689128799, 690468979, 690994720, 694067688, 692262115, 689073715, 692207031, 696247864, 695360641, 687080383, 689977722, 693125992, 692805023, 693557281, 693428574, 694452133, 695533524, 698118210, 697267227, 690856400, 693928375, 696237946, 696801987, 698308258, 696371155, 695624924, 696503525, 697457581, 698237457, 697982712, 698142319, 698927002, 699638748, 699110641, 700410080, 702699356, 698152618, 696146317, 698818588, 701343765, 705298843, 699980164, 692838745, 696594849, 699244385, 703233948, 708239975, 701021576, 697007065, 701005096, 702635880, 702726059, 703131180, 703332977]
3813.1G03332977J196900L857956k347641j1173783M489746M964905L353806J145477
3820.8G08820343j3822861K233048N448456K154235K247925P6981l294525M90799J623687
3829.5G05978088K332993Q99429o910248K795182O508178n341720j350632O458054
3837.2G11369324o380158k251968O727295n979080J34811O798401k112579l321457
3844.9G04984589K343292J291809J8158J409912n37720J753083M459457p174835l28827
3853.6G08218918r339142J765671Q250732o38885n60685J689530J788025K626953m541397
3862.3G09259720N6991N985566n016861m258805M258881M429779M111023p258301o881485
3871G04686508M011307N654678K174225r816513J521454M701462M76837K018127L032837
$$ y = [703332977, 704529877, 708387833, 706040192, 694866409, 699356155, 704321060, 707674866, 708820343, 694997482, 697230530, 702678986, 704833221, 707081146, 707158127, 703863602, 704354401, 705978088, 708311081, 709210510, 702300262, 705095444, 711603622, 706261902, 704911270, 711369324, 704989166, 702737198, 709464493, 703485413, 703620224, 710418625, 708306046, 704984589, 707327881, 708619690, 708637848, 710047760, 709510040, 711263123, 715722580, 708547745, 708218918, 698879776, 700645447, 708896179, 708257294, 707696609, 709386139, 711174164, 713801117, 709259720, 709316711, 715302277, 710285416, 706026611, 710285492, 714715271, 718826294, 711567993, 704686508, 708697815, 714352493, 716526718, 706710205, 708231659, 712933121, 713409958, 715428085, 718460922]
3879.7G18460922p012863n481796O468201Q27941N74799M185257j0397568R04617L663712
3888.3G12193222J453552M128266o61774p331924J249694L096314j228027J106491
3896.1G14005814J160659K404633K127838q726120L420868J315689l778839M237900
3903.8G16168442l373337j166534J192169R81292J628800l68881J49841J77307R13696
3912.5G16302795M40827r88770O26984J661835k904892k068634M243316p10373l871612
3921.1G12731476K255096K296829J400528k142105k798156J964035J678695M92859
3928.8G17879257j159668l61175J477356k583542r52072J754379j52741O31104J116409
3937.5G17649307m5166n6152j24664J038665P60804l238297o93436J513138R94644
$$ y = [718460922, 711448059, 705966263, 712434464, 713262405, 713837204, 718022461, 707624893, 708529510, 712193222, 713646774, 717775040, 717113266, 709781342, 711031036, 714127350, 712899323, 714005814, 715166473, 717571106, 719698944, 710972824, 714393692, 715709381, 711930542, 716168442, 712795105, 711628571, 712820740, 713802032, 715430832, 715061951, 715211792, 715389099, 716302795, 716743622, 715754852, 716381836, 718043671, 715138779, 713070145, 717313461, 716603088, 712731476, 714986572, 717283401, 718683929, 716541824, 713743668, 715707703, 717386398, 717879257, 716719589, 716358414, 717835770, 715252228, 714300156, 716054535, 715901794, 716532898, 717649307, 717604141, 717547989, 717423325, 718461990, 719222794, 715984497, 715291061, 716804199, 717798843]
3946.2G17798843Q56476j131058N70298n60150j766129K177734P56379q69217o95038
3954.9G17138138l8452J034393L02811m3564r76868K53906J022263l91617K29j86996
3964.5G18114243l26691N52063J162720J66397j319809p63779R04770O07910n99365
3973.2G18498459j9150J97907M00695N61371M12445l42865j141128j00250K32772K47040
3982.8G18947296M04205p705l86048l1967K86865J908P90024K22168n27039j88827
3992.5G19510880l01743M5547n0201L87268M27475k52914k0295M45405
4000.2G20191422
$$ y = [717798843, 718655319, 717524261, 718094559, 717534409, 715768280, 717946014, 718702393, 717833176, 717138138, 717099686, 718134079, 718436890, 718393326, 717416458, 717670364, 718692627, 718301010, 718301239, 718114243, 717787552, 718339615, 719502335, 719668732, 718348923, 717585144, 718489914, 719097824, 718498459, 718479309, 718677216, 719077911, 719639282, 720051727, 719708862, 718567734, 718467484, 718700256, 718947296, 719351501, 719343796, 718957748, 718925781, 719212646, 719214554, 720004578, 720226746, 719699707, 719510880, 719209137, 719254684, 719204483, 719591751, 720019226, 719766312, 719746017, 720191422]
##END=$$ End of the data block
