##TITLE=$$ Begin of the data block
##JCAMP-DX=5.00 $$ ACD/SpecManager v 10.08
##SPECTROMETER/DATA SYSTEM=Varian
##DATE=20 Nov 2012 10:20:56
##DATA TYPE=INFRARED SPECTRUM
##DATA CLASS=XYDATA
##ORIGIN=
##OWNER=
##NPOINTS=3735
##FIRSTX=399.26403809
##LASTX=4000.35498047
##MAXX=4000.35498047
##MINX=399.26403809
##MAXY=77.32381439
##MINY=18.54805756
##XFACTOR=1.0000000000
##YFACTOR=0.000000100000000
##FIRSTY=49.11848831
##DELTAX=0.96440572
##XUNITS=1/CM
##YUNITS=TRANSMITTANCE
##XYDATA=(X++(Y..Y))
399.3D91184883k27966J31302l3036J049424k355614L448677j479530j0059891J193809
407.9D82852058K962151k983017l481445L295898N523873K104606L515968J046067
415.7D94836159L169060L452987j2053985j4935494K393417P410241R02328m755859
423.4D80418854n772248q014984M290505N513038j360397j452026k404709j975250
431.1D69242783M593124J419678m639778N50994K445069k951470m896164r46922N02358
439.8D65319672l631249l949737K537689P856636M058304J077499M648094K438851
447.5D80355759l84178j128617l131637J853141N329972l55568k72980L027496K920151
456.2D88213539J087341j0018730p031746j124382M140320N579910o197738k704964
$$ plain form
399.3 491184883 490956917 491088219 491055183 492104607 489748993 493197670 491718140 481658249 482852058
407.9 482852058 485814209 482831192 479349747 482645645 488169518 490274124 493790092 494836159
415.7 494836159 498005219 501458206 489404221 474468727 476862144 484272385 485174713 480418854
423.4 480418854 474646606 466631622 470922127 476435165 475074768 473622742 471218033 469242783
431.1 469242783 473835907 475255585 470615807 471166801 473611870 470660400 465764236 464817314 465319672
439.8 465319672 461688423 457738686 460276375 468133011 472191315 473268814 477916908 480355759
447.5 480355759 479971581 478842964 475711327 477564468 482894440 482538872 482265892 485293388 488213539
456.2 488213539 489300880 479282150 472250404 471126022 475266342 480846252 474648514 471943550
463.9D71943550N192375m91829o85043k427750l295669K757454P12280J722450k259941
472.6D73167877j0990410n426559k700195K310218J461373p67441k575531n825920
480.3D48653412k443352o94427o82946l36914L274994L211975J232338j598015l370323
489D47246742J331978K17018J100464J570397r07517j283150k552528M40674k529717
497.6D44634361m041633k278900R25827L802261k649880l209495j080780j25084j444244
506.3D34532433q75702j220360l859100j878357n611420j757546J061440l364792j960411
515D15066185j545753j704255j466674O23817l045769l627052k48222l05481q67958
523.7D02878838k630196J009979O2905j899300j232300j523399j24893k89078J049385
$$ plain form
463.9 471943550 477135925 476644096 475959053 473531303 470235634 472993088 473705368 475427818 473167877
472.6 473167877 462177467 456750908 454050713 456360931 457822304 457054863 454479332 448653412
480.3 448653412 446210060 445515633 444832687 444495773 447770767 450982742 452215080 450617065 447246742
489 447246742 448578720 448795738 449896202 451466599 450559082 449275932 446723404 447164078 444634361
497.6 444634361 440592728 438313828 439239655 443041916 440392036 437182541 436101761 435976677 434532433
506.3 434532433 433656731 432436371 428577271 426698914 421087494 419329948 420391388 417026596 415066185
515 415066185 413520432 411816177 410349503 410973320 407927551 404300499 404052277 403746796 402878838
523.7 402878838 400248642 401258621 401321526 399422226 398189926 396666527 396541634 396252556 397301941
532.4C97301941N57709K352829K478599M89426J80855Q62770M593582K982712J053428
541D12853851K219353K519150J367607Q96149P29904j817475j34582n80483k034034
549.7D16019440K82516J068955K85873j033363L97110n69344j752052k328034l065185
558.4D09305916j92833j97907r60121k123909l034630k487907j762466r76334k049027
567.1C95520782l977928m178276j261863j840744j147538k010803k699776J377602
574.8C79781456o22330j74446J242256N64194J226883L266716L049316P11480L116531
583.5C92162056K171631J509781L363914K672997O86874N36347K342453J917343J138305
592.1D08501701J55297J397094Q23288j289863j71471O34537J155968o72303p49702
$$ plain form
532.4 397301941 397859650 400212479 402691078 403180504 403361359 404224129 408817711 411800423 412853851
541 412853851 415073204 417592354 418959961 419856110 420586014 418768539 418633957 418053474 416019440
549.7 416019440 416301956 417370911 417656784 416623421 417020531 416451187 414699135 412371101 409305916
558.4 409305916 409113083 408915176 407955055 405831146 402796516 400308609 398546143 397569809 395520782
567.1 395520782 391542854 387364578 386102715 384261971 383114433 381103630 378403854 379781456
574.8 379781456 379159126 378984680 380226936 380791130 382018013 385284729 388334045 389045525 392162056
583.5 392162056 394333687 395843468 399207382 401880379 402567253 403103600 405446053 407363396 408501701
592.1 408501701 408656998 410054092 410877380 409587517 409416046 410050583 411206551 410534248 409784546
600.8D09784546o4468L78494J256027q71620p36237l75862L29247O81305m16489o64406
610.5D09300537N43594K016144L67813P53136K29492M08898J902122j75476L59802
619.2D15706062J995354K948227J682281R95789R58710L69682K218971K575379J283111
627.8D30733566m96978K31285J048431K42233J764641K085800N67475K9373J071510
636.5D37277336J214028J385078J524811K73323k80800J6479J321412J442413J546898
645.2D45720978J373787O52427P28646Q0108Q42095P58056L26729P70951R68322J421547
654.8D53643646O66237P01943J061973O32515L1204L65410R54399J46446m51049j27945
664.5D57624779J067161J485939P61719L20015K356300P33872K58827J818390O48804
$$ plain form
600.8 409784546 409720078 410098572 411354599 410482979 409746742 409370880 409700127 410381432 409964943 409300537
610.5 409300537 409844131 411860275 412228088 412981224 413210716 413619614 415521736 415346260 415706062
619.2 415706062 417701416 420649643 422331924 423327713 424286423 424656105 426875076 429450455 430733566
627.8 430733566 430236588 430467873 431516304 431758537 433523178 435608978 436176453 436205826 437277336
636.5 437277336 438491364 439876442 441401253 441674576 441393776 441410255 442731667 444174080 445720978
645.2 445720978 447094765 447747192 448475838 448555946 449398041 450156097 450482826 451253777 452222099 453643646
654.8 453643646 454309883 455011826 456073799 456706314 456737518 457102928 458057327 458203773 457752724 457624779
664.5 457624779 458691940 460177879 460939598 461259613 463615913 464349785 464608612 466427002 467075806
673.2D67075806M37889P03392r09691K85873J505547J771507J149864R52187J398125
681.8D74370499R40895J039619M96216n15633q32595J2626J60790j97678O78711R71985
691.5D77125435P77511K37313P1411q74138j639748p46345j342621j238708l89634
700.2D71980476p43904p40089p93724r53484n98831p35664r78623p3051N33561N93720
709.8D67490387q1711J69640J838913K070274K368927K413406J250649J212273K806930
718.5D81539688L832474L159561K323875K100335K254982K343788K070732K789688
726.2E02415123K549133J568108K936821L216934K381477K115632J677513J177253
733.9E20037994N77660J071320J214370J677971J525383P53899J519737P30934j02958
$$ plain form
673.2 467075806 467513695 468217087 467307396 467593269 469098816 470870323 472020187 472972374 474370499
681.8 474370499 475311394 476351013 476847229 476331596 475499001 475511627 475672417 475474739 476153450 477125435
691.5 477125435 477902946 478140259 478211670 477337532 475697784 474951439 473608818 472370110 471980476
700.2 471980476 471236572 470496483 469702759 468749275 468150444 467414780 466436157 466363106 466896667 467490387
709.8 467490387 467408676 467578316 469417229 471487503 473856430 476269836 477520485 478732758 481539688
718.5 481539688 485372162 488531723 490855598 492955933 495210915 497554703 499625435 502415123
726.2 502415123 504964256 506532364 509469185 512686119 515067596 517183228 518860741 520037994
733.9 520037994 520615654 521686974 522901344 524579315 526104698 526858597 528378334 529109268 529006310
742.6E29006310L67088P24869K68821j252823j688919j275177r00840n3826l93028
751.3E24802475j336250q21076j196632k710114l156395k074051j636581k354279j258010
760E08259087j108284k595787j296120L98025l13530j126060r32541l69644M15001
768.6E01330147K099457K578811J003533J186790K885361K884216K359390K825241
776.4E19152946K905045L200531L593407K836227K368889K979279L753509M419518
784.1E45209351L602981K971459M212570M259643L462830K631149K453156J671867
791.8E70475006J502190L090973K569351K220306J946297J863899K338562K365265
799.5E88371849J473045K11068Q35456M65737N53284M54750N52330P99484n3330J49918
$$ plain form
742.6 529006310 529373398 530098267 530367088 529114265 527425346 526150169 525249329 525195503 524802475
751.3 524802475 523466225 522645149 521448517 518738403 515582008 513507957 511871376 509517097 508259087
760 508259087 507150803 504555016 503258896 503656921 503343391 502217331 501284790 500915146 501330147
768.6 501330147 503429604 506008415 507011948 508198738 511084099 513968315 516327705 519152946
776.4 519152946 522057991 525258522 528851929 531688156 534057045 537036324 540789833 545209351
784.1 545209351 548812332 551783791 555996361 560256004 563718834 566349983 568803139 570475006
791.8 570475006 571977196 575068169 577637520 579857826 581804123 583668022 586006584 588371849
799.5 588371849 589844894 590055962 590891418 591357155 591910439 592365189 592917519 593717003 593663673 593813591
809.1E93813591p99713j21613J23215p27081j116562j900940j553192p88117N17197
817.8E87446785m6120k098Q3885L81470J114311k93884L58200l68042j565857j406021
827.5E85702629q06580j061401k050552n04990o78367p91626j137162j213684o35185
836.1E76823082j583824j462288j629295n29252j050300j873932p54128o97937o88171
844.8E66553955j359367j356964j662064j786652k453155k611580j288910j873741
852.5E52161522k163506k321586k678337l227311k483177k760048l981742j901818
860.3E30643997j177978m40407J078834K507172M407845M098701L970795M116363M679642
868.9E53884964M751968M841271N156174M857215N018883L422585L103943K301826
$$ plain form
809.1 593813591 593013878 592892265 593015480 592288399 591171837 589270897 587717705 586929588 587446785
817.8 587446785 587400665 587398567 587482452 587863922 588978233 588684349 589042549 588674507 587108650 585702629
827.5 585702629 584896049 583834648 581784096 581279106 580600739 579809113 578671951 577458267 576823082
836.1 576823082 575239258 573776970 572147675 571618423 570568123 568694191 567940063 567242126 566553955
844.8 566553955 565194588 563837624 562175560 560388908 557935753 555324173 554035263 552161522
852.5 552161522 549998016 547676430 544998093 541770782 539287605 536527557 532545815 530643997
860.3 530643997 529466019 529025612 530104446 532611618 537019463 541118164 545088959 549205322 553884964
868.9 553884964 558636932 563478203 568634377 573491592 578510475 581933060 585037003 587338829
876.7E87338829K337990K792015J718330J370163o00586l29895n59730j341629j645966
885.3E91079521l083381k917901k689170j948166j758652k482719k853470l157273
893E70188789l328743j800117j067276k546425k410126k277565k048340k234993k066154
901.7E50409050j440620k955170l606987l227043k709351l875580m130134k863236
909.4E25600929m435119n141640m439964m541359m978600n039940m496498m819641
917.2D87708168n442352m927368l667489k469291k427788k261658j804733j408691
924.9D63298798k36969L08418N51414M53644M35448O55098N49278O34880R77478R75571
934.5D68603058P28416K134209K663841J526222J659050K096711K295570K236671J620179
$$ plain form
876.7 587338829 589676819 592468834 594187164 595557327 594956741 594626846 594067116 592725487 591079521
885.3 591079521 587996140 585078239 582389069 580440903 578682251 576199532 573346062 570188789
893 570188789 566860046 565059929 563992653 561446228 559036102 556758537 554710197 552475204 550409050
901.7 550409050 548968430 546013260 542406273 539179230 536469879 532594299 528464165 525600929
909.4 525600929 521165810 516024170 511584206 507042847 502064247 497024307 492527809 487708168
917.2 487708168 482265816 477338448 473670959 471201668 468773880 466512222 464707489 463298798
924.9 463298798 463061829 463370247 463921661 464375305 464810753 465465851 466015129 466650009 467627487 468603058
934.5 468603058 469331474 471465683 474129524 475655746 477314796 479411507 481707077 483943748 485563927
943.2D85563927J879081K274285Q93211p18651j060562j242599k332154l048935l600235
951.9D78607368m682579n152511n192833n833283o040725n975380o429291o392517
959.6D32908249o414490o965790p162361p231178q115501p574234p489586p675820
967.3C74279289p232170q537330q673401r339562r061851q882637r402333q991470
975C04158535r420624q747005r047451p966347q009300p401524p103195q054295n381298
983.7B33027496n867977n048561m590416m107189l768959l707619j375809k501087
991.4B02059879j645317k037697j074276r09328j388035L81565r54323L73345m02584
1000.1A94403229K1553p0973o29558j7681j052265R59606l95890l14884r24377j412049
$$ plain form
943.2 485563927 487443008 489717293 490610504 489891853 488831291 487588692 485256538 482207603 478607368
951.9 478607368 473924789 468772278 463579445 457746162 451705437 445730057 439300766 432908249
959.6 432908249 426493759 419527969 412365608 405134430 397018929 389444695 381955109 374279289
967.3 374279289 367047119 358509789 349836388 340496826 331434975 322552338 313150005 304158535
975 304158535 294737911 285990906 276943455 268977108 260967808 253566284 246463089 238408794 233027496
983.7 233027496 227159519 222110958 217520542 213413353 209644394 205936775 204560966 202059879
991.4 202059879 200414562 198376865 197302589 196393261 195005226 195386791 194432468 194805813 194403229
1000.1 194403229 194424782 194353809 193724251 193706570 192654305 193613911 193218021 192903137 191978760 190566711
1009.7A90566711p60479j415691K9011j726875q58155l53946M96730K75593n84774
1018.4A85668125J085606J38950J067715q5087J420975J593952N02224P38125L7689
1027.1A92168274L121796J180248J044063J308709K341785K658386n97744P32651P6656
1035.8B04034824R74980l01686j57280M78535p03010N91659j325512K1267r72347j43890
1045.4B02497540M39510j4095J462078n11875J038341k44942J377316J765709J786709
1054.1B09596291L784542K308311M025307K090587K905598L211880L532410L295879
1061.8B34750805J812096M606132L083935L688736K584400K489586J259937k005215
1069.5B52270412j659278l908349k901725m712887m814282l686580k697029K2964q92067
$$ plain form
1009.7 190566711 189806232 188390541 188419552 186692677 185834522 185480576 185977306 186252899 185668125
1018.4 185668125 186753731 186892681 187960396 187875309 189296284 190890236 191392460 192130585 192168274
1027.1 192168274 195290070 196470318 197514381 198823090 201164875 203823261 203225517 203958168 204034824
1035.8 204034824 205009804 204708118 204550838 205029373 204326363 204918022 203592510 203613777 202641430 202497540
1045.4 202497540 202937050 202922955 204385033 203873158 204911499 204666557 206043873 207809582 209596291
1054.1 209596291 213380833 215689144 219714451 221805038 224710636 227922516 231454926 234750805
1061.8 234750805 236562901 241169033 244252968 247941704 250526104 253015690 254275627 252270412
1069.5 252270412 250611134 246702785 243801060 239088173 234273891 230587311 227890282 227913246 227021179
1078.2B27021179R69238l57742Q25768J554680J869812K605705J704120L849087K334786
1086.9B42376633L609619K677994K720604L986721L017425L756714K277164L187771
1094.6B67610645J831475K083263J391125J60656Q92410m97627J215687j83888J35269
1103.3B74639015k12688m98276Q73032K67467J990738J079388K450390K257556K560959
1112B85407581L149491J966533L160954J975288K676602J582927J831246K032146J241665
1120.6C05024433K054119K99168N95436K43664K037544K083454J239147J593571Q70132
1129.3C16040668K673855J423378K102051J839027J765748J647605j117668N91164
1137C26965828q278q78754j800155k843285l050728k604751j586819l428936k256317
$$ plain form
1078.2 227021179 227990417 227632675 228458443 230013123 231882935 234488640 236192760 240041847 242376633
1086.9 242376633 245986252 248664246 251384850 255371571 258388996 262145710 264422874 267610645
1094.6 267610645 269442120 271525383 272916508 273077164 273969574 273471947 274687634 274503746 274639015
1103.3 274639015 274426327 273928051 274801083 275068550 277059288 278138676 280589066 282846622 285407581
1112 285407581 288557072 290523605 293684559 295659847 298336449 299919376 301750622 303782768 305024433
1120.6 305024433 307078552 307377720 307973156 308216820 310254364 312337818 313576965 315170536 316040668
1129.3 316040668 318714523 320137901 322239952 324078979 325844727 327492332 326374664 326965828
1137 326965828 326957550 326078796 324278641 321435356 318384628 315779877 314193058 310764122 308507805
1145.7C08507805k477150k481117k087555j876412o57558j557388p50180j685981m89750
1154.4B94444714m75007o027J793919J217193K710457J282578K080631K702618L112430
1163.1C08863506L550968L763047N803032M427261N755081O119499O781769P524719
1170.8C52588882O568108P779732P574386P268258O528472O745949O619225O402817
1178.5D08075829O756401N892143N873260N745087N438576N068016M621658M327164
1186.2D51798134L962250L014030K410507K332421K001266J556091J410332J935387
1193.9D70420418J113205N84831R58366M25225K95257J03951k53525k14653K10457
1202.6D73643532M17366K73018N09948N92766R90486J303711J268120J412048J491318
$$ plain form
1145.7 308507805 306030655 303549538 301461983 299585571 298928013 297370625 296620445 294934464 294444714
1154.4 294444714 293969707 293963680 295757599 296974792 299685249 300967827 303048458 305751076 308863506
1163.1 308863506 312414474 316177521 321980553 326407814 332162895 338282394 345064163 352588882
1170.8 352588882 359156990 366936722 374511108 381779366 388307838 395053787 401673012 408075829
1178.5 408075829 414832230 420724373 426597633 432342720 437781296 442849312 447470970 451798134
1186.2 451798134 455760384 458774414 461184921 463517342 465518608 467074699 468485031 470420418
1193.9 470420418 471533623 472118454 473076820 473502045 473797302 473901253 473647728 473433075 473643532
1202.6 473643532 474060898 474333916 474843864 475436630 476427116 477730827 478998947 480410995 481902313
1211.3D81902313J444664J151619R32198J129684J327286J430740J551171P12242L54156
1220D91936073N79071K80381m57077r71375o83479j084748j042251j048660j196518
1228.6D86311417q11654j178092j218491j129685j010894j042099j162911r23118j100922
1237.3D76733551q14819o03142m81796j28556j95541k03857k31514Q7585N0430J45989
1247D74358330N27344N30815P25708P95135J112862Q39691M69208K04277r5864L51868
1256.6D79819374O49986N02129N1918R3231J80168L97797P71713P36695Q16841O10046
1266.3D84629898J022377J176415O63795P91893J458015J385460M68445O68755J072044
1274.9D93337097Q15201J15395n1537j40572n5008J99051k26669j77307m04244Q3962
$$ plain form
1211.3 481902313 483346977 484498596 485430794 486560478 487887764 489318504 490869675 491581917 491936073
1220 491936073 492515144 492795525 492338448 491367073 490683594 489598846 488556595 487507935 486311417
1228.6 486311417 485499763 484321671 483103180 481973495 480962601 479920502 478757591 477834473 476733551
1237.3 476733551 475918732 475315590 474833794 474705238 474509697 474305840 474074326 474161911 474212341 474358330
1247 474358330 474885674 475416489 476142197 476937332 478050194 478889885 479359093 479563370 479467506 479819374
1256.6 479819374 480469360 480971489 481023407 481116638 481296806 481694603 482466316 483203011 484019852 484629898
1266.3 484629898 485652275 486828690 487492485 488284378 489742393 491127853 491596298 492265053 493337097
1274.9 493337097 494152298 494267693 494216156 494075584 494020576 494219627 493992958 493815651 493411407 493495369
1284.6D93495369M94041K74620N11857J30767M9820k59094o31485j137619q83865k32392
1294.2D91812019n53589m69818q40759q68416q56361j250076j331101j471748j417237
1302.9D82752914j481590j355705j596832j653710j216888j110993j343307j564980
1310.6D71428909r35821o54869j024819j629486j886215j256599j352845j022644o14929
1319.3D61050682j193161r37309o04210l24211n67017j323471j686554k157898k439232
1328D49817619k300148j985473j784478j652336j693267j504021j060677j173820j016007
1336.7D35647392q94966j06506j29280j020546p25174n02968L14980N55076P15447
1345.3D33853455N20172O51207O00471j08490j83182l66058J41640l96271q5411M1656
$$ plain form
1284.6 493495369 493989410 494264030 494775887 494906654 494956474 494697380 494065895 492928276 492044411 491812019
1294.2 491812019 491258430 490788612 489947853 489079437 488223076 486973000 485641899 484170151 482752914
1302.9 482752914 481271324 479915619 478318787 476665077 475448189 474337196 472993889 471428909
1310.6 471428909 470493088 469838219 468813400 467183914 465297699 464041100 462688255 461665611 461050682
1319.3 461050682 459857521 458920212 458316002 457991791 457424774 456101303 454414749 452256851 449817619
1328 449817619 447517471 445531998 443747520 442095184 440401917 438897896 437837219 436663399 435647392
1336.7 435647392 434752426 434645920 434516640 433496094 432770920 432267952 432582932 433138008 433853455
1345.3 433853455 434373627 435024834 435625305 435516815 435333633 434967575 435109215 434712944 434627533 434669189
1355D34669189q04939j1749l6812l38402q79974R2812M52880j46675o80275j800651
1364.6D30515404l78952m15573L37371N06478p03812p629j92299P72400Q86688J201859
1374.3D32521935K56156n13382M06647O37245J403046K28043K92282O76765Q62885
1382.9D36771622P49397O69136K377052K456704K327499N56946J248703J489410O81343
1391.6D49327812Q62541M74930P86514j207389j261788j095886l22952m69971k003097
1400.3D45090714o97213j165390q50105o55289j136970j852875j686325j015434j504250
1409D34526863p16019q39881m50249p87544j162262l3379m48799K58789l25241Q15697
1418.6D30837975l58239j636734L11089j84746J793594O03333M52957O20308M14009
$$ plain form
1355 434669189 433864250 433852501 433815689 433477287 432597313 432690125 433143005 432996330 432316055 430515404
1364.6 430515404 430136452 429720879 430058250 430564728 429860916 429853287 429660988 430433388 431320076 432521935
1374.3 432521935 432778091 432264709 432671356 433308601 434711647 434939690 435231972 435908737 436771622
1382.9 436771622 437521019 438190155 440567207 443023911 445351410 445908356 447157059 448646469 449327812
1391.6 449327812 450190353 450665283 451451797 450244408 448982620 447886734 447563782 447093811 445090714
1400.3 445090714 444393501 443228111 442378006 441722717 440585747 438732872 437046547 436031113 434526863
1409 434526863 433810844 432970963 432520714 431733170 430570908 430537529 430088730 430347519 430022278 430837975
1418.6 430837975 430479736 428843002 429154091 428969345 430762939 431366272 431819229 432439537 432853546
1427.3D32853546J446877Q18824J496659p95975K92091P22123N32302J699372J510086
1436D40575905K178345j410485Q55713L54004K63634N72853j47591O12984l39356J058617
1445.6D44574623N66254Q36181k22549p61910O25306p49245l9558j272431O42090L60184
1455.3D44558945o7864L568878l252525J201172k084961J270027J313439J285629K850799
1464D50643539J856614K871399N47103L516694L107833M136658N220032N333443R956970
1472.6D87190285K548256N088920L442002N647811L600350K820625M657593L576546
1480.3E18572388N346946K424775L329048L370247L260460M508628L043671M066887
1488.1E47923050J816330M663200R42803k48642J408996J000443K743988K998314K196350
$$ plain form
1427.3 432853546 434300423 435119247 436615906 435819931 436112022 436834145 437366447 439065819 440575905
1436 440575905 442754250 441343765 442199478 442553482 442817116 443389969 443242378 443855362 443516006 444574623
1445.6 444574623 445140877 445977058 445754509 444992599 445617905 444868660 444829102 443556671 444198761 444558945
1455.3 444558945 444491081 448059959 444807434 446008606 443923645 445193672 446507111 447792740 450643539
1464 450643539 452500153 455371552 455918655 459435349 462543182 466679840 471899872 477233315 487190285
1472.6 487190285 489738541 494827461 498269463 503917274 507517624 510338249 514995842 518572388
1480.3 518572388 523919334 526344109 529673157 533043404 536303864 540812492 543856163 547923050
1488.1 547923050 549739380 554402580 555345383 555096741 556505737 557506180 560250168 563248482 565444832
1496.7E65444832n54733J441955p7515J1330J563873k17933R62066J401787M133415
1505.4E74109077P171784k671089j066590k746849j566887j291427L11699q65670J67847
1514.1E71551895J393585J747856M285660l766823M44794L268089M521447J757850
1521.8E85204353l126602k50015P04002P38373r46617J013031j9646j295852P78007
1530.5E82799034J205711K349167J133652j989708r10072n39017O35033J654777M093323
1539.2E90431900j153107J491318L15590j284142O88820N72625k279244j717110J58272
1547.9E87224922J077614J601257k14004r16J200524J549377K005196l21579J476745
1556.5E95599136K449646L05405L601532o394081o36673n29099l09677P69387O8092
$$ plain form
1496.7 565444832 564890099 566332054 566254539 566265869 567829742 567611809 568573875 569975662 574109077
1505.4 574109077 581280861 578609772 577543182 574796333 573229446 571938019 572249718 571384048 571551895
1514.1 571551895 572945480 574693336 578978996 575212173 575656967 578925056 583446503 585204353
1521.8 585204353 582077751 581827736 582531738 583270111 582323494 583336525 583316879 582021027 582799034
1530.5 582799034 584004745 586353912 587487564 585497856 584587784 584048767 584683800 586338577 590431900
1539.2 590431900 589278793 590770111 591085701 589801559 590490379 591063004 588783760 587066650 587224922
1547.9 587224922 588302536 589903793 589689789 589688873 590889397 592438774 594443970 594122391 595599136
1556.5 595599136 598048782 598354187 601955719 595561638 594924965 594395866 594086189 594855576 594923668
1565.2E94923668j488876r79271O54373K137604k360344l751145j785202r34715k45247
1573.9E86170845M48723J515465l881989k356033j898194j996650j658325k335053
1581.6E74008789j772919k419929k192383k382088j866035j695137j901093j735305
1589.3E58043900k922173j663170k798118k557831k294503l029480k574348l375206
1597E36829071k062569k905044k067070k632637k773209k005157l539276k465706k985802
1605.7E13392601k098160l625412k251701j638107l560410k048378l325462j777382
1613.4D93067589k295151l25317M37355o055947j888466k697677r93729k270851k50473
1622.1D76727333O05927l133469k098503k158547J88561j569023j602173k277336j508293
$$ plain form
1565.2 594923668 593434792 592455521 593109894 595247498 592887154 589136009 587350807 586416092 586170845
1573.9 586170845 586619568 588135033 584253044 581897011 579998817 578002167 576343842 574008789
1581.6 574008789 572235870 569815941 567623558 565241470 563375435 561680298 559779205 558043900
1589.3 558043900 555121727 553458557 550660439 548102608 545808105 542778625 540204277 536829071
1597 536829071 534766502 531861458 529794388 527161751 524388542 522383385 518844109 516378403 513392601
1605.7 513392601 511294441 507669029 505417328 503779221 500218811 498170433 494844971 493067589
1613.4 493067589 490772438 490447121 490884476 484828529 482940063 480242386 479248657 476977806 476727333
1622.1 476727333 477333260 474199791 472101288 469942741 470131302 468562279 466960106 464682770 463174477
1630.8D63174477o81343j383820R04350L30773L066482l651047k29644j515046j249465
1639.5D58765717N98793q28896J504135j21002J747971K305946J326332L860245k454262
1648.1D66704979k8954l28559K679481K736969n37872K929573l211861J481552L81165
1656.8D72806473J548538R82056J642227K308578K391854L637809k31323J712113J516952
1665.5D88315277K475128L009835L951110L959961N07737M351081J613160K311325
1673.2E10494614L161163M453926K942009J654511L523139L305855N777970M426422
1680.9E39739609L523292N779686Q406410P114716j994667K403832L655853M561119
1688.6E73189850M394035L714752L476792L888855M627723N157814N990983M445800
$$ plain form
1630.8 463174477 462493134 461109314 462013664 462344437 465410919 461759872 461530228 460015182 458765717
1639.5 458765717 459364510 458535614 460039749 459918747 461666718 463972664 465298996 469159241 466704979
1648.1 466704979 466676025 466347466 469026947 471763916 471226044 474155617 470943756 472425308 472806473
1656.8 472806473 474355011 475337067 476979294 479287872 481679726 485317535 485086212 486798325 488315277
1665.5 488315277 490790405 493800240 497751350 501711311 502219048 506570129 508183289 510494614
1673.2 510494614 513655777 518109703 521051712 522706223 526229362 529535217 535313187 539739609
1680.9 539739609 543262901 549042587 557448997 564563713 562569046 564972878 568628731 573189850
1688.6 573189850 577583885 581298637 584775429 588664284 593292007 598449821 604440804 608886604
1696.4F08886604M018402L058472L756981K048569R90944L554039K622909L716812
1704.1F32653732K117272K434425J566467n89943R56994J437530K54364K66647J955185
1712.8F43052673K775269K429504P66678K414093M055329l315354k406845O3705N02549
1721.4F50337601K09045P10297J97830J73721Q40607M73328Q06274J591873J217728
1730.1F56558304j220246J390992L675689J316529l772812j084442R30328P92236J855774
1738.8F60442352K068405j535568J197968L014984K344284q88825J084519K374115
1746.5F70102234K345886L427506L63540K181931K551040L58735J874847J710129K597580
1755.2F87513428L609466K891541Q46710J300964J728516L438568L336182J14822K132721
$$ plain form
1696.4 608886604 612905006 615963478 619720459 621769028 622759972 626314011 628936920 632653732
1704.1 632653732 634771004 637205429 638771896 638181953 639138947 640576477 640830841 641097488 643052673
1712.8 643052673 645827942 648257446 649024124 651438217 655493546 652178192 649771347 649835052 650337601
1721.4 650337601 650546646 651256943 651454773 651628494 652469101 652942429 653748703 655340576 656558304
1730.1 656558304 655338058 656729050 660404739 661721268 657948456 656864014 657794342 658586578 660442352
1738.8 660442352 662510757 660975189 662173157 665188141 667532425 666643600 667728119 670102234
1746.5 670102234 672448120 675875626 676239166 678421097 680972137 681330872 683205719 684915848 687513428
1755.2 687513428 691122894 694014435 694861145 696162109 697890625 701329193 704665375 704780197 706912918
1763.9G06912918J788406J845093K351837L176423J417999O36520L738480L874130
1771.6G25741806J045303l368377R27505K434769J65558P27234Q39233J908951J291199
1780.3G31713181k06986n9280Q34121J774216J36566m81720M75159J501846Q33206
1788.9G36520309J335602K319489J601562J33438j922989J157074J020508m26330j74179
1797.6G41564484J174621J650620m75998J242676m9210p07932N57557M09011L47596
1806.3G45713425N86166P20596J17569J757584M94766m91485j7014k02255P96814r3079
1815.9G49383087Q37479L60794J7624L18756k79541R71756L62625Q78220J699600J10931
1825.6G54661331j415863J6327K063599K668304o86340k329407M8065n9967k2278J42975
$$ plain form
1763.9 706912918 708701324 710546417 712898254 716074677 717492676 718129196 721867676 725741806
1771.6 725741806 726787109 723418732 724346237 726781006 726946564 727673798 728513031 730421982 731713181
1780.3 731713181 731506195 731446915 732281036 734055252 734191818 733710098 734185257 735687103 736520309
1788.9 736520309 737855911 740175400 741776962 741910400 739987411 741144485 742164993 741738663 741564484
1797.6 741564484 742739105 744389725 743913727 745156403 745107193 744399261 744956818 745365829 745713425
1806.3 745713425 746299591 747020187 747137756 748895340 749390106 748898621 748881607 748679352 749476166 749383087
1815.9 749383087 750220566 750581360 750598984 750917740 750638199 751609955 751972580 752850800 754550400 754661331
1825.6 754661331 753245468 753261795 755325394 757993698 757307358 754977951 755026016 754966049 754943771 755086746
1835.2G55086746M24576J135025n27725j21460l47214M04358J091080J351242K307358
1843.9G60803986k545472q52584M01153P21893L4562o66657j80054l98712O98853j6403
1853.6G58000565j3810k1591N9204M24195n6839N81817j60064M96597P4768l68042
1863.2G59016800M0741J58005J267776Q39386J887436L72849j680680q73489o42166
1871.9G60386658K20413j94016K08893j06125L12882J78604k33231L32413j86081L53089
1881.5G61273499k02408L33328N14603k4338K07062j89972Q87909R26513k95639p91473
1891.2G62639084J0681L05100P57675J035843j139985m70352Q698J82571J15891q7891
1900.8G63357315L49732l24326J01395J06048K15607J27563L28217M18930l5553l17535
$$ plain form
1835.2 755086746 755511322 756646347 756118622 755997162 755649948 756054306 757145386 758496628 760803986
1843.9 760803986 758258514 757405930 757807083 758528976 758563538 757896881 757716827 757318115 758016968 758000565
1853.6 758000565 757986755 757965164 758024368 758448563 758391724 758973541 758813477 759310074 759384842 759016800
1863.2 759016800 759057541 759215546 760483322 761322708 763210144 763582993 761902313 761028824 760386658
1871.9 760386658 760607071 760413055 760621948 760515823 760828705 761007309 760774078 761106491 760920410 761273499
1881.5 761273499 761071091 761404419 761919022 761894684 762101746 761911774 762799683 763726196 763430557 762639084
1891.2 762639084 762649765 762954865 763712540 764748383 763608398 763138046 763146744 763329315 763445206 763357315
1900.8 763357315 763707047 763382721 763484116 763590164 763805771 763933334 764261551 764680481 764644928 764327393
1910.4G64327393j267472K18125P324n1956M51660j04752J331330L53851r50470l80936
1920.1G63934097L26004J313019M12750j447754r32159N29404L3493N1117r232O1569
1929.7G64272308R8038n15060L38363L9902O5384k16217r1858J97220q3084N70297
1939.4G64675293j98975N32837P43637j018295l13721N99976J04980o14318J48162
1948.1G64659576k34298N0888K72293O7062O8283j37176M81720o06156n45578J06964
1957.7G64183578L06855M56772j755J76391k67410j5564R1248O57119P21970l54614
1967.3G65954590o23627q28171Q5831K31018L94135L56598j25885k4338l739K86637
1977G65703049l68729p3090k64892l51486J02997L3569N81970k04086j62430K09198
$$ plain form
1910.4 764327393 763059921 763278046 763285370 763233414 763685074 763580322 764911652 765265503 764315033 763934097
1920.1 763934097 764260101 765573120 765985870 764538116 763605957 764135361 764168854 764219971 764210739 764272308
1929.7 764272308 764370346 763855286 764193649 764233551 764298935 764082718 763990860 764188080 764104996 764675293
1939.4 764675293 764476318 765009155 765752792 764734497 764420776 765020752 765125732 764511414 764659576
1948.1 764659576 764425278 764476166 764748459 764815521 764883804 764746628 765228348 764622192 764076614 764183578
1957.7 764183578 764490433 764947205 764945450 765121841 764854431 764838867 764930115 765587234 766309204 765954590
1967.3 765954590 765330963 764502792 764588623 764819641 765213776 765570374 765444489 765420151 765416412 765703049
1977 765703049 765334320 765261230 764996338 764644852 764747849 764781418 765363388 765159302 764996872 765206070
1986.6G65206070O88629N51682o22864j54419J65176o6757o42700L433k05383l14331
1996.3G64608536M56009K82287L86734p84836m88281J08872n0660Q2093n50461l17307
2005.9G63732986j55792M05884k0905l93219j35345k92511J34277j12228N4626J05973
2015.6G63323746J59530m92477m57993o2027p83004L4027K2812o3248p4768j02921
2025.2G61503677k66189q17871j65634l98865j27335k63290J47400M98657l71018K0218
2034.9G59759750m15725l06549j74332k18048m89960l84445L68347p7667L33786l09982
2044.5G58085175l97187j08032j07727J95923m19235J58233r1781k7924j22070k71530
2054.1G56893845J14669k82440L49274k17896j90734K79846J86462K6856l83683L31421
$$ plain form
1986.6 765206070 765894699 766446381 765823517 765669098 765834274 765767517 765124817 765128250 764922867 764608536
1996.3 764608536 765064545 765346832 765733566 764948730 764460449 764569321 764518661 764600754 764050293 763732986
2005.9 763732986 763577194 763983078 763962173 763568954 763433609 763141098 763275375 763163147 763217773 763323746
2015.6 763323746 763483276 762990799 762532806 762470779 761687775 761721802 761744614 761681366 761606598 761503677
2025.2 761503677 761237488 760419617 760253983 759855118 759727783 759464493 759611893 760110550 759739532 759759750
2034.9 759759750 759344025 759037476 758863144 758645096 758155136 757770691 758139038 758061371 758395157 758085175
2044.5 758085175 757687988 757579956 757472229 757668152 757248917 757407150 757315369 757287445 757165375 756893845
2054.1 756893845 757008514 756726074 757075348 756857452 756666718 756946564 757133026 757159882 756776199 757107620
2063.8G57107620L63846R4605n47791k23083K36129J5106J85318l22189j2512J17722
2073.4G57014771L66745O7672o3324M33960j58081k91824o75659j64948K3041r1858
2083.1G56460495K54974K01035J98440j32293N76935l1510l61099L3569k74505N1269
2092.7G56977310j0223K75192l51715o8512K55585J09176O92749j3122J94320j05514
2102.4G57955246n67169k23236K01111K36129k12555J62049N5389L65906K06756J52131
2112G58331757J28097k64282R4910l18451j30387k13928J05667K67639j57699J69525
2121.6G58012848K14691L98865k13776K9755k97318o49261j10169l32336M43497J66015
2131.3G57662811L3951j5564N8594N62897J31759J83411l77274j50299L3417j11008
$$ plain form
2063.8 757107620 757471466 757566071 757018280 756795197 757031326 757046432 757231750 756909561 756897049 757014771
2073.4 757014771 757381516 757449188 757385864 757819824 757661743 757369919 756694260 756529312 756552353 756460495
2083.1 756460495 756715469 756916504 757114944 756982651 757559586 757528076 757166977 757200546 756926041 756977310
2092.7 756977310 756967087 757242279 756890564 756822052 757077637 757186813 757879562 757866440 758060760 757955246
2102.4 757955246 757388077 757164841 757365952 757602081 757389526 757551575 757606964 757972870 758179626 758331757
2112 758331757 758459854 758195572 758290482 757972031 757841644 757627716 757733383 758001022 757843323 758012848
2121.6 758012848 758227539 758626404 758412628 758442383 758145065 757495804 757385635 757053299 757496796 757662811
2131.3 757662811 757696762 757681198 757739792 758302689 758434448 758617859 758240585 758090286 758123703 758012695
2140.9G58012695M9362j4419J66473m0512K70844L2272K29797K09961k84423j41373
2150.6G58490677l8223J52282o06002j64795J32980K86179M15878j06888M55933o8741
2160.2G58949280K94723K53983l67127J31531J36643J60217K6779O02646M0207j08109
2169.9G60120773N79682K49405O0577m55780j04904K58026O05774K62298k06680K59400
2179.5G61628571K71301K68402j91574K03171J27792j3733M96521L05405Q4915l41873
2189.1G62838898L72925M73098K92511J82801k15989j6403j88064K40631K6550J14288
2198.8G64121246J91651p6371K83509L89557L86276k57263J70669j57013m64172J78604
2208.4G64766693J39694M32206P6293M82483M41590L17230M76608J13068P400o63833
$$ plain form
2140.9 758012695 758062057 758047638 758214111 758173599 758444443 758476715 758706512 758916473 758632050 758490677
2150.6 758490677 758452454 758604736 757998734 757833939 757966919 758253098 758668976 758562088 759018021 758949280
2160.2 758949280 759244003 759497986 759130859 759262390 759399033 759559250 759586029 760188675 760228882 760120773
2169.9 760120773 760700455 760949860 761010437 760554657 760449753 760707779 761313553 761575851 761369171 761628571
2179.5 761628571 761899872 762168274 761976700 762179871 762307663 762293930 762790451 763095856 763180771 762838898
2189.1 762838898 763211823 763684921 763977432 764160233 763944244 763927841 763739777 763980408 764006958 764121246
2198.8 764121246 764312897 764236526 764520035 764909592 765295868 765038605 765209274 765052261 764588089 764766693
2208.4 764766693 764906387 765338593 765414886 765897369 766338959 766656189 767132797 767245865 767253265 766589432
2218.1G66589432k63977k50626O0501K26364j03988M00543L29895N64041j4801J81732
2227.7G67719116K93274l32565k70996m01764J61514n7907p4005Q621K64435M40369
2237.4G67750092Q1100L33939m6082R6665j19019N1575j81885o62079J46103J4572
2247G67464981M03519K76870L06931L71323p4540j80587m43802K56576K1057q0795
2256.7G68321533q6212P629M7226j54495N69916J45340J82342m043Q6365j374m88662
2267.3G68625565O3018r4528M31748j79139j64184K09198J30081P55158j24894k42233
2276.9G69409790m83093P858j28021m82331L71781J9760M32587o4926L7307Q3008p8201
2287.5G69125519L96957k47574J02539l88107K41165K86255n12161J40457j1139M19617
$$ plain form
2218.1 766589432 766325455 766074829 766135330 766361694 766257706 766658249 766988144 767552185 767537384 767719116
2227.7 767719116 768012390 767679825 767408829 767007065 767168579 767110672 767036667 767045288 767309723 767750092
2237.4 767750092 767831192 768165131 768119049 768215714 768096695 768148270 767966385 767304306 767450409 767464981
2247 767464981 767868500 768145370 768452301 768823624 768749084 768568497 768124695 768381271 768402328 768321533
2256.7 768321533 768235321 768242950 768290176 768135681 768705597 768850937 769033279 769029236 769115601 769114227 768625565
2267.3 768625565 768688583 768594055 769025803 768846664 768682480 768891678 769021759 769776917 769652023 769409790
2276.9 769409790 768926697 768934555 768806534 768324203 768695984 768715744 769148331 769083405 769120712 769203720 769125519
2287.5 769125519 769522476 769274902 769377441 768989334 769230499 769516754 769004593 769145050 769133911 769553528
2297.2G69553528n6763k2507J37558K8534J84250j8005M38537k59246j19019m3030
2306.8G69823837J84555N92804L68271N55878n09491n29022n76630q5373N89600O82068
2316.4G71096497M95452m07791N28412L54767N67246j8921n42984M00695n96771j46713
2326.1G71729889J10245Q00934p1793l19901R88770n51605n01175n69229K0370O49719
2335.7G72286224L47672m65317r54590K17133K97546N98221J61209l77350m60281r64813
2345.4G70685654j132050o94504m31137j91726L10745q4610P75604M89731M14581N76554
2355G70718842j648331P46689P24792L46680M86374L02505n24139j551972J046830
2363.7G70648270j167603p38754l42255n57480O48804o42700p41425j236725o45752
$$ plain form
2297.2 769553528 769496765 769474258 769611816 769640350 769824600 769806595 770245132 769985886 769866867 769823837
2306.8 769823837 770008392 770601196 770969467 771525345 771015854 770486832 769910202 769824829 770414429 771096497
2316.4 771096497 771591949 771184158 771712570 772067337 772634583 772615662 772072678 772473373 771876602 771729889
2326.1 771729889 771840134 772641068 772569275 772249374 773238144 772686539 772185364 771616135 771636505 772286224
2335.7 772286224 772633896 772168579 771213989 771431122 771728668 772326889 772488098 772110748 771650467 770685654
2345.4 770685654 769553604 768859100 768427963 768236237 768546982 768462372 769237976 769727707 770142288 770718842
2355 770718842 769070511 769817200 770541992 770888672 771375046 771677551 771153412 769601440 770648270
2363.7 770648270 769480667 768741913 768399658 767842178 768490982 767848282 767106857 765870132 765224380
2372.4G65224380r35821o39496m09088q98590k68326n42374l35998r00879p55997l30505
2382G59207306n14908m04663p40128l20510l66364r3842K98234J87149j65024n21775
2391.7G56565475m8980l40119l01742n52674l33404K04010j65176P9345k75116k84195
2401.3G54547424l65905l24173k32468k54669k213m77676J5716l75366q10699l14713
2410.9G51405258n264M16946l9596m20609r80682o24313m9286m27704n71060m12903
2420.6G48290787j43509l11890j39618l06625k22397l77655o54755j74179m22592o9122
2430.2G45468445j2589l50418r28344q85926J47934j31073m86603o29577k40708k36282
2439.9G41714859m09622l72467m97513n2795o37818m61044j83716l88184k75192m90875
$$ plain form
2372.4 765224380 764288559 763649063 763239975 762341385 762073059 761530685 761194687 760293808 759537811 759207306
2382 759207306 758692398 758287735 757547607 757227097 756860733 756766891 757065125 757252274 757087250 756565475
2391.7 756565475 756516495 756176376 755874634 755321960 754988556 755192566 755027390 755106735 754831619 754547424
2401.3 754547424 754181519 753857346 753624878 753370209 753367996 752890320 752906036 752530670 751719971 751405258
2410.9 751405258 751399994 751816940 751777344 751356735 750376053 749751740 749702454 749274750 748703690 748290787
2420.6 748290787 748147278 747835388 747695770 747389145 747166748 746789093 746134338 745960159 745537567 745468445
2430.2 745468445 745455856 745105438 744177094 743291168 743439102 743308029 742821426 742191849 741951141 741714859
2439.9 741714859 741305237 740932770 740435257 740382462 739744644 739283600 739099884 738711700 738436508 737945633
2449.5G37945633o7139j43661l39432n29556m46091l68271m70733m47770m74929M5013
2459.2G34703064o31104o74896l02810n46341m81415o31867R4834J62201l83149r00726
2468.8G30407791n74646J50528j51672k84043o58722n76705l93067m6997p5455l37677
2478.5G27459335N2872l85513m16184n44739l85589j56784n33295o57348p80793j48391
2488.1G23503571l8910j45645j01777J91727J40381m41513n35736q45108p63J1215
2497.7G21737442o42395o33926l29209L42179l97416l39737p9727k30331l01743k30407
2507.4G18894730L42025m98428r29489q09097m27552p6R3079K90985j00785k47039
2517G16608353l39890P4616j64261o99997o89697p61643k31171k61993j66321k90680
$$ plain form
2449.5 737945633 737878494 737734833 737395401 736865845 736419754 736051483 735580750 735132980 734658051 734703064
2459.2 734703064 734071960 733397064 733094254 732547913 732066498 731434631 731529465 731691666 731308517 730407791
2468.8 730407791 729833145 729983673 729832001 729547958 728889236 728312531 727919464 727872467 727797012 727459335
2478.5 727459335 727512207 727126694 726710510 726165771 725780182 725623398 725090103 724432755 723651962 723503571
2488.1 723503571 723464661 723319016 723217239 723408966 723549347 723107834 722572098 721726990 721726227 721737442
2497.7 721737442 721095047 720461121 720131912 720474091 720076675 719736938 719657211 719426880 719125137 718894730
2507.4 718894730 719236755 718738327 717808838 716999741 716572189 716572113 716665192 716956177 716855392 716608353
2517 716608353 716268463 716343079 716178818 715478821 714789124 714027481 713796310 713534317 713367996 713077316
2526.7G13077316j32065J20469m48227k22855L0594j38016r29565r51844o53839m03442
2536.3G09348526P8735m61044l98483k19345j62506l03116k86560o2027k34528m30908
2546G06868744j111527n27114l22037n14145N1346K84500Q4457q39615m22058k42538
2555.6G03310013n87921o58112q47092l75595p3089K09503m72946n89066k66113m27170
2565.2F99222412l16849m82559l14941q09250m91181r536k95487l35617m40903j18026
2574.9F95608063m45938j12152o8207n08652l49960p29676m62646k65274l56598n05905
2584.5F91803055k74811j18942n63965m20761k52228m29306n80597n8517j40763j95999
2594.2F88767166j41754p91626n06668j72196L4714k79007o68869o30569k20947j27411
$$ plain form
2526.7 713077316 712945251 713065720 712617493 712394638 712425232 712287216 711357651 710405807 709751968 709348526
2536.3 709348526 709427261 708966217 708567734 708348389 708185883 707882767 707596207 707534180 707299652 706868744
2546 706868744 705757217 705230103 704908066 704393921 704445267 704729767 704814224 703974609 703552551 703310013
2555.6 703310013 702722092 702063980 701216888 700841293 700768204 700977707 700504761 699915695 699649582 699222412
2565.2 699222412 698905563 698423004 698108063 697298813 696807632 696798096 696502609 696166992 695726089 695608063
2574.9 695608063 695162125 695049973 694981766 694473114 694123154 693393478 692930832 692665558 692308960 691803055
2584.5 691803055 691528244 691409302 690845337 690424576 690172348 689743042 689162445 689103928 688963165 688767166
2594.2 688767166 688625412 687833786 687327118 687154922 687189636 686910629 686241760 685611191 685390244 685262833
2603.8F85262833p08161l05328o79550l70026Q2550l17917J22376l08228o37665r34753
2613.5F81206131o23779o77109j111069k33536j20239k71835m76685k98004m91485
2622.1F76902390n97535l15170p94144p44629j108016p39823m34494p69272m78744
2630.8F70920563k31552j40000m93622k80151p14645q09250p52030j329498q48236
2639.5F65321579o42777j64871m01458o38657r2697j74256m76074r49096o75965p73392
2649.1F60332336r71450r12781p06711l97263o87332n08957l40652j71814n59616o48575
2658.8F54427185l83072j134872j288300n74264k11182p38373l90625k47116m57687
2667.5F49001694j50070m58069l17307o16531o63147q85773j047821k51617l28522
$$ plain form
2603.8 685262833 684554672 684249344 683569794 683199768 683282318 682964401 683086777 682778549 682140884 681206131
2613.5 681206131 680582352 679905243 678794174 678560638 678440399 678168564 677691879 677393875 676902390
2622.1 676902390 676304855 675989685 675195541 674450912 673342896 672603073 672168579 671399307 670920563
2630.8 670920563 670689011 670549011 670055389 669775238 669060593 668251343 667499313 666169815 665321579
2639.5 665321579 664678802 664513931 664112473 663473816 663381119 663206863 662730789 661781693 661105728 660332336
2649.1 660332336 659360886 658448105 657741394 657344131 656656799 656147842 655807190 655635376 655075760 654427185
2658.8 654427185 654044113 652909241 651620941 651046677 650835495 650097122 649706497 649459381 649001694
2667.5 649001694 648851624 648393555 648076248 647459717 646796570 645910797 644862976 644611359 644282837
2676.1F44282837n04456p22961k43301k3194l30124n38406p99790n40161r15031n18837
2685.8F39146576l34015o10008m92630m62074l23792o34308L5858j17912o13632o43921
2695.4F34950142j026001n31197n57708l98293k79999m77600n48134m84657l79028
2704.1F30267525p65648m03290n80330j054840p12433j95885n21202r74235n22881
2712.8F24536781n37185k57683m84047o13251l75290o08940k48184k89803j07765m53148
2722.4F20561485r18922q42133n56030K16713k56348q40530r48410m60358j93786n00794
2732.1F15260887k94609n35927n08575k89841q1901l81737o85311j98936m67262p28569
2741.7F11088219q0643M04434o11114r83887J10970K7847p49855m63372j37062o34842
$$ plain form
2676.1 644282837 643778381 643055420 642812119 642788925 642458801 641920395 641120605 640580444 639665413 639146576
2685.8 639146576 638812561 638202553 637709923 637247849 636924057 636289749 636325607 636207695 635594063 634950142
2695.4 634950142 633924141 633392944 632835236 632436943 632156944 631679344 631131210 630646553 630267525
2704.1 630267525 629501877 629098587 628518257 627463417 626750984 626555099 626033897 625059662 624536781
2712.8 624536781 623999596 623741913 623257866 622644615 622269325 621660385 621412201 621122398 621014633 620561485
2722.4 620561485 619642563 618800430 618244400 618461113 618204765 617364235 616415825 615955467 615761681 615260887
2732.1 615260887 614966278 614430351 613921776 613631935 613550034 613168297 612482986 612284050 611816788 611088219
2741.7 611088219 611007576 611412010 610800896 609817009 609927979 609955826 609205971 608742599 608605537 607970695
2751.4F07970695l87229p20826j027679l30391k42386q2054k88925l17536k40745k28920
2761F04104004m34494q51975m10537l61252j28174l17841p17353k79541q78R995l73116
2771.6F00238838m01420o40450o60019o67953p70340k67067m71535p81631r06601m70162
2781.3E94201660k57568j64414J1216q75359r84345n09300k37732p27195j212464r95559
2790.9E88248940q14362k66914m15841l78952k05078q02879j126823j043778j205139
2799.6E81989174j324234p17316q45718j100540q88024o40487m93088o96182r40667
2808.3E74342918j375312q41561j063270j675606j107369q58383p12852j212235j243171
2816.9E64253159j032067r64851o13022j246376j501541j296044j359176j505547j265754
$$ plain form
2751.4 607970695 607583466 606862640 605834961 605504570 605262184 605180130 604891205 604573669 604332924 604104004
2761 604104004 603669510 602817535 602406998 602045746 601917572 601599731 600882378 600602837 600601959 600611954 600238838
2771.6 600238838 599837418 599196968 598536949 597868996 597098656 596831589 596360054 595578423 594671822 594201660
2781.3 594201660 593944092 593779678 593790894 592915535 591931190 591421890 591184158 590456963 589244499 588248940
2790.9 588248940 587434578 587167664 586751823 586372871 586167793 585364914 584238091 583194313 581989174
2799.6 581989174 580664940 579947624 579101906 578001366 577113342 576472855 575979767 575283585 574342918
2808.3 574342918 572967606 572126045 571062775 569387169 568279800 567421417 566708565 565496330 564253159
2816.9 564253159 563221092 562256241 561643219 560396843 558895302 557599258 556240082 554734535 553468781
2825.6E53468781j103211j319923j130944j184463j373253j449013j241302j182289
2833.3E43484383j350441j771393k207146j700554j537132j463318j513595k117081
2841.1E29823723k470589k330627k094765k550430k429390k010727k479439l335457
2848.8E10122299l026771k139550k340011j983872j224708p20749r82247j341629p59468
2857.4D95603294r64508j025657o40717r59740j371460j213798j339111j515923j292190
2866.1D85280190j758423k220307k589035k159042j652794j899948j975670k523956
2873.8D68501015k248459j777878j828499j918411k047234j645164j584015j775398
2881.6D53675957j712456r89304r09996j238708q23822p77550p06558r45549p58934
$$ plain form
2825.6 553468781 552365570 551045647 549914703 548730240 547356987 545907974 544666672 543484383
2833.3 543484383 542133942 540362549 538155403 536454849 534917717 533454399 531940804 529823723
2841.1 529823723 527353134 525022507 522927742 520377312 517947922 515937195 513457756 510122299
2848.8 510122299 507095528 504955978 502615967 500632095 499407387 498686638 497704391 496362762 495603294
2857.4 495603294 494638786 493613129 492972412 492012672 490641212 489427414 488088303 486572380 485280190
2866.1 485280190 483521767 481301460 478712425 476553383 474900589 473000641 471024971 468501015
2873.8 468501015 466252556 464474678 462646179 460727768 458680534 457035370 455451355 453675957
2881.6 453675957 451963501 450974197 450064201 448825493 448001671 447224121 446517563 445572014 444813080
2890.2D44813080m10958m41207m27056r06982n71289j9799j39427r00840p76749N6572
2899.9D40275345m02718p59506r22890r12475j080857j252288r59092r05761r30481
2908.6D32149277j317215j182518j113663j391144j670151j941070k242470k812652
2916.3D18478394k093049j956253k429924j780281j313057j379699j747132j555252
2924D04223747j172409j087875r54895p0458J24283l21922K05879M7646O53495J332207
2933.6D02979698J216698J540260J528511J874466K323303K747689K312889K180862
2941.3D18704376K523384K149964K855987L052979K758789K831955K612915K450981
2949.1D39941330K106247K009582K476883K582131J930809K157211K761574K565193
$$ plain form
2890.2 444813080 444402122 443960915 443533859 442626877 442055588 442035789 441896362 440995522 440218773 440275345
2899.9 440275345 439872627 439113121 438190231 437277756 436196899 434944611 433985519 433079758 432149277
2908.6 432149277 430832062 429649544 428535881 427144737 425474586 423533516 421291046 418478394
2916.3 418478394 416385345 414429092 411999168 410218887 408905830 407526131 405778999 404223747
2924 404223747 403051338 401963463 401008568 400938110 401062393 400740471 400946350 400993996 401647491 402979698
2933.6 402979698 404196396 405736656 407265167 409139633 411462936 414210625 416523514 418704376
2941.3 418704376 421227760 423377724 426233711 429286690 432045479 434877434 437490349 439941330
2949.1 439941330 442047577 444057159 446534042 449116173 451046982 453204193 455965767 458530960
2956.8D58530960J959496K283592K775497K182236K052231J505928J930694K726326
2964.5D75946960K120858K124633K112847K130127K114296K161674K253189K200013
2972.2D93164597J656227J140442J810913J680641J577301J713905J899643K156029
2979.9E06799698J936455J927337J249733J192360J357155J280327R50279O77796J296157
2988.6E18667297J267357J219864P63703Q97674J099930M73976L27835J18065L85208
2997.3E25220909j13945J72386O76346K2774J12648k52533l91502l31460q773r5902
3006.9E25010948n20897k98347q88367o66847j3466l56331j001091m79965J60255r98382
3016.6E19947510j390267p83233n80902r38836j305618j089897o80885o43654r36470
$$ plain form
2956.8 458530960 460490456 462774048 465549545 467731781 469784012 471289940 473220634 475946960
2964.5 475946960 478067818 480192451 482305298 484435425 486549721 488711395 490964584 493164597
2972.2 493164597 494820824 495961266 497772179 499452820 501030121 502744026 504643669 506799698
2979.9 506799698 508736153 510663490 511913223 513105583 514462738 515743065 516693344 517371140 518667297
2988.6 518667297 519934654 521154518 521918221 522815895 523915825 524389801 524717636 524835701 525220909
2997.3 525220909 525106964 525279350 525955696 525978470 526091118 525838585 525447083 525115623 525106850 525010948
3006.9 525010948 524490051 524191704 523303337 522636490 522623024 522266693 521265602 520785637 520945892 519947510
3016.6 519947510 518557243 517774010 517193108 516254272 514948654 513858757 513177872 512534218 511597748
3025.2E11597748j006813j063767q97407r47151j015587j130715j138649j206588j900597
3033.9E01290474j137695n57175r70497j217995j353035q72230p81327j166420j712150
3042.6D91521950j461983j116600j002007j295394j851426r65385j132469j444664
3050.3D81252022j262284j258201q37746j323318j227684j235009j502685j440353
3058D71164742j011391p45125j709290j423568q22830q77038j472587j680641r41735
3066.7D60480537j342659j361465j149139j413041j346206j286698j352348j109161
3074.4D50119820q42247j368561j372833j100922j011009j208763j546517j266327
3082.1D40402641j264915j021958r96437j468505j493760j027488r19800j576462j543846
$$ plain form
3025.2 511597748 510590935 509527168 508629761 507682610 506667023 505536308 504397659 503191071 501290474
3033.9 501290474 500152779 499595604 498625107 497407112 496054077 495181847 494400520 493234100 491521950
3042.6 491521950 490059967 488943367 487941360 486645966 484794540 483829155 482696686 481252022
3050.3 481252022 479989738 478731537 477893791 476570473 475342789 474107780 472605095 471164742
3058 471164742 470153351 469408226 467698936 466275368 465452538 464575500 463102913 461422272 460480537
3066.7 460480537 459137878 457776413 456627274 455214233 453868027 452581329 451228981 450119820
3074.4 450119820 449277573 447909012 446536179 445435257 444424248 443215485 441668968 440402641
3082.1 440402641 439137726 438115768 437119331 435650826 434157066 433129578 432209778 430633316 429089470
3090.8D29089470j065865r96093j241723j145896j048661j262054j233101j425018
3098.5D19671059j206322p64656r77211j625595j490402j065102j234932j138077j311111
3107.2D08857651j211052j065521j191636j149101r06181q18978j568183j171418j016311
3115.9C98759270j564331j254273j215286j323471j437378j008263j285324j529846
3123.6C88141098q84514j036491j224900j464767j228981j012001j213074r33189q62923
3132.3C78280258j607094j653213n72281o24390q11844j258621j720581j228599j173401
3141C67630234j170845j740494j381187p04499j212501j169663j024475r14535r88503
3149.6C57323532j124916j465988j475830j076966j059608p47185o61735p84951j340026
$$ plain form
3090.8 429089470 428023605 427027512 425785789 424639893 423591232 422329178 421096077 419671059
3098.5 419671059 418464737 417700081 416722870 415097275 413606873 412541771 411306839 410168762 408857651
3107.2 408857651 407646599 406581078 405389442 404240341 403334160 402515182 400946999 399775581 398759270
3115.9 398759270 397194939 395940666 394725380 393401909 391964531 390956268 389670944 388141098
3123.6 388141098 387256584 386220093 384995193 383530426 382301445 381289444 380076370 379143181 378280258
3132.3 378280258 376673164 375019951 374447670 373823280 373011436 371752815 370032234 368803635 367630234
3141 367630234 366459389 364718895 363337708 362633209 361420708 360251045 359226570 358312035 357323532
3149.6 357323532 356198616 354732628 353256798 352179832 351120224 350373039 349711304 348926353 347586327
3158.3C47586327j327820q32939j031189j104584j297875j102256p72667o68793j157532
3167C38290672j520271j134911j030960q06999j163216j070060q95233j217308q81348
3175.7C28570366q09174o10389r99833j248321o58798p39060j056938r66453q81768
3184.4C20599632j171169j076851q83312p57904r25789q79936n35507q79365j029148
3193C12460651j137104p84740n03407p40852j005955j005897p38278j099319n72090
3201.7C04873009p94316j177978n38082p01294m17996n54332n54734r65633j245480
3210.4B97923164k26478m84905p75147j153603j193237o01482o09341p67174n63278
3219.1B91548519l62835j222725j012611l81069m17843n51186r74979n84564n39704
$$ plain form
3158.3 347586327 346258507 345425568 344394379 343289795 341991920 340889664 340116997 339448204 338290672
3167 338290672 336770401 335635490 334604530 333797531 332634315 331564255 330669022 329451714 328570366
3175.7 328570366 327761192 327150803 326150970 324902649 324243851 323504791 322447853 321481400 320599632
3184.4 320599632 319428463 318351612 317468300 316710396 315784607 314904671 314369164 313489799 312460651
3193 312460651 311323547 310538807 310035400 309294548 308288593 307282696 306544418 305445099 304873009
3201.7 304873009 304078693 302900715 302362633 301661339 301243343 300689011 300134277 299168644 297923164
3210.4 297923164 297696686 297211781 296436634 295283031 294089794 293488312 292878971 292111797 291548519
3219.1 291548519 291185684 289962959 288950348 288569279 288151436 287600250 286625271 286040707 285501003
3227.8B85501003q70266o54068k59285m43935o86779o61850j070461o96888o38523
3236.4B79518948q81386m05102l78971n60722n66407n06019m08020l27606p44267q00896
3246.1B73939552k93884m19254j019249j072140o76727o94828m17843l17955l99933
3254.8B68627739p55959r14802j67713n54028p65362k84691k53391n80196o33812l97511
3264.4B63320274o92443l82176k59190l59039o57253p39842n65071r63611j99547j00098
3274B58402004k15435m91810j131591l78552k56958p7858n70640j009236k96097K44484
3283.7B54218311P2270r93881p36561m11816j68590K21595k78873o25019q69713l92380
3293.3B50035343j34487k77786n42641n56240j51749k70977k66552l37944m23546o32877
$$ plain form
3227.8 285501003 284630737 283976669 283717384 283273449 282586670 281924820 280854359 280157471 279518948
3236.4 279518948 278637562 278232460 277853489 277292767 276726360 276220341 275812321 275484715 274740448 273939552
3246.1 273939552 273645668 273226414 272207165 271135025 270458298 269763470 269345627 269027672 268627739
3254.8 268627739 267871780 266956978 266789265 266235237 265469875 265185184 264931793 264351597 263717785 263320274
3264.4 263320274 262627831 262245655 261986465 261627426 260970173 260230331 259665260 258701649 258502102 258402004
3274 258402004 258186569 257694759 256563168 256184616 255927658 255849800 255279160 254269924 253973827 254218311
3283.7 254218311 254290581 253296700 252560139 252148323 251979733 252201328 251922455 251297436 250427723 250035343
3293.3 250035343 249900856 249623070 249080429 248524189 248372440 248101463 247834911 247496967 247073421 246440544
3303B46440544l92666r9315k90795l19233l79924M2228j81885m91275n73368n18933
3312.6B43235378k69851n96447k47517m86221j077061p88498j18580p9937m96540k75993
3322.3B38798733n44739m60072j04026J25904m35505j126671l09086j50566j12209
3330.9B35681763m73214q17413l77197l53680o3381j15242o88267q29925J66168J09329
3340.6B32238941n33199l83778o57215j89304l40748n12409l69416n33161k28138k35939
3350.2B28255634k14023o89087m37699l8032j90487r0542m72240n76306o29348k09504
3359.9B24708366p5855m36497p59277n26638K72732m09355l37792J11046m20532n01576
3369.5B21624622l06034q3217k72122n5046n0659n19295l03802J27945m12655q71010
$$ plain form
3303 246440544 246047878 245948563 245657768 245338535 244958611 245000839 244818954 244327679 243754311 243235378
3312.6 243235378 242965527 242369080 242121563 241635342 240558281 239769783 239651203 239571266 239074726 238798733
3322.3 238798733 238253994 237793922 237689896 237815800 237380295 236253624 235944538 235793972 235681763
3330.9 235681763 235208549 234391136 234013939 233660259 233596878 233481636 232793369 231963444 232129612 232238941
3340.6 232238941 231705742 231321964 230664749 230475445 230134697 229622288 229252872 228719711 228491573 228255634
3350.2 228255634 228041611 227352524 226914825 226876793 226686306 226595764 226123524 225547218 224917870 224708366
3359.9 224708366 224632511 224196014 223436737 222910099 223182831 222773476 222435684 222546730 222126198 221624622
3369.5 221624622 221318588 221235371 220963249 220908203 220857544 220338249 220034447 220162392 219749737 218878727
3379.2B18878727l41358l86563k93102k29320j37673J97411Q4572n5180m22592r9735
3388.8B17195187R5539j87359k55547k93407j71375l186k39677p09267O809K86770
3398.4B15724487L27721K83222m78382l66154l03917J22910K02904J09310L3741n57690
3408.1B15098152m22535L6621O51837K21424n5046l7270K03877M37221l78609K26002
3417.7B15981674P1545l41911k93923j78528O59046K41871J65310k60868J02768O31390
3427.4B16778374K4471L55568K04887J44425j92185j85203K39620L66402O86855L13969
3437B18737183K28767K63786L12882J61304M48189N54047J29547N64861Q10909R72996
3446.7B23184471j06697j98841L46737J59111O16474L95622L83683K7103J25771P56588
$$ plain form
3379.2 218878727 218537369 218150806 217857704 217628384 217490711 217688122 217772694 217717514 217294922 217195187
3388.8 217195187 217290726 217103367 216847820 216554413 216383038 216379852 216140175 215430908 215437717 215724487
3398.4 215724487 216052208 216335430 215857048 215490894 215186977 215309887 215512791 215622101 215655842 215098152
3408.1 215098152 214675617 214712238 215364075 215585499 215530453 215493183 215697060 216134281 215755672 215981674
3417.7 215981674 216053219 215711308 215417385 215238857 215897903 216139774 216305084 216044216 216146984 216778374
3427.4 216778374 216802845 217158413 217363300 217507725 217315540 217130337 217369957 217736359 218423214 218737183
3437 218737183 218965950 219229736 219542618 219703922 220152111 220706158 220835705 221400566 222211475 223184471
3446.7 223184471 223077774 222878933 223225670 223384781 224001255 224396877 224780560 224807663 224933434 225690022
3456.3B25690022Q31489Q93345P64580O02588j26152M67511L79467m8485R26780Q92392
3466B31273537O64787L71094O87675P12586P27405L87707l0212R54933R79461R34792
3475.6B37663765K35157K97794P70874P99904J496620L40348J3389L03593R64966J121883
3485.2B44008293M73118J393185J087417N97401L47919P32308Q36792J90716P54318
3493.9B50421467P27672J053772Q40588M47960O26793J030655J471481J043663J424122
3502.6B59088173Q02326J76792O57196R63021R29451J051216J368656M80919Q52699
3511.3B66370449Q72040Q29773J163978Q56896J112881J072616J139794N11779P09935
3520B74640141J293735J102982J220569R38168R41486M94099J368141J650887P64141
$$ plain form
3456.3 225690022 226521511 227414856 228179436 228782024 228655872 229123383 229502850 229454365 230381145 231273537
3466 231273537 231938324 232309418 232997093 233709679 234437084 234824791 234794579 235749512 236728973 237663765
3475.6 237663765 237898922 238196716 238967590 239767494 241264114 241604462 241617851 241921444 242886410 244008293
3485.2 244008293 244481411 245874596 246962013 247559414 247907333 248639641 249476433 249667149 250421467
3493.9 250421467 251149139 252202911 253043499 253491459 254118252 255148907 256620388 257664051 259088173
3502.6 259088173 259890499 260067291 260724487 261687508 262616959 263668175 265036831 265517750 266370449
3511.3 266370449 267242489 268072262 269236240 270093136 271206017 272278633 273418427 273930206 274640141
3520 274640141 275933876 277036858 278257427 279195595 280137081 280631180 281999321 283650208 284414349
3528.6B84414349J170978J021958Q47988Q67843J245442J205978J863976J088466k30179
3537.3B93496799J425286J759281J610661Q58726J024189J443043J647930J847095
3545C05113010M87557J806908R00421O19697J516648K119274K536525q4056J019039
3553.7C16035023J614303K185955J795807Q8730K004776K146874J931991J393738K729797
3562.4C31926994K929421J462745L935242J567002M53262J326141L56980K482757J418457
3571.1C47859001J540299K157554K610359J746293J616783L032913K018738K259369
3578.8C64841309K059249J580048K637558L039093J574402Q98209L797798L810081
3586.5C84237747J992455J651878R0523K531128L099174L406754L171043K446594L273201
$$ plain form
3528.6 284414349 285585327 286607285 287455273 288323116 289568558 290774536 292638512 293726978 293496799
3537.3 293496799 294922085 296681366 298292027 299150753 300174942 301617985 303265915 305113010
3545 305113010 305600567 307407475 308307896 308927593 310444241 312563515 315100040 315015984 316035023
3553.7 316035023 317649326 319835281 321631088 321719818 323724594 325871468 327803459 329197197 331926994
3562.4 331926994 334856415 336319160 340254402 341821404 342274666 343600807 343957787 346440544 347859001
3571.1 347859001 349399300 351556854 354167213 355913506 357530289 360563202 362581940 364841309
3578.8 364841309 366900558 368480606 371118164 374157257 375731659 376629868 380427666 384237747
3586.5 384237747 386230202 387882080 387972603 390503731 393602905 397009659 400180702 402627296 405900497
3595.2D05900497K84462K036934L521576J731758L927460K529945P01142K170372K420769
3603.9D25224915K734794L254814L569565J190910K909508J326065Q23288O224518
3611.6D47258377K234650K75993M911079J158791L226967M191360K399636K968139
3619.3D68624992N25933J136551K451171K024575K106857L057442L188209L404541
3627D86520271O211396K695350n960502K728538L499870M338761K581901k38037J844101
3635.7E04221649L050614K692451J198425J714173K210808L022422K805100R93576
3643.4E21909218K250824M203720O601906J319046k085877P398262L104134l677139
3651.1E41024094k558251L321686L234062M063263N645561o032142O98585M329186
$$ plain form
3595.2 405900497 406184959 408221893 411743469 413475227 417402687 419932632 420633774 422804146 425224915
3603.9 425224915 427959709 431214523 434784088 435974998 438884506 440210571 441033859 447258377
3611.6 447258377 449493027 449769020 454680099 455838890 459065857 463257217 465656853 468624992
3619.3 468624992 469150925 470287476 472738647 474763222 476870079 479927521 483115730 486520271
3627 486520271 492731667 495427017 489466515 492195053 495694923 500033684 502615585 502377548 504221649
3635.7 504221649 507272263 509964714 511163139 512877312 515088120 518110542 520915642 521909218
3643.4 521909218 524160042 528363762 534965668 536284714 534198837 541597099 544701233 541024094
3651.1 541024094 538465843 541787529 545021591 549084854 554730415 548698273 549396858 553726044
3658.8E53726044K132339K060356Q10891J796836Q88405K002716K259217J707573M804458
3667.5E72188835M046745L190155P36962o406098J395607O389504Q087654K944260
3675.2E92573624j1920166L24554N370560L564758j818504l49121J974334J657372
3682.9E91377411J652641J770745J245841L625832O420212l846741j524467O858444
3690.6F07579918n021134k274093L496322R04198K011795J548805J31302Q97255N44052
3699.3F09818420K713013L427582l014031j519012K703819Q18863J158295R86671K164116
3708F19257736M467201k989196L462639M065704j0313568K205696K410126M19387Q31757
3716.7F23817482J635017J634407j554565J545372N101624j100502l040848M291191
$$ plain form
3658.8 553726044 555858383 557918739 558729630 560526466 561414871 563417587 565676804 567384377 572188835
3667.5 572188835 576235580 579425735 580162697 573756599 575152206 581541710 589629364 592573624
3675.2 592573624 580653458 580978012 586348572 589913330 588094826 587745705 589720039 591377411
3682.9 591377411 593030052 594800797 596046638 599672470 606092682 602245941 600721474 607579918
3690.6 607579918 602558784 600284691 603781013 604685211 606697006 608245811 608377113 609274368 609818420
3699.3 609818420 612531433 615959015 612944984 611425972 614129791 614948654 616106949 617093620 619257736
3708 619257736 623724937 620735741 624198380 628264084 617950516 620156212 622566338 622985725 623817482
3716.7 623817482 625452499 627086906 625532341 627077713 632179337 631078835 628037987 632329178
3724.4F32329178J722259m55627j941338p16362K663880J114959M127007j264114l494645
3733.1F34085197Q231469J171112n292435n61409N45044K44865J278649L137474k519531
3741.8F40320435K226104R280243r157028j0001984Q124924M653778N721970j132202
3749.5F50036240o366883J0072785m917984q467636L399887K715988K742538l274917
3757.2F45940018K430420N593185o405106k731857K969132J520233P49893L442383
3764.9F53508301j504441m980011K663270N279235J166611p007675J110992K331391
3772.6F52567673l01209K50702N14603J774215O61850K481690J092529o094589J023331
3781.3F53970795J487274J120529K502213j978913j446075J140518J168823O76956
$$ plain form
3724.4 632329178 634051437 633595810 631654472 630938110 633601990 634716949 638843956 637579842 634085197
3733.1 634085197 642316666 643487778 638195343 637633934 638178978 638423843 639702492 642839966 640320435
3741.8 640320435 642546539 651826782 642669754 632667770 640792694 645446472 651168442 650036240
3749.5 650036240 643669357 653742142 648824158 640356522 643756409 646472397 649214935 645940018
3757.2 645940018 648370438 653963623 647558517 644826660 647795792 649316025 650065918 653508301
3764.9 653508301 652003860 647023849 649687119 654966354 656132965 649125290 650236282 652567673
3772.6 652567673 652266464 652517166 653031769 654805984 655467834 657949524 659042053 652947464 653970795
3781.3 653970795 655458069 656578598 659080811 657101898 655655823 656796341 657965164 658642120
3789F58642120P5150r2316k59475Q71276L03116J594773L701782j809693k508697J306229
3798.7F61824265L012847N645752j588134p865067j184997Q65020M848633N388794
3806.4F70947113n889969l868332K489014N98984K38723J032105O3553J342850M944152
3815.1F71898193m1351r862976L002243M820633N535355M198226j3410339r29718K846680
3823.7F68056946J615066K923737R53445k700958p68051K28271K196045J735688n886078
3832.4F68354111K219238O128540k932053j98898N737076o012650k721939O803131
3840.1F77376556m851837j746979N607300r44290l346710J008301P84301O34232J543045
3848.8F76063919j57242K335510N960084j117402J663666j3489380j061554P577668
$$ plain form
3789 658642120 658717270 658624954 658365479 659236755 659539871 661134644 664836426 663026733 660518036 661824265
3798.7 661824265 664837112 670482864 668894730 661029663 659844666 660709686 665558319 670947113
3806.4 670947113 665057144 661188812 663677826 664276810 664515533 665547638 665611191 666954041 671898193
3815.1 671898193 671856842 661993866 664996109 669816742 675352097 679550323 666139984 665210266 668056946
3823.7 668056946 669672012 672595749 673549194 670848236 670080185 670308456 672504501 674240189 668354111
3832.4 668354111 670573349 676701889 673769836 673570938 679308014 673295364 670573425 677376556
3840.1 677376556 672524719 670777740 676385040 675440750 672094040 673102341 673886642 674520874 676063919
3848.8 676063919 675906677 678242187 684202271 683084869 684748535 671259155 670197601 677775269
3856.5F77775269j266098k199707R42535J324081L351212k039948L03650O421891m116974
3865.2F80495911n997239K185135L946152N838242m991913o461563J753387M121628
3872.9F80889740M995193q049697j511383K079467n33905K205658M065705k384415
3880.6F81756363n849533L720245J170578J440048M300385j0018311J14136K929917
3888.3F79563828R58786L657150P54242m382630j64108P81403j441574R49554J009140
3897F81685791L053741K643433p593765M066162K764893l720322L152847j716461j634140
3905.7F82702179k205582r14917J669541R2239O1646k28501L81699M37012j01395J502380
3915.3F83396301K234497l053436l089294M105682J081772l538819N20173J203842
$$ plain form
3856.5 677775269 676509171 674309464 675251999 676576080 679927292 677887344 678190994 684612885 680495911
3865.2 680495911 674498672 676683807 680629959 686468201 681476288 675014725 676768112 680889740
3872.9 680889740 685884933 677835236 676323853 678403320 677869415 680075073 684140778 681756363
3880.6 681756363 675906830 679627075 680797653 682237701 686538086 676519775 676633911 679563828
3888.3 679563828 680522614 684179764 684934006 680551376 680387268 681168671 679727097 680676651 681685791
3897 681685791 684739532 687382965 679789200 683855362 686620255 682899933 686052780 684336319 682702179
3905.7 682702179 680496597 679581680 681251221 681343460 681405106 681176605 681558304 681995316 681893921 683396301
3915.3 683396301 685630798 682577362 679488068 683593750 684675522 681136703 681656876 682860718
3923.1F82860718J405334m04968j917419M56848Q99658J529159o35070j117554J907349
3931.7F84984055j509247j702042O08063n86014M31290J315307M29840o48498o23779
3940.4F82698975J436462J509247k248383r45892K34146K38037J845322p6599O19507
3949.1F85310822J99432j891480J086502L02048r01947p85904L24478O57502r61686
3957.8F83339767O56281N75256O90155N18341j064224l7613l93753n77621k10648J03531
3967.4F83599472L29361O6986K86255M27704N62897O9503k8915K17438r6741o12793
3977.1F84821167l76358j00708K18582R43680j4801l77274J21918L03497L09677J36261
3986.7F85985641J68458n60303K62298L73078q82035k71911J63650K12555j62811n0278
$$ plain form
3923.1 682860718 684266052 683861084 681943665 682400513 683300171 684829330 684194260 683076706 684984055
3931.7 684984055 683474808 681772766 682380829 681794815 682226105 683541412 683971252 683322754 682698975
3940.4 682698975 684135437 685644684 683396301 682450409 682684555 682922592 684767914 684691315 685310822
3949.1 685310822 685510254 683618774 684705276 685007324 684105377 683319473 683643951 684301453 683339767
3957.8 683339767 683996048 684571304 685261459 685779800 684715576 684677963 684284210 683706589 683495941 683599472
3967.4 683599472 683928833 683995819 684282074 684709778 685272675 685342178 685313263 685530701 685433960 684821167
3977.1 684821167 684444809 684344101 684562683 685506363 685491562 685114288 685236206 685539703 685849380 685985641
3986.7 685985641 686154099 685593796 685856094 686229172 685347137 685075226 685238876 685451431 685288620 685238342
3996.3F85238342N88227N7144l88718J80206
4000.2F85675201
$$ plain form
3996.3 685238342 685826569 685883713 685494995 685675201
4000.2 685675201
##END=$$ End of the data block
