##TITLE=$$ Begin of the data block
##JCAMP-DX=5.00 $$ ACD/SpecManager v 10.08
##SPECTROMETER/DATA SYSTEM=Varian
##DATE=20 Nov 2012 10:20:50
##DATA TYPE=INFRARED SPECTRUM
##DATA CLASS=XYDATA
##ORIGIN=
##OWNER=
##NPOINTS=3735
##FIRSTX=399.26403809
##LASTX=4000.35498047
##MAXX=4000.35498047
##MINX=399.26403809
##MAXY=77.42817688
##MINY=18.53397751
##XFACTOR=1.0000000000
##YFACTOR=0.000000100000000
##FIRSTY=50.00891876
##DELTAX=0.96440572
##XUNITS=1/CM
##YUNITS=TRANSMITTANCE
##XYDATA=(X++(Y..Y))
399.3E00089188q453560O412697q19779n201759p901650K33155J175613k957649L210220
407.9D85786476L888741L139610K01683j21346q51249j952477j233444n452652n8098
416.6D83347244K471657m634247J4440956N433846j3346977j0967675Q095284K087898
424.3D86927986o678200o48803j559716k143478p42111o77185k728501l684120k490043
433D65575829m43497L531341N054551j508408p650795m60815L843193l26538k458992
441.7D65155869P02400L459282K025489J950646J543007K286567L012429K184982K888565
450.4D85209236J922417j715393l584252j544952K082863M743843O75888o047020l431320
459.1D78311310L0670L820839j999703m901466m56009O27899q02955m693985k448311
$$ plain form
399.3 500089188 491635628 498048325 497228546 492026787 484125137 484358292 485533905 482576256 485786476
407.9 485786476 489675217 492814827 493016510 492895164 492043915 490091438 488857994 483405342 483347244
416.6 483347244 485818901 481184654 495625610 501059456 487712479 476744804 484840088 486927986
424.3 486927986 480249786 479600983 478041267 475897789 475155678 474478493 471749992 468065872 465575829
433 465575829 465132332 468663673 473718224 472209816 464559021 464098206 467941399 467614861 465155869
441.7 465155869 465858269 469317551 471343040 473293686 474836693 477123260 480135689 482320671 485209236
450.4 485209236 487131653 485416260 481832008 480287056 482369919 487113762 487789650 481742630 478311310
459.1 478311310 478341980 482162819 480163116 475261650 474805641 475433540 474630585 469936600 467488289
467.7D67488289O14967R21517J758422O09246n600319n560341j253929k608948Q72498
476.4D57241402l437424l068504L497619Q73413k4604k208367j566810l070374P68318
485.1D49004669M113960l520622l231811K128639M317436k987671j767044K482262
492.8D50539818k296410J15509j064148N26581p1106m122658m217567k629776J947403
501.5D38727646l61900m42582n0163j402588j899566l043633k453957k464141R40742
510.2D27549858o31790j608620k253532m472313j657295j350594p14188K40136j222611
518.9D13879051n186729k540055J64223k400970j400338p23571J615638q71048l261795
527.5C99274406p16705m38537L1013J368027J197548p25022J400566J729088J025009
$$ plain form
467.7 467488289 468103256 469024773 470783195 471392441 465792122 460231781 458977852 456368904 457241402
476.4 457241402 453803978 450735474 454233093 455106506 455081902 452873535 451306725 448236351 449004669
485.1 449004669 453118629 449598007 446366196 448494835 452812271 449824600 448057556 450539818
492.8 450539818 448243408 448358917 447294769 447821350 447750244 443627586 439410019 436780243 438727646
501.5 438727646 438365746 437923164 437873001 436470413 434570847 431527214 429073257 426609116 427549858
510.2 427549858 426918068 425309448 423055916 418583603 416926308 415575714 414861526 415101662 413879051
518.9 413879051 408692322 406152267 406316490 403915520 402515182 401791611 403407249 402536201 399274406
527.5 399274406 398557701 398119164 398150177 399518204 400715752 399990730 401391296 403120384 404145393
536.2D04145393K068825J596413J933746J748886J934815J137085J437263J347428
543.9D17349854P84530J259575p49664K9831K90603j275139j67541J200829j74523
552.6D18548355p18651m25834k602158n41000o63414k559777j395073j024704p66944
561.3D07850800l242226j925011j091957j978149j023674k216530l131218l552513
569C89689522j683541l518486l308906j353455j562004j45492j253662P89566J035385
577.7C78688927J845550J443520Q61397L689346L253059L870316J950149K444954K752571
586.4D00799789J294785K094765J363983J169243n4322J095848K269822Q87108q66395
595D10054626m20188J672744m32243o32629q8196l6354J48887M23394J360702n48515
$$ plain form
536.2 404145393 406214218 407810631 409744377 411493263 413428078 414565163 416002426 417349854
543.9 417349854 418134384 419393959 418644295 418674126 418964729 417689590 417522049 418722878 418548355
552.6 418548355 417829704 417403870 414801712 414260712 413597298 411037521 409642448 408617744 407850800
561.3 407850800 404608574 402683563 401591606 399613457 398589783 396373253 393242035 389689522
569 389689522 388005981 384487495 381178589 379825134 378263130 378117638 376863976 377653542 378688927
577.7 378688927 380534477 381977997 382839394 386528740 389781799 393652115 395602264 398047218 400799789
586.4 400799789 402094574 404189339 405553322 406722565 406668243 407764091 410033913 410921021 410054626
595 410054626 409634438 411307182 410874939 410242310 410154114 410117760 410266647 410690041 412050743 411502228
604.7D11502228j09482K71416m22592o78940n66635M25529J36948K98500m921J687698
614.3D12539749J552086M69589J497917j28517O15006K395363J573639k36741N47219
623D20825310L011093L075867J009559N63164J897430J077843Q76846P1907K93046
631.7D32702065K253685J198539N63584r4452J115799K234344O68602P24373O02036
640.4D41968575l38402O4048J619416J151047L05137Q12454J527977J854134O40793
649D49605179J355209J476975J14402L44124Q02422Q41064N90363M22935M27437J182289
658.7D57162399J62354k78206Q14514m08745N63736J625214J84631m28200q41026K394333
668.3D60951004K360878N74455J707459J674423m6692m73022j86806K92663J809884
$$ plain form
604.7 411502228 411392746 411664162 411241570 410562630 409995995 410421524 410558472 410856972 410852051 412539749
614.3 412539749 414091835 414561424 416059341 415930824 416545830 418941193 420514832 420278091 420825310
623 420825310 423836403 426912270 427921829 428484993 430382423 431460266 432337112 432409019 432702065
631.7 432702065 434955750 436154289 436717873 436623421 437739220 439973564 440642166 441366539 441968575
640.4 441968575 441630173 441694221 443313637 444464684 444769821 445582275 447110252 448964386 449605179
649 449605179 450960388 452437363 452551765 452895889 453698311 454539375 455129738 455552673 455980110 457162399
658.7 457162399 457324753 457046547 457861061 457452316 458016052 459641266 459825897 459397697 458556671 460951004
668.3 460951004 463311882 463886337 465593796 467268219 467221527 466748505 466561699 466854362 468664246
677D68664246J464996K87590R56497J896668J365165N65911Q92296J067237R5711j02768
686.7D77153549O14586o25305j490021n81360N63584J749801R09272J5945k95067o07643
696.3D77407341o66351j926346j854630j193313q68721l87078j029586p43714J03417
705D68841019j63918l97568l9939J62506K30331j4801j10474J024247K038345J812134
714.6D73381882J589355K498055L401947L207016K191696J581039K270241L106613
722.3D93227844K643013K132912K598114L088798K751847K095527K572442K569808
730.1E13680305K135964K018738J977195J884919O37741L31726J657982K146072J042061
738.7E27512703J078377J135750J73149M36477k34718m40903K37389o35758j131134
$$ plain form
677 468664246 470129242 470416832 471373329 473269997 474635162 475201073 476093369 477160606 477256317 477153549
686.7 477153549 477768135 477142830 475652809 475071449 475635033 477384834 478294106 478310051 478014984 477407341
696.3 477407341 476740990 474814644 472960014 471766701 470897980 470510902 469481316 468737602 468841019
705 468841019 468677101 468279533 468239594 468402100 468632431 468617630 468507156 469531403 471569748 473381882
714.6 473381882 474971237 477469292 480871239 484078255 486269951 487850990 490121231 493227844
722.3 493227844 495870857 498003769 500601883 503690681 506442528 508538055 511110497 513680305
730.1 513680305 515816269 517835007 519812202 521697121 522334862 522666588 524324570 526470642 527512703
738.7 527512703 528591080 529726830 529899979 530336456 530101738 529660835 529898224 529262466 528131332
747.4E28131332q34922n07050K42081p51763k006225q66547p63435k027092l030510
756.1E17585869k191467k141877l092155j471214j240273j018982q80852j233673j14670
764.8E04200706p82432j070366n63965L82805J734848K264671K424965J298790K267990
773.5E12158012L453217K767219L057480K792359K167625K524185L512001K949295
781.2E35381393K895356L594703L911324M251022L585282M289321L775445K918472
788.9E64602318K747650K375946K429810J875228K624588K195702K052422K566948
796.6E83470612J872901J642571J367645N10025K69776J352119R96018J251258J243363
805.3E93976288O39000M88663L51829J33934k146149l59954P41920j451607j504860
$$ plain form
747.4 528131332 527296410 526789360 527031441 526279678 524273453 523406906 522643471 520616379 517585869
756.1 517585869 515394402 513252525 510160370 508689156 507448883 506429901 505549049 504315376 504200706
764.8 504200706 503418274 502347908 501783943 502166748 503901596 506166267 508591232 509890022 512158012
773.5 512158012 515611229 518378448 521435928 524228287 526395912 528920097 532432098 535381393
781.2 535381393 538276749 541871452 545782776 550033798 553619080 557908401 561683846 564602318
788.9 564602318 567349968 569725914 572155724 574030952 576655540 578851242 580903664 583470612
796.6 583470612 585343513 586986084 588353729 588863754 589133530 590485649 591481667 592732925 593976288
805.3 593976288 594615288 595103951 595455780 595589714 593443565 593083611 593825531 592373924 590869064
814E90869064j921348j285286L12233N19027l94020M69628O51703J23748K98348m93813
823.6E89149284l12500j238403n13840J23253r78813j711807k015457l88031o81534
832.3E81432152q36258j294251r66911l75595k545509j711083m14810l95966j494217
841E71397552j992797p80373q74786r04503p83882j329613j996994j743431k564812
849.6E58426361k593346j967086k147866j729355k030563j681938l075256l521576
857.4E39679375l208199l377495j465263j420746j22871J389045K556534M132996L432693
866E41596069M154053M674835N055580N201836M923554L912734L498192N064659L286477
874.7E81367989K709655K913552L217353K884827J578560J800842m03061m80575j92833
$$ plain form
814 590869064 588947716 587662430 587974663 588493690 588099670 588569298 589221001 589344749 589643097 589149284
823.6 589149284 588836784 587598381 587084541 587207794 586228981 584517174 582501717 582113686 581432152
832.3 581432152 580595894 579301643 578334732 577959137 575413628 573702545 573287735 572891769 571397552
841 571397552 569404755 568624382 567749596 566845093 566061211 564731598 562734604 560991173 558426361
849.6 558426361 555833015 553865929 551718063 549988708 547958145 546276207 543200951 539679375
857.4 539679375 536471176 533093681 531628418 530207672 530084801 531473846 534030380 538163376 541596069
866 541596069 545750122 550424957 555480537 560682373 565605927 569518661 573016853 578081512 581367989
874.7 581367989 584077644 586991196 590208549 593093376 594671936 596472778 596069717 595589142 595396309
883.4E95396309j310387k427177k708016j872596k872467k996712k386284j983032
891.1E76839638k906113l111038k652474k620201j862983k490654k405625k334976
898.8E56455574j755943j650963l088913k690163k159919j928788k389030l457298
906.5E37334557m133301l724632l557930m525795m701119m240074m071503n198326
914.3E03181877n353622m951783m980888m571266m894295m213714l002587k796554
922D68417168k132264j242599p00226r06296o82525P03163N29899m84962M18625J744118
931.6D65664101J230697J320191J481209Q77151J303253J432839K145195K489090K156410
940.3D80100136K164726J905289J874809J713753J675491Q80203k07595p72477j380539
$$ plain form
883.4 595396309 594085922 591658745 588950729 587078133 584205666 581208954 578822670 576839638
891.1 576839638 573933525 570822487 568170013 565549812 563686829 561196175 558790550 556455574
898.8 556455574 554699631 553048668 549959755 547269592 545109673 543180885 540791855 537334557
906.5 537334557 533201256 529476624 525918694 521392899 516691780 512451706 508380203 503181877
914.3 503181877 497828255 492876472 487895584 483324318 478430023 474216309 471213722 468417168
922 468417168 466284904 465042305 464342079 463435783 462753258 463456421 463986320 463501358 463919983 465664101
931.6 465664101 466894798 468214989 469696198 470573349 471876602 473309441 475454636 477943726 480100136
940.3 480100136 482264862 484170151 486044960 487758713 489434204 490314407 490106812 489334335 487953796
949D87953796k304496l387146m167214m771805m779739m961815o053467o253471o211014
957.7D45063629o780586o811218o007882o217498p455902o857567p118302p478523
965.4C90336151p473640q127899q134194q660889q481521q855820q535766r297295
973.1C22769127r648190q682499r739952q803177q727588q255692q241424p936096
980.8B52734509p227555p218590n153541n766030n216979n110550l929139k904148
988.5B10207977l095779k314301k973213p71122j799717j295223j173573j960277P4577
997.2A94899349k46677P11498r14745M3258M01307m5548K6188j597195L05310o33488
1006.8A92949257J335r07783j372681o20289j256618J32503j475639m85726j289806
$$ plain form
949 487953796 485649300 482262154 478094940 473323135 468543396 463581581 457528114 451274643 445063629
957.7 445063629 438283043 431471825 425463943 419246445 411790543 404932976 397814674 390336151
965.4 390336151 382862511 374734612 366600418 357939529 349458008 340602188 332066422 322769127
973.1 322769127 313120937 304438438 294698486 285895309 277167721 268912029 260670605 252734509
980.8 252734509 245506954 238288364 233134823 227368793 222151814 217041264 213112125 210207977
988.5 210207977 207112198 204797897 201824684 201053562 199253845 197958622 196785049 194824772 194899349
997.2 194899349 194652672 195364170 194449425 194492683 194893990 194848442 194874630 193277435 193582745 192949257
1006.8 192949257 192950592 192042809 190670128 190049839 188793221 188925724 187450085 186964359 185674553
1015.5A85674553l34778N56889l28865Q36162o19373J902943J383457Q50925N18665
1024.2A90440578M03901J805553J062641K656441O19736R86061O28509J170311K095242
1032.9B01868973O5498J881657N14755R10435J7719p7744k26287r43756P55119j239720
1042.5B03526649P50618o35280o93054J62887k93560J198464n91469J033077M04110
1051.2B04862442J354618Q67901K005157M026738J536350L772564L037090M441643
1058.9B25904503L400555K174320L094787K374192M381008L106766L920364J999321
1066.6B50355816J198425R93462j036015j062412l832283l756237n006046l272400
1074.4B34582310k827912k973346q05626j864071O63051m0760J830960J962585J742306
$$ plain form
1015.5 185674553 185339775 185896664 185567799 186403961 185784588 187687531 189070988 189921913 190440578
1024.2 190440578 190844479 192650032 193712673 196369114 196988850 197974911 198603420 199773731 201868973
1032.9 201868973 201934471 203816128 204330883 205241318 205259037 205181293 204955006 204011250 204766369 203526649
1042.5 203526649 204277267 203641987 202948933 203111820 202818260 204016724 203425255 204458332 204862442
1051.2 204862442 206217060 207084961 209090118 213116856 214653206 218425770 221462860 225904503
1058.9 225904503 229305058 231479378 234574165 236948357 241329365 244436131 248356495 250355816
1066.6 250355816 251554241 252547703 251511688 250449276 246616993 242860756 237854710 234582310
1074.4 234582310 231754398 228781052 227975426 226111355 226774406 226733646 228564606 230527191 232269497
1083B32269497K907295J937695L969040J539878K831536L425083L682194M176483K460537
1091.7B59199238L039913J785431L445339K047730J406211J200657k98519R15127N56202
1100.4B73297329J025143l32299O58894K3155k91252Q51936m1237J799813J644096
1109.1B78635578K958355J756821J910305L016910K139721L654633K440929K720223
1116.8B99233475J333847J409225J935845R72061J464443L84083J942215J142254O65397
1125.5C10482845J132946J526776K311687J493759K035866J269150J901741J158523
1133.2C23313293J479607J946907K83928R84192o21986j402779k035751k016755k052631
1141.9C19878025l092766k670727l072109k541466k967109j658631k034740j761360
$$ plain form
1083 232269497 235176792 237114487 241083527 242623405 245454941 248880024 252562218 256738701 259199238
1091.7 259199238 262239151 264024582 267469921 269517651 270923862 272124519 271826000 272741127 273297329
1100.4 273297329 274322472 273990173 274649067 274672222 274380970 275232906 275191669 276991482 278635578
1109.1 278635578 281593933 283350754 285261059 288277969 290417690 294072323 296513252 299233475
1116.8 299233475 300567322 301976547 303912392 304884453 306348896 306732979 308675194 309817448 310482845
1125.5 310482845 311615791 313142567 315454254 316948013 318983879 320253029 322154770 323313293
1133.2 323313293 324792900 326739807 327023735 328007927 327385941 325983162 323947411 321930656 319878025
1141.9 319878025 316785259 314114532 311042423 308500957 305533848 303875217 301840477 300079117
1149.6C00079117o41041k076511k40174j423835j018925m5414N33810J299514K24171
1158.3B96690712J793480J613331K679825L056697L532677L344078L334847N524254
1166C21569901N202789O077499N705033O586608P102204P418556P973518P179413P907372
1174.6C82722893O686706O686020O177597O200791O625938N402451N397071N372200
1182.4D31271667O388665N823898M491730M105301L733024L568154K995147K294960
1190.1D64672546J879158J655655J023560J294594J305160Q97713J064949K14272k21291
1198.8D73786316L33404N5924n68695N2643Q79554P28989P9346L83301J270713J135331
1208.4D78136826J535606J477394J115456J018486R66987J506768Q99543J116715J687088
$$ plain form
1149.6 300079117 299438076 297361565 297121391 295697556 294678631 294633217 295167027 296466541 296690712
1158.3 296690712 298484192 300097523 302777348 305834045 309366722 312710800 316045647 321569901
1166 321569901 326772690 332850189 338555222 345141830 352244034 359662590 367636108 374815521 382722893
1174.6 382722893 389409599 396095619 402273216 408474007 415099945 420502396 425899467 431271667
1182.4 431271667 437660332 443484230 447975960 452081261 455814285 459382439 462377586 464672546
1190.1 464672546 466551704 468207359 469230919 470525513 471830673 472728386 473793335 474007607 473786316
1198.8 473786316 474119720 474175644 473606949 473659592 474539146 475268135 475347481 475730782 477001495 478136826
1208.4 478136826 479672432 481149826 482265282 483283768 484250755 485757523 486657066 487773781 489460869
1217.1D89460869J375732P47719L16849N80864p1221n05714o20499o16150m47349j054039
1226.7D89167061j520157j498146j086235q52356r01184r52034j330834j159935q60862
1235.4D79005318j074524r00650p66144p74345l73345m27475l26004K90794l6201k71797
1245D74345627q2131J84822O05889O73981N70755O73103J122856R07402N71365K62986
1254.7D79836655J96838L94554J66817J94321J40609L75672N81894N40924M73518N60761
1264.3D83462563R91478O54754N95246R86976J147232Q83904R02061J057053Q18519
1273D91499786J015015R71794R99870M85955J16997J4152k57187n71365r20563j75056
1282.7D93179398M8637N82428Q30994M61387O44570K7465j99279m59099m20036p21436
$$ plain form
1217.1 489460869 490836601 491584320 491901169 492482033 492410812 491905098 491284599 490668449 490221100 489167061
1226.7 489167061 487646904 486148758 485062523 484210167 483308983 482356949 481026115 479866180 479005318
1235.4 479005318 477930794 477030144 476264000 475489655 475116310 474688835 474362831 474653625 474617424 474345627
1245 474345627 474263496 474448318 475054207 475728188 476298943 476972046 478094902 479002304 479573669 479836655
1254.7 479836655 480033493 480428047 480594864 480789185 480929794 481305466 481887360 482428284 482901802 483462563
1264.3 483462563 484454041 485108795 485704041 486691017 487838249 488722153 489624214 490681267 491499786
1273 491499786 492514801 493486595 494486465 494972420 495089417 495103569 494846382 494275017 493354454 493179398
1282.7 493179398 493228035 493810463 494641457 495102844 495747414 495774879 495575600 495116501 494696465 493975029
1292.3D93975029j071777q51822r11408m85306m58831m60854r84497j383820j236000
1301D86130714j492309j722832j498070j065178j947670j678009r33990j131439j311264
1309.7D73349953j672364p10640q85505j337128j464882k261963j202354q03986p94792
1318.3D62216339j107368j318703k20261o00013j066208j091919q96034j482239k016526
1327D52417068j877059k696419k084427j754456j995124j572953j528129j177368r65081
1335.7D36766052k18887q30841p23496J030p14759o92139q16116K20947O91795P85790
1345.3D34469376O83517L03078J94626K24266K69394p63321j67885q0567L3570K20833
1355D35386887p06101k28119m81148l49388n19333m27360K81029N31006o61583j995240
$$ plain form
1292.3 493975029 492903252 492051430 491140022 490654716 490195885 489735031 488750534 487366714 486130714
1301 486130714 484638405 482915573 481417503 480352325 478404655 476726646 475792656 474661217 473349953
1309.7 473349953 471677589 470966949 470081444 468744316 467279434 465017471 463815117 463011131 462216339
1318.3 462216339 461108971 459790268 459570007 458969994 457903786 456811867 455915833 454433594 452417068
1327 452417068 450540009 447843590 445759163 444004707 442009583 440436630 438908501 437731133 436766052
1335.7 436766052 436547165 435716324 434992828 434993858 434279099 433586960 432770844 432991791 433683586 434469376
1345.3 434469376 435152893 435455971 435650597 435874863 436144257 435380936 435213051 435132484 435166054 435386887
1355 435386887 434680786 434452667 433971519 433622131 433102798 432675438 432956467 433487473 432825890 430830650
1364.6D30830650m48188m58146K23046O46438m52346j24474k54478O29539O70662J227760
1374.3D32490463L29857k14462Q51669O07605J091576M97894N31349K95639N05486
1382.9D36987076Q78448R27773K380333K346420K153473L73230J328087J767692N81818
1391.6D49724350O70700Q11882Q98171j649437j099511q21113k49291r55505k237549
1400.3D45092697l32069j033173j201095p14760q44498k028656j725426r64279j499901
1409D34748840m61349r95484p93724l90129o46553o3591n60951N68733j91269N15824
1418.6D31730347j232415j884803N97229J49879K071991Q46443M57459M53758J49117
1427.3D33339005J122550M69170J417122m86374O76308Q10585L89290J905822J501427
$$ plain form
1364.6 430830650 430382462 429924316 430147362 430793800 430341454 430216980 429962502 430592041 431262703 432490463
1374.3 432490463 432820320 432605858 433457527 434065132 435156708 435654602 436185951 436481590 436987076
1382.9 436987076 437865524 438793297 441173630 443520050 445673523 446046753 447374840 449142532 449724350
1391.6 449724350 450395050 451206932 452105103 450455666 449356155 448535042 448285751 447330246 445092697
1400.3 445092697 444760628 443727455 442526360 441811600 440967102 438938446 437213020 436248741 434748840
1409 434748840 434287491 433292007 432498283 432108154 431461601 431398010 430837059 431405792 431214523 431730347
1418.6 431730347 430497932 428613129 429210358 429360237 431432228 432278671 432736130 433189888 433339005
1427.3 433339005 434461555 434930725 436347847 435861473 436537781 437348366 437737656 439643478 441144905
1436D41144905J437836r86519J020546J34163K20489P52068J7471Q79784k42386O32667
1445.6D45011024M93813J279640k6397r07746L32451p74727O5918j276703J057701
1454.3D45254974J237412j0071J571274l179169J128807j800689J803092J165238J396141
1463D48567009L100624J659050K682419M82826L511276K916832M261933N263214M824753
1471.7D77269936J0365676K950440M908714L420792N984306L534546K575035M491158
1479.4E15500603L269958N581322K845688L289299L362541L229485M251213K550277
1487.1E43880386M307824K431564M799499J58539n24216J494675J139679K886658K481689
1495.8E63056297K256356M21943J566468m8829p9841J155319o43234J059646K249298
$$ plain form
1436 441144905 442582741 441596222 442616768 442750931 442971420 443723488 443740959 444620743 444378357 445011024
1445.6 445011024 445504837 446784477 446758080 445850334 446182785 445408058 445473976 444197273 445254974
1454.3 445254974 446492386 446482315 448053589 444874420 446003227 444202538 446005630 447170868 448567009
1463 448567009 451667633 453326683 456009102 456491928 460003204 462920036 467181969 472445183 477269936
1471.7 477269936 487635612 490586052 495494766 498915558 504899864 508434410 511009445 515500603
1479.4 515500603 518770561 524351883 527197571 530486870 533849411 537078896 541330109 543880386
1487.1 543880386 548188210 550619774 555419273 555577812 555053596 556548271 557687950 560574608 563056297
1495.8 563056297 565312653 565734596 567301064 567252235 567172394 568327713 567684479 568744125 570993423
1504.5E70993423M506569N364876l663978j265564j581955n65987p66258N33638j407776
1513.1E72146988O9885J392517J180611L323898k652664J528130L262901L105926K405396
1521.8E85763588k611618r91402K15721J037560p34596P61795K89344j091499O50292
1530.5E83289185J100692J879311J034889j098327j345940p22923J465149L732757
1538.2E89334793R019356m195061k05803M81682k957725P1411M24957k882919j600190
1546.9E87490501K20719R96399J761207l68042J04370J684075J591911J271629L472
1555.6E94756241K268829L511849J681900L476410r519463r14917p54013q76274P59392
1564.2E94389954P98339j142311r26323O94390J800956l411636k822075r05876r21478
$$ plain form
1504.5 570993423 575499992 580864868 577200890 575935326 574353371 573787384 573021126 573554764 572146988
1513.1 572146988 572216873 573609390 574790001 578113899 575461235 576989365 580252266 583358192 585763588
1521.8 585763588 583151970 582160568 582376289 583413849 582679253 583441048 583730392 582638893 583289185
1530.5 583289185 584389877 586269188 587304077 586205750 584859810 584136887 585602036 589334793
1538.2 589334793 598354149 594159088 593953285 594434967 591477242 591548653 591973610 589090691 587490501
1546.9 587490501 587711220 588707619 590468826 590100784 590205154 591889229 593481140 594752769 594756241
1555.6 594756241 597025070 600536919 602218819 605695229 596175766 595260849 594506836 593630562 594389954
1564.2 594389954 595188293 594045982 593119659 593814049 595615005 592203369 589381294 588475418 587553940
1572.9E87553940m89121K20452J323700l352471k489853k033844k106361j852837k362213
1581.6E74411392j798095k348595j945648k588082k151642j754264j946488j471634
1589.3E58406944k596702j677666k997208k585029k452545l194390k334823l442040
1597E37126541j964493k490120j825370k507897k936592k180633l791085k690773k979736
1605.7E13759842j747246l210411k406006j955070l987313j939277k767906j817284
1613.4D93929329k572479o26984L61252n187607k190628k984772j014709k114754Q7776
1622.1D77686424M22554m091530j885299j570664Q06847j750374k264824k287025j496620
1630.8D63569489o48346j307450J504898J240731J402473m051285M95301j761857j451721
$$ plain form
1572.9 587553940 587064819 587285271 588608971 585256500 582766647 580732803 578626442 576773605 574411392
1581.6 574411392 572613297 570264702 568319054 565730972 563579330 561825066 559878578 558406944
1589.3 558406944 555810242 554132576 551135368 548550339 546097794 542903404 540568581 537126541
1597 537126541 535162048 532671928 530846558 528338661 525402069 523221436 519430351 516739578 513759842
1605.7 513759842 512012596 508802185 506396179 504441109 500453796 498514519 495746613 493929329
1613.4 493929329 491356850 490729866 491091118 485903511 483712883 480728111 479713402 477598648 477686424
1622.1 477686424 478108978 474017448 472132149 470561485 471368332 469617958 467353134 465066109 463569489
1630.8 463569489 462921143 461613693 463118591 464359322 465761795 461710510 462205811 460443954 458992233
1639.5D58992233J034508p08847J153908j85318J695976K796478K380104M020806k079163
1648.1D69100685n28831q14400K033577K801971L002282j050568k794266J739311M20800
1656.8D73910561J515426P66945J719208K269096K360230L823051j48239J501503J090355
1665.5D88808136K317505K723732L701782N542564R05381L920135J358185K067261
1673.2E11344681L094482M349785L104897J933403L575401L390884N865174M135475
1680.9E40794182L546257N803070P452125P146149j510124K407265L558540M836845
1688.6E74034309M738007L635712L671264M009171M380417N174827P371254M394608
1696.4F11409569K046661L537941N318184N473671k693138J983642K466088L630943
$$ plain form
1639.5 458992233 460026741 459317894 460471802 460286484 461982460 464778938 467159042 471179848 469100685
1648.1 469100685 468571854 467757454 469791031 472593002 475595284 474544716 471750450 473489761 473910561
1656.8 473910561 475425987 476192932 477912140 480181236 482541466 486364517 486216278 487717781 488808136
1665.5 488808136 491125641 493849373 497551155 503093719 503999100 507919235 509277420 511344681
1673.2 511344681 514439163 518788948 521893845 523827248 527402649 530793533 536658707 540794182
1680.9 540794182 544340439 550143509 557595634 564741783 563231659 565638924 569197464 574034309
1688.6 574034309 578772316 582408028 586079292 590088463 594468880 599643707 607014961 611409569
1696.4 611409569 613456230 616994171 622312355 627786026 625092888 627076530 629542618 633173561
1704.1F33173561K677536K560806O31218l51944J294518J645012N81894J82419J532287
1712.8F43927307K750626K974090M01841K193374M219895l258973k160568n9128J36261
1721.4F51124725J14746J044693J12000k8687R22623K77863O89926J641311J329728
1730.1F57228928p40509J530075L357391J035004l190537j447525N39017N25207J595230
1738.8F60432281K389756r03626J152954K735062K070999n24826J320343K652435K361298
1747.5F73686676L092270O62689J984253J942825K33841K014084J913681K743912L797455
1756.2F92071686K582397P04499J466827J793213L525619K950440q7662K228165K093429
1764.8G09328613K193909K483597L229370R05609P43637M347458M039230O68335l362198
$$ plain form
1704.1 633173561 635851097 638411903 639043121 638691177 639985695 641630707 642212601 642395020 643927307
1712.8 643927307 646677933 649652023 650053864 652247238 656467133 653208160 651047592 650988464 651124725
1721.4 651124725 651239471 652284164 652396164 652367477 653290100 653567963 654257889 655899200 657228928
1730.1 657228928 656488419 658018494 661375885 662410889 659220352 657772827 658311844 658837051 660432281
1738.8 660432281 662822037 661918411 663071365 665806427 667877426 667352600 668672943 671325378 673686676
1747.5 673686676 676778946 677441635 679425888 681368713 681602554 683616638 685530319 688274231 692071686
1756.2 692071686 694654083 695358582 696825409 698618622 702144241 705094681 705007019 707235184 709328613
1764.8 709328613 711522522 714006119 717235489 718141098 718884735 723232193 727271423 727939758 724577560
1773.5G24577560J033783K155228l87421O58493R18427J852646J569671J32599l85971
1782.2G32125015N56031J747283M47846k65045L55377J308517P91626J401368K256088
1790.9G40724106J982803L35846k180481J134339J072082j53503k75345J180725J571655
1799.5G45392227j018448J196518K78168l20892J94854K23389O82373K68555O07528
1808.2G47504272M76685K068253N02090p63397k75498m74853Q93936k0142Q63800M39377
1817.9G51214523j21383M44946m5013J151351L90091O56433J609116o9122j414643
1826.5G53816299J33362J907578K311783p54166j929321K87628k57569j30157N55267
1835.2G55940704P65152J040497p77588k02026m16565K86789J225052J445083K028809
$$ plain form
1773.5 724577560 725611343 727766571 727379150 728037643 728956070 730808716 732378387 732510986 732125015
1782.2 732125015 732681046 734428329 734876175 734611130 734966507 736275024 737066650 738468018 740724106
1790.9 740724106 742706909 743042755 740862274 741996613 743068695 742915192 742639847 743820572 745392227
1799.5 745392227 744373779 745570297 745848465 745527573 745722427 745945816 746628189 746896744 747504272
1808.2 747504272 747980957 750049210 750551300 749787903 749512405 749037552 749931488 749911346 750775146 751214523
1817.9 751214523 751093140 751538086 751493073 752644424 753034515 753690948 755300064 755230942 753816299
1826.5 753816299 753949661 755857239 758169022 757414856 755485535 755773163 755515594 755385437 755940704
1835.2 755940704 756705856 757746353 756968765 756766739 756350174 756636963 757862015 759307098 761335907
1843.9G61335907k397385k93045O99387J88904o23246n30700K27890N8899M40902p51876
1853.6G58355637q2169J16730J65405P48825J20545N16662j82419M39606r1248l26080
1863.2G59781494K20871J64871J186295P05566J648941M7760j882705m92173k35519
1871.9G61145401J30005k41013K69165j47094J27945k63672l34091P75909K26364L05481
1881.5G61994400k46048O18286O09665k38495K4185j77993J024170J161956n55038
1890.2G64215088j144943K57873L87345O89926J263046j052780o00891j55716J35345
1898.9G63994293J0834o561N25055m48914L4103j55029l3188K06604M05808P07168
1908.5G65240173K80075k28042j167526K90222j41907k38495K93656j62278J813507
$$ plain form
1843.9 761335907 758938522 758645477 759344864 759533768 758910522 758379822 758607712 758666611 759107513 758355637
1853.6 758355637 758273468 758390198 758555603 759304428 759424973 759941635 759759216 760198822 760107574 759781494
1863.2 759781494 760002365 760167236 761353531 762059097 763708038 763755798 761873093 761380920 761145401
1871.9 761145401 761275406 761034393 761303558 761156464 761284409 761020737 760686646 761462555 761688919 761994400
1881.5 761994400 761748352 762366638 762976303 762737808 762761993 762584000 763608170 764770126 764215088
1890.2 764215088 763070145 763328018 763715363 764405289 765668335 764615555 764014664 763858948 763994293
1898.9 763994293 764005127 763998566 764523621 764074707 764108810 763953781 763920593 764127197 764533005 765240173
1908.5 765240173 765520248 765292206 764124680 764414902 764272995 764034500 764328156 764165878 765979385
1917.2G65979385O54984j286163m67987N4779J253662O35376j514130r83582M66767
1925.9G64793091J23825l5935l57132M7837M83703j92413K08511j46179n5389n8518
1935.5G64811401K70844J28097m35028J55793k76871Q27942J435928p83768j123199
1944.2G65011139J89743P7667m24347M64859k22549J05514J96305j00174Q2016j94702
1953.8G65185471K32009m90722m2954K96479K59399J35651q4229N65415k99149l70255
1963.5G65387115l7841R02023R07059l35694m38766p10983j31607j95466J44806L18604
1973.1G65809250K72446K71148l27377L77655j11618l48969l24707j15585J08643k61765
1982.8G65349121K73438J49002L42941L1586M40216M37469o83365k0065M79202K77634
$$ plain form
1917.2 765979385 766634369 765348206 764880219 764934998 766188660 766824036 765309906 764326324 764793091
1925.9 764793091 764916916 764880981 764523849 764571686 765055389 764862976 765071487 764925308 764869919 764811401
1935.5 764811401 765082245 765210342 764775314 764931107 764654236 765482178 766918106 766134338 765011139
1944.2 765011139 765200882 765278549 764854202 765319061 765096512 765202026 765398331 765298157 765380173 765185471
1953.8 765185471 765417480 764926758 764883804 765180283 765439682 765575333 765491104 766056519 765757370 765387115
1963.5 765387115 765349274 766251297 767158356 766822662 766383896 765672913 765541306 765345840 765490646 765809250
1973.1 765809250 766081696 766352844 766025467 766403122 766291504 765942535 765617828 765502243 765610886 765349121
1982.8 765349121 765622559 765771561 766114502 766146088 766586304 767023773 766340408 766320343 766799545 767077179
1992.4G67077179o53687j15280m13208m50592M43497P8278L36990m77219k34756n1193
2002.1G65540009m77753o3782m03061k83737j14365M19693L3493j54571k84882l10135
2011.7G63900909M15192k97165k92129o5995M53263k23007p78046j11160o55289j63040
2021.3G62183533K21634M86526l07236n43670n3177m15115J42364m68063m51126l01667
2031G60494003l3874R4147j87455K83051m17404r0638l66821n89371k45132N5313M33273
2041.6G59429092m26178l814l49427k87323l44314l42560M60663j18942L41110o6605
2051.2G58291702k10952k30866j36871L34625m66232j5183k05078k9984K33307j28936
2060.9G57435532l0823J58234P88574K74963l21121o90308j61438J60370l4866K40402
$$ plain form
1992.4 767077179 766423492 766308212 765895004 765444412 765887909 765966187 766303177 765825958 765591202 765540009
2002.1 765540009 765062256 764998474 764595413 764311676 764197311 764617004 764650497 764495926 764211044 763900909
2011.7 763900909 764316101 764018936 763726807 763660812 764114075 763891068 763113022 763001862 762346573 762183533
2021.3 762183533 762405167 762891693 762584457 762040787 761987610 761572495 761714859 761246796 760795670 760494003
2031 760494003 760460129 760554276 760366821 760649872 760232468 760141830 759775009 759185638 758940506 758995819 759429092
2041.6 759429092 759002914 758999100 758649673 758362350 758018036 757675476 758136139 758017197 758358307 758291702
2051.2 758291702 758080750 757849884 757713013 758047638 757581406 757566223 757361145 757331161 757564468 757435532
2060.9 757435532 757404709 757562943 758351517 758626480 758305359 757615051 757453613 757613983 757579117 757819519
2070.5G57819519P6523R0256j55335N06821P9956j97983J51062l90320K32621r2469
2080.2G58120651l03497l10135K25220M23965m4555J34658m22363L07846J58081K29721
2089.8G58519592J65406q03223l28217k27813M78439L7689J77307L10898l19595O27060
2099.5G58637543L92303J79520k53678o05697k51160L22113Q7280k70233M68064l0365
2109.1G58675690K66723O9886k89841K12173K12174R7503n47332K7923m5471R5291
2118.7G58774719J51673l47214K07291K34298K94800j81503K16522j34659n70145J91880
2128.4G58837662p477J34048l81546m654J62507K09503M87671k28653O4773k45514
2138G59028320m6615n0888j88980J47628O9733K35138q4381R0332m7836M12445M20456
$$ plain form
2070.5 757819519 757896042 757986298 757830963 758337784 758417740 758219757 758370819 757980499 758213120 758120651
2080.2 758120651 757817154 757507019 757732239 758156204 758111649 758246307 757823944 758131790 758289871 758519592
2089.8 758519592 758684998 757881775 757553558 757325745 757804184 757841873 758019180 758330078 758010483 758637543
2099.5 758637543 759029846 759209366 758955688 758349991 758098831 758420944 758508224 758237991 758706055 758675690
2109.1 758675690 758942413 759012299 758722458 758934631 759146805 759244308 758696976 758724899 758679428 758774719
2118.7 758774719 758926392 758579178 758786469 759020767 759315567 759134064 759350586 759215927 758645782 758837662
2128.4 758837662 758830185 758964233 758582687 758578033 758740540 758950043 759437714 759209061 759273834 759028320
2138 759028320 758981705 758930817 758741837 758889465 758959198 759194336 759109955 759200287 759152451 759564896 759985352
2148.6G59985352j13450j0147l40194j46408n79224k2659K60772K594L56675J28784
2158.3G59522095L70712J72348L08685m8904k7542Q0185l64609J74408N6534M78286
2167.9G60722198K32010j22604K79083L83911L15323n6152j5717k18200N33905K21710
2177.6G62275467j99890L27148K76108O02875k8000J60980o4545k24304L70713J93862
2187.2G63690414N7297j14670R36737M52195P324J27334l46145O6757n0278K14005
2196.9G65040970j37787J39618J5869k98386M62494L20816O20423L9901p4920k98157
2206.5G65830841k24304M32205k9526K50626p0343L54309L67279J26801N12619L52707
2216.1G67903214J75399n66101P3548q0872j74332J9226k71377L71857K55203N34744
$$ plain form
2148.6 759985352 759871902 759861755 759521561 759375153 758795929 758773270 759034042 759036636 759393311 759522095
2158.3 759522095 759892807 760065155 760373840 760324936 760297394 760377579 760012970 760187378 760243912 760722198
2167.9 760722198 760954208 760831604 761110687 761494598 761809921 761753769 761738052 761519852 762053757 762275467
2177.6 762275467 762075577 762402725 762678833 763281708 763253708 763414688 763350143 763125839 763496552 763690414
2187.2 763690414 763747711 763633041 764569778 765021973 765029297 765156631 764810486 764877243 764826965 765040970
2196.9 765040970 764903183 765042801 765058670 764760284 765222778 765543594 766164017 766203918 766128998 765830841
2206.5 765830841 765606537 766038742 766009216 766259842 766189499 766543808 766911087 767037888 767550507 767903214
2216.1 767903214 768078613 767512512 767586060 767505188 767330856 767350082 767078705 767450562 767705765 768240509
2225.8G68240509J54800J80283K20337O2714L051p59048P0419j72424o4469K23389
2235.4G68159561J17493N90362j25579j603L03727L19213k79541k00500j14670m60052
2245.1G68308411L06854J08414L18908J49918o867J43433P4844Q8501k17056L36762
2254.7G69612122m16718m89731N8441K04392M28924J89972N69687o3476P1869J53961
2264.4G70319443j75400m23584m33579L37449k20032L31497J49994k07825J71204J59607
2274G70008774O98013R2316k59781q85697k71453K28271j64947R7274l36227O04019
2283.7G69810562N59387L6240k56653k50778L08533q0643K89230k61917Q6060K82516
2293.3G70522537r7809L47443k76260K4261k0828n2338J3733K78626R7427o27518K47040
$$ plain form
2225.8 768240509 768395309 768575592 768795929 768858643 768861694 768102646 768173065 768000641 767936172 768159561
2235.4 768159561 768277054 768867416 768741837 768740234 769043961 769363174 769083633 768883133 768768463 768308411
2245.1 768308411 768615265 768723679 769042587 769192505 769185638 769329071 769403915 769492416 769275360 769612122
2254.7 769612122 769195404 768705673 768764114 768968506 769397430 769587402 770157089 770093613 770165482 770319443
2264.4 770319443 770144043 769720459 769286880 769624329 769404297 769735794 769885788 769677963 769849167 770008774
2274 770008774 770706787 770799103 770539322 769653625 769382172 769610443 769445496 769542770 769206543 769810562
2283.7 769810562 770369949 770406189 770149536 769898758 770207291 770126648 770415878 770153961 770240021 770522537
2293.3 770522537 770424728 770772171 770495911 770520172 770499344 770447006 770460739 770739365 770836792 770209274 770456314
2303.9G70456314R9335J6708K8382L53088M26788k47497L14636K08435k08664p16858
2313.5G70730667J42136O56204P22733Q39996l25089J89438K58255O75583K94190p23801
2323.2G73460312l45001m92249P1030o65589l4027J011887L98025J41449L7461o0501
2332.8G73522797j56632N61752L53852r842q20923l18756l64380n94635P29599l40424
2342.5G72562408O02265N61066p45087j431885j432495r74426o01197J303177N97153
2351.2G70440979k15759L68118L09677J130524l41110M87060q5449J91116j069031
2359.8G71216125r96475J322632q39920L50113O3858P64923m93927j397171L84369
2368.5G70374527o43997j122055j591645j75170q72193j170959m77600q71888j04370
$$ plain form
2303.9 770456314 770555649 770572357 770600739 770953827 771380615 771133118 771447754 771656189 771447525 770730667
2313.5 770730667 770872803 771529007 772251740 773091736 772766647 772956085 773214340 773889923 774184113 773460312
2323.2 773460312 773115311 772623062 772694092 772028503 771994476 773006363 773404388 773545837 773583298 773522797
2332.8 773522797 773366165 773927917 774281769 774271927 773451004 773132248 772767868 772173233 772902832 772562408
2342.5 772562408 773164673 773725739 772980652 771548767 770116272 769141846 768540649 769843826 770440979
2351.2 770440979 770225220 770593338 770903015 772033539 771692429 772179489 772094040 772285156 771216125
2359.8 771216125 770219650 771542282 770702362 771052475 771116333 771881256 771387329 769990158 770374527
2368.5 770374527 769730530 768608475 767016830 766841660 765969467 764798508 764320908 763449020 763344650
2377.2G63344650n65185n36804r18198q76999j88904j54953l31421p61642l78952n86624
2386.8G58044968k14844N4092J32447K36511q14209l60565K0141l18756q87756m93775
2396.5G55398254M25263J10779K99987k97393p40509j80207O4469m33960o03943k60620
2406.1G53782120j91727K38800n20706m98047J1292j49994J4724m81109l77579n62439
2415.8G51265335n45196k02103m50134l84980j12838k77176m62494L2577o10122l31879
2425.4G47920990J57776m91715n09719p26243j07193j21536l10211n55115r43298j37787
2435.1G44175949q0109r5520m47464m76379k12326k79160k23922m81491m20304n99441
2444.7G40859833m54865n35965k86941j61286o46515k66037k32696j50604n63507m36173
$$ plain form
2377.2 763344650 762779465 762242661 761324463 760447464 760258560 760103607 759772186 759010544 758631592 758044968
2386.8 758044968 757830124 757884216 758016663 758253174 757438965 757078400 757098541 756779785 755892029 755398254
2396.5 755398254 755823517 755934296 756234283 755936890 755196381 755016174 755080643 754646683 754042740 753782120
2406.1 753782120 753590393 753829193 753308487 752810440 752821732 752671738 752686462 752205353 751827774 751265335
2415.8 751265335 750720139 750518036 750067902 749682922 749570084 749292908 748830414 748862991 748252869 747920990
2425.4 747920990 748078766 747587051 747077332 746351089 746243896 746122360 745812149 745257034 744313736 744175949
2435.1 744175949 744095840 744000320 743552856 743076477 742864151 742584991 742361069 741879578 741459274 740859833
2444.7 740859833 740404968 739869003 739582062 739420776 738774261 738508224 738275528 738124924 737561417 737125244
2454.3G37125244k77634o17065m6997j49689l58963p13043l16009l04642m65317J01471
2464G33977356p57980m76914L6545l32565n80063n32150k31476l59726l50800o70624
2473.6G29721603l74984k11335j66702L1891m29001k79312n7983j25962p06482o20727
2483.3G26781006l43552n70297m70276n70297k67410j21079K07749J05819k40097k03171
2492.9G24308395o68945o87332k57797J36566o39649n68542O9733k76871l15018r02405
2502.6G20198135j66244O25152J33667k69317m81873o2713m84009r68247o21566j68000
2512.2G17734985j83410j10321J31683J0605J35422p7820j18103l13111p30133p79800
2521.9G15699997n00794k58178k50397j00555o61698l26156P2555j20621n6991m28238
$$ plain form
2454.3 737125244 736847610 736230545 736183548 736033859 735674896 734961853 734645844 734341202 733875885 733977356
2464 733977356 733219376 732742462 732779007 732446442 731866379 731334229 731102753 730743027 730392227 729721603
2473.6 729721603 729346619 729135284 728968582 729000473 728571472 728292160 728234177 728108215 727401733 726781006
2483.3 726781006 726437454 725867157 725396881 724826584 724559174 724438095 724645844 724751663 724511566 724308395
2492.9 724308395 723639450 722952118 722694321 722830887 722191238 721622696 721692429 721415558 721100540 720198135
2502.6 720198135 720031891 720657043 720790710 720521393 720039520 719976807 719492798 718524551 717902985 717734985
2512.2 717734985 717551575 717441254 717572937 717583542 717718964 717641144 717523041 717209930 716479797 715699997
2521.9 715699997 715199203 714941025 714690628 714590073 713928375 713602219 713674774 713554153 713497162 713068924
2531.5G13068924k20947n37262p66526o93206m70581n5085j94931j30386k28806m6615
2541.1G09724579n51529o27747l81622n35812o5766l66745k46124q68073r31320J57013
2550.8G05306854M9744j55335o05087k36664j68686m40445m63790o13327n10865o22940
2560.4G01539459k9526k29263l93219l30124n77316j58463q0795j57928q54416p98416
2570.1F97929993j31836n4856m11071o33316j61057l51715k70767k46430l88641l26233
2579.7F94954071l40424j91268l25394m67377o69708q4457l54157o93359m9057k57492
2589.4F91521378n40619q01545k6779J43128l94364o30798q78448j52283J15661K80686
2599F88636017l21045o91071n69076p31888l35922p20825l54615r5672j14518J1445
$$ plain form
2531.5 713068924 712847977 712310715 711544189 710850983 710380402 710325317 710130386 710000000 709771194 709724579
2541.1 709724579 709173050 708545303 708163681 707627869 707562103 707195358 706949234 706081161 705149841 705306854
2550.8 705306854 705356598 705201263 704596176 704359512 704190826 703750381 703286591 702673264 702162399 701539459
2560.4 701539459 701509933 701280670 700887451 700557327 699980011 699821548 699740753 699582825 698728409 697929993
2570.1 697929993 697798157 697743301 697332230 696698914 696537857 696186142 695915375 695668945 695280304 694954071
2579.7 694954071 694613647 694422379 694096985 693629608 692959900 692875443 692521286 691827927 691778870 691521378
2589.4 691521378 690980759 690179214 690152435 690295563 689901199 689270401 688391953 688239670 688355331 688636017
2599 688636017 688314972 687623901 687054825 686322937 685987015 685266190 684911575 684815903 684701385 684712830
2608.6F84712830l96347n47181p56836m80117o77643m87671n15671p03049k46429m52728
2618.3F79449158k06375l73002m22286o01883n36728l56598r13544n09186r40017q92945
2627.9F73696594m69589o06918k55432k94877l37905o40793o79093q16040o36215n18646
2637.6F68441086j077423j034851p15866k59858l92608m31900m70352k66266l31650
2646.3F63460312j148377p54470n70145p78809j015625o35528l45841m98733j97754
2654.9F57515030o01654k57340l52554m14810l72849j292724j176453r53903n59006
2663.6F51533737o26068n19257m52804o09284J50300L3493r842k94190p45697j252212
2673.3F47208176j457062m40750k67639j93329j03836n07737n96771l90777o29959
$$ plain form
2608.6 684712830 684316483 683769302 683012466 682532349 681854706 681367035 680851364 680148315 679901886 679449158
2618.3 679449158 679242783 678869781 678447495 677845612 677308884 676952286 676038742 675529556 674589539 673696594
2627.9 673696594 673227005 672620087 672364655 672069778 671731873 671091080 670411987 669595947 668959732 668441086
2637.6 668441086 667363663 666328812 665612946 665353088 664960480 664528580 664058228 663791962 663460312
2646.3 663460312 662311935 661557465 660987320 660208511 659192886 658557358 658211517 657712784 657515030
2654.9 657515030 656913376 656656036 656303482 655888672 655515823 654223099 653046646 652092743 651533737
2663.6 651533737 650907669 650388412 649935608 649326324 649476624 649510117 649500275 649206085 648460388 647208176
2673.3 647208176 645751114 645310364 645042725 644849396 644745560 644237823 643641052 643250275 642620316
2681.9F42620316n72281l88031r16138o19202o39724n72472m09088k88468n2414o25953
2691.6F37536545j36261k85797n52979m76303j032257p03049n38368k55089j14441
2700.3F33442001m22248q50983p92427m85192o54068l34053n45349q58917o44684l62320
2709.9F27491760n36613o48117k51580l47595m47006p38297o41059n54810m14963k91176
2719.5F22620544n99365k01950n93910q72688n56603l57094m42543l20472L8528p55959
2729.2F17958488p31582o04706l31802j07689o06156n13191n69572K2392k97890n19752
2738.8F13698540j96877n97648l76130k75726j64871p19299l05062K37427m24614n69954
2748.5F10305786o68411l20168o34842n11970n64766p76062J60561j26687o24771p05833
$$ plain form
2681.9 642620316 642048035 641660004 640743866 640124664 639484940 638912468 638503380 638214912 638162498 637536545
2691.6 637536545 637400284 637114487 636561508 636085205 635052948 634349899 633811531 633556442 633442001
2700.3 633442001 633019753 632168770 631376343 630891151 630237083 629903030 629357681 628498764 627854080 627491760
2709.9 627491760 626955147 626307030 626055450 625707855 625260849 624522552 623881493 623326683 622911720 622620544
2719.5 622620544 622021179 621819229 621225319 620352631 619796028 619438934 618996391 618675919 618714447 617958488
2729.2 617958488 617226906 616622200 616290398 616182709 615576553 615063362 614493790 614516182 614218292 613698540
2738.8 613698540 613501663 612904015 612527885 612252159 612087288 611367989 611062927 611300354 610875740 610305786
2748.5 610305786 609637375 609317207 608682365 608170395 607605629 606829567 606990128 606863441 606238670 605532837
2758.1F05532837k39143r1401q2244j79482r97124p01751j08567P7629q41941q60291
2767.8F01508522l4828l2387J82533l17955l38936m81605p66296o52161m90456n80063
2777.4E97996368j040649m27742p20406m16717J24054k28920r4223j040039j180001
2786.1E92971725o82373m96559r43794j143799l23524m21486n54161o66313l79944
2794.8E87359772m58985q91189r05228j198425j012802j053200p54013q14858j172485
2803.4E79098587q34656q18710o68755o28128r04770j132927r64279j289673j260604
2812.1E70596085q95043j361351j155243j054992o96068n37911r63478j088066j494408
2820.8E61349525j414756j428032j416474j298294j130104j208572j446610r81750
$$ plain form
2758.1 605532837 605293694 605202293 605120049 604940567 603943443 603241692 603133125 603210754 602368813 601508522
2767.8 601508522 601473694 601441307 601623840 601305885 600966949 600485344 599719048 599066887 598576431 597996368
2777.4 597996368 596955719 596527977 595807571 595390854 595514908 595285988 595191765 594151726 592971725
2786.1 592971725 592289352 591792793 590848999 589705200 589381676 588960190 588406029 587739716 587359772
2794.8 587359772 586900787 586009598 585104370 583905945 582893143 581839943 581085930 580271072 579098587
2803.4 579098587 578263931 577445221 576776466 576148338 575243568 574110641 573146362 571856689 570596085
2812.1 570596085 569701042 568339691 567184448 566129456 565433388 564895477 563931999 562843933 561349525
2820.8 561349525 559934769 558506737 557090263 555791969 554661865 553453293 552006683 551024933
2828.5E51024933j203652j470413j500892j392365j084213j336746j899796k066383
2836.2E39070473j490517j479835j489258j832199k318306j940194k128601k306480
2843.9E24085083k315979k432365k375946k404366l083115l060302k171173k269783
2851.7E03972054j818963j469154j278992r08088j138802j051254j081658m69932m30794
2860.3D94324417j137161j356125j478310j397476j781463j808129j829605k116241
2868.1D81419907j973153j563148j784210k394142j738358j952362k454453k012634
2875.8D65547447k096748k010574j937409j728821j580848j665230j397438j354409
2883.5D51775970j363449j095123q10356o85158p94601p11479k03019l51410o99729
$$ plain form
2828.5 551024933 549821281 548350868 546849976 545457611 544373398 543036652 541136856 539070473
2836.2 539070473 537579956 536100121 534610863 532778664 530460358 528520164 526391563 524085083
2843.9 524085083 521769104 519336739 516960793 514556427 511473312 508413010 506241837 503972054
2851.7 503972054 502153091 500683937 499404945 498496857 497358055 496306801 495225143 494755211 494324417
2860.3 494324417 493187256 491831131 490352821 488955345 487173882 485365753 483536148 481419907
2868.1 481419907 479446754 477883606 476099396 473705254 471966896 470014534 467560081 465547447
2875.8 465547447 463450699 461440125 459502716 457773895 456193047 454527817 453130379 451775970
2883.5 451775970 450412521 449317398 448507042 447821884 447027283 446315804 446112785 445761375 445061646
2892.2D45061646p75528p96433l04642l59001m25148k31323m97665n97954m73862o49681
2901.8D39950409r54704r66950j163101p74269n71404r97772j192703j254196q08792
2910.5D31266518j567574j960487j553955k257119k337875k337379k232819j915283
2918.2D15104027k144852k053413j790886j993790j569404n30816p86743j006622j149635
2926.9D02077866q41332J84136n1957L4638M23469R25789J565552J471939J254921
2935.6D07045021J366043J822014J927834K219047K358704K450180K532615K574692
2943.3D24296150L165474K832031K431527K468834K463684K318916K217750K656098
2951D44850464K742538K479973K030220K348519K888031K555389J942177J831207K358933
$$ plain form
2892.2 445061646 444286118 443489685 443185043 442826042 442400894 442169571 441671906 441073952 440600090 439950409
2901.8 439950409 438995705 438028755 436865654 436091385 435519981 434522209 433329506 432075310 431266518
2910.5 431266518 429698944 427738457 426184502 423927383 421589508 419252129 417019310 415104027
2918.2 415104027 412959175 410905762 409114876 407121086 405551682 405020866 404234123 403227501 402077866
2926.9 402077866 401236534 401420670 401368713 401403351 401826820 402752609 404318161 405790100 407045021
2935.6 407045021 408411064 410233078 412160912 414379959 416738663 419188843 421721458 424296150
2943.3 424296150 427461624 430293655 432725182 435194016 437657700 439976616 442194366 444850464
2951 444850464 447593002 450072975 452103195 454451714 457339745 459895134 461837311 463668518 466027451
2959.7D66027451K376709K323837K160530K098656K102432J876984K082099K176094
2967.4D83224792J944047J792297K408218K318421J849556J819152J748581J942482
2975.1D99047546J262322J561317K269860K042541J848221J451149J693344J555557
2982.8E12731857J418801J656837J430893J162529R01070Q54911R18007R48677P77970
2991.5E22801552J027336R37920L55148M28848P40814M86565k24228J95961O78749
3000.2E27428665L67890j54152l00560k23275n56449j42289l67088o18744j47781l09677
3009.8E24976540n67971m52079k89193r59205n16663J6518p67174j120338j001358
3018.5E19319077q12188j156768q90961j074715j199837o00814r80683p97386r13315
$$ plain form
2959.7 466027451 468404160 470727997 472888527 474987183 477089615 478966599 481048698 483224792
2967.4 483224792 485168839 486961136 489369354 491687775 493537331 495356483 497105064 499047546
2975.1 499047546 500309868 501871185 504141045 506183586 508031807 509482956 511176300 512731857
2982.8 512731857 514150658 515807495 517238388 518400917 519301987 520156898 521074905 522023582 522801552
2991.5 522801552 523828888 524766808 525121956 525550804 526291618 526778183 526553955 526749916 527428665
3000.2 527428665 527796555 527642403 527341843 527118568 526562119 526419830 526052742 525433998 525286217 524976540
3009.8 524976540 524408569 523956490 523667297 522708092 522191429 522207947 521440773 520320435 519319077
3018.5 519319077 518506889 517350121 516459160 515384445 514184608 513583794 512603111 511805725 510892410
3027.2E10892410j030807p93953j006127j131095j321869r18160q20122j345558j815834
3035.9E00708885j305580l96385o87485j508140j310769n86586j182632j668892j673164
3044.5D90389252j362076j188011j364937o82488j224784j680146j099624j091652
3052.2D80695534j429291j419563q54607j248627j585540j540413j355744j300544
3060D69961205j527863j094475r72786o97708j225433j596070q58497j141548j584053
3068.6D59262772j663590j120300q76770j295586j473541j315346j115722j311455
3076.4D49090462j008263q46710j113815j472397j602936j348801j356048j399651
3084.1D38941841j182060p07855r27315j006432j260338j663208j213302j455345j378174
$$ plain form
3027.2 510892410 509861603 509067650 508061523 506930428 505608559 504690399 503870277 502524719 500708885
3035.9 500708885 499403305 499006920 498319435 496811295 495500526 494913940 493731308 492062416 490389252
3044.5 490389252 489027176 487839165 486474228 485791740 484566956 482886810 481787186 480695534
3052.2 480695534 479266243 477846680 476992073 475743446 474157906 472617493 471261749 469961205
3060 469961205 468433342 467338867 466366081 465668373 464442940 462846870 461988373 460846825 459262772
3068.6 459262772 457599182 456478882 455602112 454306526 452832985 451517639 450401917 449090462
3076.4 449090462 448082199 447235489 446121674 444649277 443046341 441697540 440341492 438941841
3084.1 438941841 437759781 437051926 436124611 435118179 433857841 432194633 430981331 429525986 428147812
3092.7D28147812j148529r87663r53293j446610j276741j236305r33723j000748j425896
3101.4D17738304j514397j480102q97179j163063j381111r44061j038704j218605j280518
3110.1D06820564j491394j284675j149483j334572r44710j164741j324120j144256
3117.8C96982613j108818j039811j553268j246452j085244j378669j302338j142654
3125.5C87125359r05228r76677o52351j044426j853028j769409q55636o35872j405144
3134.2C77027588p99141q85429j739121j560249j064110r60121j343079j402817j513328
3142.9C65760193j043091p41501j379127j486435q60520n53703r27887r06982j284943
3151.6C56576004j632538j351280j104736p92008q04901j014481j415786j094132r12475
$$ plain form
3092.7 428147812 426999283 426011620 425058327 423611717 422334976 421098671 420164948 419164200 417738304
3101.4 417738304 416223907 414743805 413846626 412683563 411302452 410358391 409319687 408101082 406820564
3110.1 406820564 405329170 404044495 402895012 401560440 400615730 399450989 398126869 396982613
3117.8 396982613 395873795 394833984 393280716 392034264 390949020 389570351 388268013 387125359
3125.5 387125359 386220131 385243454 384591103 383546677 381693649 379924240 379068604 378432732 377027588
3134.2 377027588 376228447 375343018 373603897 372043648 370979538 370019417 368676338 367273521 365760193
3142.9 365760193 364717102 363975601 362596474 361110039 360249519 359695816 358767929 357860947 356576004
3151.6 356576004 354943466 353592186 352487450 351695442 350890541 349876060 348460274 347366142 346453667
3160.3C46453667j144905j143418j430053j010170p88041p44972p59468j209717j358528
3168.9C36864395j252632j071053q58459m45519j072654j299668q72879r67979p16667
3177.6C28306885j189156j252785r27352j021653r23957q77572r89189j041794o76078
3186.3C19407349q41885q10108q88157j183910j083985j134929q16155n98526j14574
3195C11935120l98560j009884r54304j075115r85641j044140p19395j076317p83786
3203.6C03887978j61324q84952q80681j034259n67494o71253j361675n44834m44069
3212.3B97337437q76294j001911o33850l76339m12063q28533p42665l82461r64013
3221B91119308p62290o42701n96695q45222q36525k82536p95230o90957o85577l49426
$$ plain form
3160.3 346453667 345308762 344165344 342735291 341725121 340937080 340192108 339432640 338222923 336864395
3168.9 336864395 335611763 334540710 333682251 333236732 332164078 330864410 329991531 329023552 328306885
3177.6 328306885 327117729 325864944 324937592 323915939 322991982 322114410 321125221 320083427 319407349
3186.3 319407349 318565464 317755356 316867199 315683289 314599304 313464375 312648220 312049694 311935120
3195 311935120 311536560 310526676 309572372 308497257 307511616 306467476 305748081 304671764 303887978
3203.6 303887978 303726654 302841702 301961021 300926762 300359268 299688015 298326340 297781506 297337437
3212.3 297337437 296461143 295459232 294825382 294449043 294036980 293208447 292465782 292083321 291119308
3221 291119308 290357018 289714317 289117622 288272400 287435875 287153339 286358109 285667152 284981575 284632149
3230.7B84632149k64931q54740o90651p16324m67606r27047r57127l97854m42276n12466
3240.3B78401127p14436n98125q09479m15764m37946q79173o68087p71313l31097l89881
3249.9B72385826p64656r85737o00586j57356o37474m03423m34151o01673l92227n21984
3259.6B66886559p78924r12151o61888j64223j48983o44302m09374m11129p81021r22985
3269.2B61051579m47789j11599n48782m2725m29744n55420k21329q94413o78730o74629
3278.9B56446419l45326m18167n23815N3806l41453m98924n54276l85513p9708j05439
3288.5B53247604o22692q06789M997l6449m96979p42874o50006k37503J07766k4529
3298.2B49742546p58152r50012o26640j91460j18904j83277n36900m30736J24626l82958
$$ plain form
3230.7 284632149 284367218 283512478 282821827 282105503 281637897 280710850 279753723 279355869 278913593 278401127
3240.3 278401127 277686691 277088566 276279087 275863323 275425377 274546204 273878117 273106804 272775707 272385826
3249.9 272385826 271621170 270635433 270034847 269877491 269240017 268836594 268402443 267800770 267408543 266886559
3259.6 266886559 266107635 265195484 264533596 264369373 264220390 263576088 263166714 262755585 261974564 261051579
3269.2 261051579 260603790 260492191 259943409 259900684 259470940 258915520 258694191 257799778 257121048 256446419
3278.9 256446419 256101093 255682926 255159111 255212917 254871464 254372540 253818264 253432751 253353043 253247604
3288.5 253247604 252624912 251818123 251823120 251786671 251289692 250546818 249896812 249659309 249767075 249742546
3298.2 249742546 248984394 248034382 247407742 247216282 247097378 246914101 246377201 245946465 246071091 245688133
3307.8B45688133m63543m60338q80509o56223Q6670O9828m61006k14100m29249n59616
3317.4B41720047n38349m67873k50816m25968l83072n01538n04035m37470l9902k32601
3327.1B37938423o44379l68518m38099k40231q31508o69442R4986j77765k20069j83640
3336.7B34259758o5556p20310n69324m04969o73637l2654l78036o34594o08292k88830
3346.4B29883556k43301l48129j52970p49416p54814n50709R0160J61972m47616m91963
3356B26396770l11603J06468m94060l33138j94549p07074m23774j61744J0949o26641
3365.7B23261604n32207l15609m95682j24092j83735l81946n76802k90127o3114J30978
3375.3B20429268j08109m92973l61099k46182L67470j74713n57060n7335j30749k64397
$$ plain form
3307.8 245688133 245224590 244764252 243883743 243227520 243314190 243384018 242923012 242708912 242279663 241720047
3317.4 241720047 241181698 240713825 240463009 240037041 239653969 239152431 238648396 238210926 238171024 237938423
3327.1 237938423 237294044 236925526 236487427 236247196 235415688 234746246 234841232 234663467 234443398 234259758
3336.7 234259758 234194202 233473892 232904568 232499599 231825962 231793308 231415272 230780678 230172386 229883556
3346.4 229883556 229640255 229292126 229139156 228389740 227634926 227084217 227174377 227336349 226888733 226396770
3356 226396770 226085167 226191635 225697575 225364437 225169888 224462814 224039040 223877296 223888245 223261604
3365.7 223261604 222729397 222413788 221918106 221794014 221610279 221228333 220651531 220361404 220298290 220429268
3375.3 220429268 220321159 219828186 219467087 219220905 219588375 219413662 218856602 218799267 218668518 218404121
3384.9B18404121l84712j47838l73631j27563L97930J40056j39599o27307p82433j49841
3394.6B16209183N30891K57015k47650m90608p191M45519m69952n39951p0057j17416
3404.2B15499783K136L24287P7305l39012l13721l02906L90549J70479j33038L15857
3413.9B15691719J06583q831q6174J84726R9831J09978J84669L9025R5367k89116J755
3424.5B16129532L14579Q10661M77410l31631J63784K66971O3935m11911q3618M90608
3434.1B17890320J56040j183L99113P33490L65505O29864O02417J98765k02866l8318
3443.8B20733147K81086K22625J169720K33021J1177O29101K05097Q94337Q09612M69456
3453.4B25658379o6624J14078J83697L62053J387310L82385J51806K36054P61566J002865
$$ plain form
3384.9 218404121 218019409 217871571 217497940 217370377 217768307 217908363 217768764 217141457 216359024 216209183
3394.6 216209183 216740074 216997089 216749439 216258831 216251640 216697159 216227207 215687256 215617199 215499783
3404.2 215499783 215501919 215826206 215903511 215564499 215250778 214947872 215338421 215508900 215375862 215691719
3413.9 215691719 215798302 215789471 215703297 215888023 215987854 216097832 216282501 216321526 216416893 216127777 216129532
3424.5 216129532 216444111 217254772 217732182 217400551 217564335 217831306 217895241 217483330 217399712 217890320
3434.1 217890320 218046360 218045177 218444290 219177780 219543285 220173149 220775566 220974331 220771465 220733147
3443.8 220733147 221014233 221236858 222406578 222639599 222650776 223279877 223484974 224379311 225188923 225658379
3453.4 225658379 225591755 225705833 225889530 226251583 227638893 228021278 228173084 228409138 229170704 230173569
3463.1B30173569M0378P39022Q20541P42798L97739L05710P85713O06842N58796L72639
3472.7B35543747O02894L7479J84174J165962J278076J212597M78725O06575O84701
3481.4B41794930K00462M52423J040935J245804N04666M19426J035442Q33378Q83941
3490.1B48411407J276856J89590Q5907R71375Q54416Q14075P23305J100788P29675
3498.7B55157394P68223J566906J358719J041393K96975K80551M50097O65378R79271
3507.4B62564907J388207J180973K39257J011830R72786J080703R01146O59218J447487
3516.1B71446514J356182J093025l8700M59290J590729J910457J593056J61343J020603
3524.8B80592499R76085R65748J333313J296749J182633J147346J582756M79031Q05511
$$ plain form
3463.1 230173569 230213947 230952969 231773510 232516308 232914047 233219757 234005470 234612312 235171108 235543747
3472.7 235543747 236146641 236184120 236368294 237534256 238812332 240024929 240503654 241110229 241794930
3481.4 241794930 241995392 242447815 243488750 244734554 245239220 245658646 246694088 247527466 248411407
3490.1 248411407 249688263 249877853 249963760 250935135 251789551 252603626 253326931 254427719 255157394
3498.7 255157394 255925617 257492523 258851242 259892635 260189610 260470161 260920258 261585636 262564907
3507.4 262564907 263953114 265134087 265373344 266385174 267357960 268438663 269339809 269999027 271446514
3516.1 271446514 272802696 273895721 273857021 274316311 275907040 277817497 279410553 279571896 280592499
3524.8 280592499 281568584 282534332 283867645 285164394 286347027 287494373 289077129 289556160 290361671
3533.5B90361671R29203J415539J586800M52518J456814P78332R82723J194821J366691
3542.1C00525112K235317J632729J396847N19829J461792P65514P80868J917897K084789
3550.8C13320694K366981M25435J533279J402740J345082K252807Q97828J772842K068901
3559.5C27386589J500664P84302K209396K358360J604653L872680J811486J714172
3567.2C43242302Q16231J62964L107833J852227J951942K101288K235756J545677J428642
3575.9C58444862K499886J875496L014183K548790J934700K088470K077294K078743
3583.6C76562424J851616M182739K887726J332969K356034L58848K590447K438011
3591.3C94560814L089790K947960K293167M177361Q49533J753464L521156K563667
$$ plain form
3533.5 290361671 291290874 292706413 294293213 294745731 296202545 296980877 297963600 299158421 300525112
3542.1 300525112 302760429 304393158 305790005 306309834 307771626 308537140 309318008 311235905 313320694
3550.8 313320694 315687675 316113110 317646389 319049129 320394211 322647018 323544846 325317688 327386589
3559.5 327386589 328887253 329671555 331880951 334239311 335843964 339716644 341528130 343242302
3567.2 343242302 344058533 344221497 347329330 349181557 351133499 353234787 355470543 357016220 358444862
3575.9 358444862 360944748 362820244 365834427 368383217 370317917 372406387 374483681 376562424
3583.6 376562424 378414040 382596779 385484505 386817474 389173508 389532356 392122803 394560814
3591.3 394560814 397650604 400598564 402891731 407069092 407918625 409672089 413193245 415756912
3599D15756912L442803J415558J000595K328758K736816K696839L525962M328614M35219
3607.7D37668076L115081K198983O29959O408271K137414l00637M266243N06554L534622
3616.4D60164566M107399J879501L113747J15051J121826L156777K736702K331428
3624.1D78726997K846566K907714L043099O128731L940658m411087J758461K563515
3631.8D97504654M324760K468071o51359J767082L097610L448143K095757J349449
3639.5E15404167J599312K617302K250175J282387K773209L749962N636406K658691
3647.3E37971611M93126O031990L12386l831025j071243L595734L197517M457970N790329
3655.9E56948395n851212N27840M243545J863594J391373J142121K398757R07250J843872
$$ plain form
3599 415756912 419199715 420615273 421615868 423944626 426681442 429378281 432904243 437232857 437668076
3607.7 437668076 440783157 442982140 443612099 450020370 452157784 451857147 456123390 456629944 460164566
3616.4 460164566 464271965 466151466 469265213 469380264 470502090 473658867 476395569 478726997
3624.1 478726997 481573563 484481277 487524376 493653107 497593765 493182678 494941139 497504654
3631.8 497504654 501829414 504297485 503646126 505413208 508510818 511958961 514054718 515404167
3639.5 515404167 517003479 519620781 521870956 523153343 525926552 529676514 535312920 537971611
3647.3 537971611 538464737 544496727 544809113 540978088 539906845 543502579 546700096 551158066 556948395
3655.9 556948395 551097183 551625023 555868568 557732162 559123535 560265656 562664413 563571663 565415535
3664.6E65415535K449684J646843M317818M098396K908211J75896n716439J929093
3672.3E77225037O366920P861176K303657j3770332J412010O095657L951798j234284
3680E90211639m68902J613998J467667K144470K045479R60083L978462O346970m924279
3688.7F03375587j052818O874657n111885j639366L844413O13556R48754O84166L58543
3697.4F08895607J659203Q29620K162552L616180k538605k103195K993012J398887
3705.1F16913261R71718P32727K464485M772950k423058L227539K160988j0663376
3712.8F18157234L202782L223381O31714Q72383K061119J452560k267036Q93669N258904
3721.5F33486710p19910l322373M281159J413498n38521j959839k92778K723808J083374
$$ plain form
3664.6 565415535 567865219 569512062 573829880 577928276 580836487 581012383 575295944 577225037
3672.3 577225037 583591957 591453133 593756790 579986458 581398468 587494125 591445923 590211639
3680 590211639 589742737 591356735 592824402 594968872 597014351 597974434 601952896 608299866 603375587
3688.7 603375587 602322769 609197426 604085541 602446175 606290588 606904144 607852898 608537064 608895607
3697.4 608895607 610554810 611384430 613546982 617163162 614624557 612521362 615514374 616913261
3705.1 616913261 617884979 618617706 621082191 625855141 623432083 626659622 628820610 618157234
3712.8 618157234 621360016 624583397 625215111 626087494 628148613 629601173 627334137 628227806 633486710
3721.5 633486710 632766800 629444427 633725586 635139084 634600563 632640724 632347946 635071754 636155128
3730.2F36155128N490532j34277m821968P144966J740265m947433j678772J072158
3737.9F40020599P7515J209106K860260l337631K392578R347992q550262j0053444
3745.6F33966713Q007622M804229N750046l57132o300888R131165n509033p797242
3753.3F41695480L629456L269501K980652m043503K256088N818176n496673k526703
3761F47582474K476578Q61358M48380L929901q77152m251861K295990L504867k1515
3769.7F55949020o100540J469803K413025L1891J50528K96325J459809N20859K977523
3778.4F59168243R51996n356369J857987J184539R09729K494431j826630j646041L24401
3787.1F58062286Q84171J224289L06702l87650q5449J144180O28052J727600L363724
$$ plain form
3730.2 636155128 641645660 641511383 636689415 643834381 645574646 640627213 638948441 640020599
3737.9 640020599 640098114 641307220 644167480 640829849 643222427 652570419 644020157 633966713
3745.6 633966713 641974335 646778564 652528610 652171478 645870590 655001755 649492722 641695480
3753.3 641695480 645324936 648594437 651575089 647531586 649787674 655605850 650109177 647582474
3761 647582474 650059052 650920410 651368790 655298691 654421539 650169678 652465668 655970535 655949020
3769.7 655949020 649848480 651318283 653731308 653763199 653913727 654210052 655669861 656190720 659168243
3778.4 659168243 660120239 654763870 656621857 657806396 658716125 661210556 659383926 657737885 658062286
3787.1 658062286 658946457 660170746 660477448 660089798 660004349 661148529 661776581 663504181 666867905
3795.8F66867905j988907k983551J611480L983765N672302m183807q843231P24563
3803.5F60860519K040406M947815M804916o714935l362809K879944Q21228j75171K37046
3812.2F66338959K97012K237778N921707P95364j0926132K736588N138778N653076
3819.9F78193130L387528j4585800k46582L015289J360474L180999J315690l535920
3827.6F72084808j240081P92388K716599J772461o625519K186051O387176l663254
3835.3F74410629J02692O711426m053345k107010N583572n602951k377624N099258
3843F77766647j019363l348389J811981Q91877k96479J188736N58625L313903O359864
3851.7F87227402q88214p48139j5147781J628647Q409195j059037l022613M8675J633606
$$ plain form
3795.8 666867905 664878998 661895447 663506927 667490692 673162994 668979187 660135956 660860519
3803.5 660860519 662900925 667848740 672653656 665938721 662575912 665455856 666277084 666101913 666338959
3812.2 666338959 666635971 668873749 674795456 675590820 664664688 667401276 672540054 678193130
3819.9 678193130 681580658 666994858 666748276 669763565 671124039 674305038 675620728 672084808
3827.6 672084808 670844727 671637115 674353714 676126175 669500656 671686707 678073883 674410629
3835.3 674410629 674513321 681224747 677171402 675064392 680647964 675045013 672667389 677766647
3843 677766647 676747284 673398895 675210876 676102753 675806274 676995010 677553635 680867538 687227402
3851.7 687227402 686339188 685591049 670443268 672071915 680481110 679422073 676399460 676448135 678081741
3860.4F78081741L747406k183532J15738N861892m040146n384521K328644L817901
3868.1F82345123N382233m624481o040268J572418L417130L550643p985534l30353
3875.8F77286911L200226j96152J713028M390945j489257o504975K605744Q14056K077332
3884.5F83897858M679336r845810j71509J889649P7286M434280J788330n626602l9368
3893.2F81083450J797486j310120M65241J056365L127900K078857p409973M469681
3900.9F85358887L015213l739395L080673j584091j506577k303543j709137J475906
3908.6F82087936M20762L67126M17786r0714n24216J92948K287903K736435k825852
3917.3F85070114l322754L418350Q35953l087082O85654J371307J471024j280365l021698
$$ plain form
3860.4 678081741 681829147 679645615 679761353 685623245 681583099 676198578 678527222 682345123
3868.1 682345123 687727356 683102875 677062607 678635025 682052155 685602798 677617264 677286911
3875.8 677286911 680487137 680290985 682004013 686394958 684905701 678400726 681006470 681820526 683897858
3884.5 683897858 688577194 678731384 678559875 680449524 680526810 684961090 686749420 681122818 681083450
3893.2 681083450 682880936 681570816 682036057 683092422 686220322 688299179 680889206 685358887
3900.9 685358887 688374100 684634705 687715378 686131287 684624710 682321167 680612030 682087936
3908.6 682087936 682508698 682875824 683293610 683202896 682678680 682871628 685159531 687895966 685070114
3917.3 685070114 681747360 685165710 686001663 682914581 683600235 684971542 686442566 685162201 682140503
3926F82140503R06753J953812J783218n87539j134949J604691j093903q75702N89905
3934.6F85286789q84857J75552L99094J08490Q6364m13589J476669J430512k910767
3943.3F84754257p98416J024704Q14362J734314q26111J33133m17176k452163J307525
3952F85274429Q46329K92206K73895j27334j26648j241684L79791J94931L54996M95453
3961.6F86616364j495286m07562M67758J77536l45840K60162J041718J21612o01043
3970.3F85835419j96610N09491N89142M23431J32447k60773j045456n08041O01959
3979F86081009M60739L86810N3406k57492l55148L05252J08337l52173K0676n04379
3988.6F85947037N52368P37457q5602K72751J96305o4774m50745L59803K56881n39703
$$ plain form
3926 682140503 683047256 685001068 686784286 686196747 685061798 686666489 685572586 684696884 685286789
3934.6 685286789 684401932 684577484 684976578 685085068 685171432 684757843 686234512 687665024 684754257
3943.3 684754257 683955841 684980545 685794907 687529221 686703110 686836243 686419067 683966904 685274429
3952 685274429 686120758 686412964 686686859 686559525 686432877 685191193 685570984 685765915 686120911 686616364
3961.6 686616364 685121078 684713516 685181274 685358810 685012970 685273132 686314850 686436462 685835419
3970.3 685835419 685638809 686148300 686737442 687160873 687293320 687032547 685987091 685479050 686081009
3979 686081009 686541748 686928558 686981964 686724472 686369324 686674576 686782913 686430740 686451416 685947037
3988.6 685947037 686499405 687236862 687151260 687424011 687620316 687555542 687104797 687464600 687721481 687181778
3998.3F87181778k66190M31061
4000.2F87346649
$$ plain form
3998.3 687181778 686915588 687346649
4000.2 687346649
##END=$$ End of the data block
