##TITLE=$$ Begin of the data block
##JCAMP-DX=5.00 $$ ACD/SpecManager v 10.08
##SPECTROMETER/DATA SYSTEM=Varian
##DATE=20 Nov 2012 10:20:44
##DATA TYPE=INFRARED SPECTRUM
##DATA CLASS=XYDATA
##ORIGIN=
##OWNER=
##NPOINTS=3735
##FIRSTX=399.26403809
##LASTX=4000.35498047
##MAXX=4000.35498047
##MINX=399.26403809
##MAXY=77.56520844
##MINY=18.51679802
##XFACTOR=1.0000000000
##YFACTOR=0.000000100000000
##FIRSTY=50.44710541
##DELTAX=0.96440572
##XUNITS=1/CM
##YUNITS=TRANSMITTANCE
##XYDATA=(X++(Y..Y))
399.3E04471054o434135r032898L953323P195129q175773r315834J031379m693183
407D78999062J712150L642960N57899K892609j931038m27666L029671J714325n20668
415.7D89669304j376839j849785m829445N44854L312378J154480l848916k884521J968498
424.3D81860008k303657K06375L244552k211189n315780m363900l762283L11165O14242
433D68279533k169342k145233K832680K617531r749222m323196P836456M977760J71623
441.7D68328590p10983J781006j33019j703262O057663N009003k136498J320343P59621
450.4D78572464M25949J855278K94685J506539J130943J327400n126533p972794K737198
459.1D74751129k949447K640991M116096k700271J550903j283569l977280O24390J366195
$$ y = [504471054, 498036919, 489004021, 492957344, 500152473, 491976700, 482660866, 483692245, 478999062, 480711212, 484354172, 484912071, 487804680, 485873642, 485445976, 488475647, 490189972, 489669304, 488292465, 486442680, 481613235, 482158089, 485470467, 486624947, 482776031, 479891510, 481860008, 479556351, 479762726, 483007278, 480796089, 475480309, 471116409, 467354126, 467665291, 468279533, 466110191, 463964958, 466797638, 469415169, 459665947, 455342751, 463179207, 468156967, 468328590, 467617607, 469398613, 469265594, 467562332, 473619995, 478628998, 476492500, 477812843, 478572464, 478998413, 480853691, 481148376, 482654915, 483785858, 485113258, 479986725, 472013931, 474751129, 471801682, 474442673, 478558769, 475858498, 477409401, 476125832, 472148552, 472772942, 474139137]
467.7D74139137j505851l222275m743080j543236K559280l381920k685852k195205
475.5D57420998l564682j920662N9280l987541n1842M207649n885238l595124P98569
484.1D43481407L187790R79958k650719L944740J245423o15082j151390j80397K033119
492.8D50274849n38902o24733m014893r06219j953392m918595j666832J183892K991981
501.5D39827156m381714j169815K118836k209778l859291k419930Q56285p80296L4256
510.2D28015709j690979l982887m623413m530335m7340P61909j566162j965599j92375
518.9D10178528k961884k258339k176437k330208J004372q58345Q87069r69276k820091
527.5C97695389L51486K474785J479835k860641l97072J170921J56517N48401J858063
$$ y = [474139137, 472633286, 469411011, 464667931, 463124695, 465683975, 462302055, 459616203, 457420998, 453856316, 451935654, 451994934, 448007393, 447955551, 452163200, 446277962, 442682838, 443481407, 446669197, 447649155, 444998436, 448943176, 450188599, 449573517, 448422127, 448241730, 450274849, 449735947, 449111214, 445096321, 444190102, 442236710, 437318115, 435651283, 436835175, 439827156, 435445442, 434275627, 436394463, 434184685, 430325394, 427905464, 428761749, 427981453, 428015709, 426324730, 422341843, 417718430, 413188095, 413140755, 413902664, 412336502, 410370903, 410178528, 407216644, 404958305, 402781868, 400451660, 401456032, 400597687, 401484756, 400515480, 397695389, 398046875, 400521660, 402001495, 399140854, 398743782, 399914703, 400071220, 400619621, 402477684]
536.2D02477684K420425N53017K066536K719193K400054K188035J793327J784820J789170
544.9D20192261J844749k22244o55174j079598j646805l52096L013o30798k23656l1662
554.5D17197990k134704l18108q80470k333450K20604j454964k896271k039070r47838
563.2D04413719l798218l366508M31633k127266l345642l194809k119865l162308k759857
571.9C80970879q75168j479416Q58192P04918o5880q24928M84848K300491K205964
580.6C84279900K397499K133178K900696J561661K906647L697052K303543K148895
588.3D04329071J442108J873322J099891k39143L92914J633873j06392r73511Q0719
597D09532852q68378P43447J459389K23198j034165k96707R92737j57891L02201k80876
$$ y = [402477684, 404898109, 405451126, 407517662, 410236855, 412636909, 414824944, 416618271, 418403091, 420192261, 422037010, 421814766, 421159592, 420079994, 418433189, 418081093, 418084106, 417453308, 417229652, 417197990, 415063286, 414745178, 413864708, 411531258, 411751862, 410296898, 407400627, 405361557, 404413719, 400615501, 397248993, 397680626, 395553360, 392207718, 389012909, 386893044, 383730736, 380970879, 380095711, 378616295, 379474487, 380179405, 380113525, 379288597, 379773445, 382073936, 384279900, 386677399, 388810577, 391711273, 393272934, 396179581, 399876633, 402180176, 404329071, 405771179, 407644501, 408744392, 408505249, 408898163, 410532036, 410425644, 409452133, 409532852, 408664474, 409407921, 410867310, 411090508, 410056343, 409759636, 410752373, 410594482, 410896683, 410615807]
606.6D10615807L52020Q68225K92053N35774l77693r6893n32990M86641J007233R95560
616.3D14145737J621818O34270J857681J902771N01251l38707J567154M070588K650795
624.9D28613358J011238N24902O0120J31378J634025J463013P31087J599884P50923
633.6D36519928M8027L90587J007156J546517J473541N49393K12669Q10966O84128
642.3D43242912N72472p973N21202J750412K269211K436752J613121L85514p23229
651D52060394M35486J301117L95927J07880O91986J419487N43328K30979J62430L58734
660.6D57707748J047554M78173j17493q15430R06220K706070J261864n03693P05299
669.3D63376312L93029J141433J416168Q26416J021271J069679N46952O11419J079293
$$ y = [410615807, 410967827, 411836052, 412128105, 412663879, 412286186, 412189293, 411656303, 412142944, 413150177, 414145737, 415767555, 416401825, 418259506, 420162277, 420663528, 420324821, 421891975, 425962563, 428613358, 429624596, 430149498, 430209618, 430340996, 431975021, 433438034, 434169121, 435769005, 436519928, 436567955, 436958542, 437965698, 439512215, 440985756, 441535149, 441747818, 442558784, 443242912, 443815384, 443807411, 444328613, 446079025, 448348236, 450784988, 452398109, 452783623, 452060394, 452495880, 453796997, 454192924, 454300804, 454992790, 456412277, 456955605, 457186584, 457349014, 457707748, 458755302, 459233475, 459115982, 458300552, 459206772, 461912842, 463174706, 462671013, 463376312, 463769341, 464910774, 466326942, 467153358, 468174629, 469244308, 469791260, 470402679, 471481972]
678D71481972J014137J075783J064949J170730J321106k81868j71547K17133k12097
686.7D76680298J392135O35720p92923l62396L1395O13899J085701P27768j223488
695.3D78788109j468773o13289j413116j780548r61876k28272r73320j285591o00472
704D69462852L4028K68859p19718j033021J91384Q94279M6196L64151J393051J775361
713.7D72677422J736908J091766K038956L155632L565292L277283K020034J873742
721.4D91437035K604942K259979K153740L310318K910080K111740K468949K430763
729.1E11687546J785011K411118L289566J819877P05452L44544O56128J709213J810112
737.8E26218567K474670J763764k38724N65262Q36639l07731J21116J84403q74787
$$ y = [471481972, 472496109, 473571892, 474636841, 475807571, 477128677, 476846809, 476675262, 476892395, 476680298, 478072433, 478708153, 477915230, 477552834, 477584229, 478198128, 479283829, 480011597, 478788109, 477319336, 476706047, 475292931, 473512383, 472550507, 472322235, 471348915, 470063324, 469462852, 469496880, 469765739, 469046021, 468013000, 468204384, 469098663, 469144859, 469509010, 470902061, 472677422, 474414330, 475506096, 477545052, 480700684, 484265976, 487543259, 489563293, 491437035, 494041977, 496301956, 498455696, 501766014, 504676094, 506787834, 509256783, 511687546, 513472557, 515883675, 519173241, 520993118, 521698570, 522043114, 522699242, 524408455, 526218567, 528693237, 530457001, 530218277, 530783539, 531620178, 531312447, 531433563, 531617966, 530743179]
746.5E30743179j734886q16803O981k3689m29764k194405j668701m28467j797905l344383
756.1E18311157k679748j408272j820450j793213j709633k018432j022110k67945q62007
764.8E04729347q88214l58162o77109j70974J290550J814918J935044K561722L012428
773.5E13249550K165069K029267L321380L291130K866898L177261L349839L235893
781.2E36686287L299370L305435L894997L696060K867355M107246M366570L641319
788.9E65864639K900811K370681K270241J856842J531906J419754K863312K880516
796.6E83958702J904717J470031J114235N26657O34537K046356J226731P89413K41089
805.3E93912468M48799J084557O75621L35540j887855p43256M7684q66432j334267
$$ y = [530743179, 529008293, 528191490, 528198471, 528174782, 527745018, 525550613, 523881912, 523453445, 521655540, 518311157, 515631409, 514223137, 512402687, 510609474, 508899841, 506881409, 505859299, 505591354, 504729347, 503841133, 503482971, 502805862, 502634888, 503925438, 505740356, 507675400, 510237122, 513249550, 515414619, 517443886, 520765266, 524056396, 526923294, 530100555, 533450394, 536686287, 539985657, 543291092, 547186089, 550882149, 553749504, 557856750, 562223320, 565864639, 568765450, 571136131, 573406372, 575263214, 576795120, 578214874, 581078186, 583958702, 585863419, 587333450, 588447685, 588974342, 589608879, 591655235, 592881966, 593671379, 593912468, 594361267, 595445824, 596121445, 596456985, 594569130, 593825874, 593873558, 593007126, 591672859]
814E91672859j778221k94914k65579J10092J02691j16310k14576M62837J159210m72908
823.6E90365181m81682j321831r22432l01780j191864j620560j832008q39119j061020
832.3E80792885M7531o01234j212121n25169j504402q19893j956673j781044j268921
841E71170959j323051m42924j196213p62673j162872k056580k245559j928635j905861
849.6E58146591j991424j769410k032585j727943k290497k622757l527985k852706
857.4E39331284j844674l369484k542915j348762m21715J678963L991966L882255K520676
866E41877594L976021M721222N340652M891319L769646L964997M874954N870056L480415
874.7E82766876K666702K678643K674331J976471K80075J056023P24831J10130p98378
$$ y = [591672859, 589894638, 589599724, 589334145, 589444237, 589546928, 589430618, 589216042, 589678879, 590838089, 590365181, 589883499, 588561668, 587639236, 587337456, 586145592, 584525032, 582693024, 581853905, 580792885, 580840416, 580239182, 579027061, 578501892, 576997490, 576177597, 574220924, 572439880, 571170959, 569847908, 569404984, 568208771, 567446098, 566283226, 564226646, 561981087, 560052452, 558146591, 556155167, 554385757, 552353172, 550625229, 548334732, 545711975, 542183990, 539331284, 537486610, 534117126, 531574211, 530225449, 529803734, 531482697, 535474663, 539356918, 541877594, 545853615, 550574837, 555915489, 560806808, 564576454, 568541451, 573416405, 579286461, 582766876, 585433578, 588112221, 590786552, 592763023, 593043098, 594099121, 594823952, 594934082, 594135704]
883.4E94135704q80775j645699l030662l016778k634811j690369k461967k611885k850189
892.1E73312569k754822k793846k873192j722794k992782k892990j946106j475907
899.8E53860130j513557k193985j909218k744827k474900k412185l346405l861160
907.5E33403893m307175l913117m133529m277077l998413m869042n453414m800911
915.2D97651215n101929n735626n179406m021682l660469l530922k433090j406899
922.9D66581192r04312q97179j001816k58522O39191J30196l8452L05862K01721J180725
932.6D65938606J820908J312256J205024J323624J661606K178574K470626K064362
940.3D79975586J233215J554642J898956K191811J883812P84798M36782o82830j635094
$$ y = [594135704, 593254929, 591609230, 588578568, 585561790, 582926979, 581236610, 578774643, 576162758, 573312569, 570557747, 567763901, 564890709, 563167915, 560175133, 557282143, 555336037, 553860130, 552346573, 550152588, 548243370, 545498543, 543023643, 540611458, 537265053, 533403893, 529096718, 525183601, 521050072, 516772995, 512774582, 507905540, 502452126, 497651215, 492549286, 486813660, 481634254, 477612572, 473952103, 470421181, 467988091, 466581192, 465676880, 464779701, 463777885, 463519363, 464158554, 464288750, 464250298, 464556160, 464757881, 465938606, 467759514, 469071770, 470276794, 471600418, 473262024, 475440598, 477911224, 479975586, 481208801, 482763443, 484662399, 486854210, 488738022, 489522820, 489959602, 489276772, 487641678]
949D87641678k550507l254394l956299m511528m368057n543938n907135n869484o052208
957.7D45628128n918693p262116p399597o545487o986770p405243p384834p064019
965.4C89661369p940063p853241q108788q905754p928276q909378q280754q443375
973.1C23291740r386558r382668r930267q468742r024659q184986q214206q044587
980.8B52655067p226066p359505n605430o351338m281521m463196m378013k816162
988.5B10173836l001862j662082l220826k352771k093888p05127J46541o37531l87192
997.2A96259098j242256N17788o59447J39065J06106n86701L15972p00856J870j328907
1006.8A92821732p3929p89738j243038q82225j447544N55458j258946o65340r87797
$$ y = [487641678, 485091171, 481836777, 477880478, 473368950, 469000893, 463456955, 457549820, 451680336, 445628128, 439709435, 432447319, 425047722, 418502235, 411515465, 404110222, 396725388, 389661369, 381721306, 373868065, 365759277, 356853523, 348925247, 340015869, 331735115, 323291740, 313905182, 304522514, 294592247, 286123505, 277098846, 268913860, 260699654, 252655067, 245429001, 238069496, 232464066, 226112728, 221831207, 217368011, 212989998, 210173836, 207171974, 205509892, 202289066, 199936295, 197842407, 197137280, 197283821, 196646290, 196259098, 195016842, 195534630, 194875183, 195014248, 195120354, 194533653, 194849625, 194148769, 194150639, 192821732, 192747803, 191958065, 190715027, 189832802, 188385258, 188940716, 187681770, 187016430, 186028633]
1015.5A86028633l23219p5417m62017J347580M1905J161270M01573J590156J212178
1024.2A90922642O41670J700478N31730K297383M29325J097374N83763J532402K900982
1032.9B02637749K42119J701355m5586N33237K19956j46580k69070j117744M45080
1041.6B04200516q25062P96318j124687p18918K62680j52092J076889q11634J194744
1050.2B03898754N29308J808205J851616K440357M136811K024745L149376J404343
1058B21243515L306561L371295K782784K981472K576866N137653L078061L702983K330018
1066.6B50511208J750373R12266j144314j299896m495029k999401l510590l557472
1074.4B36167145m404202l651123n42583j380272J288586o3916J205464J381168J417236
$$ y = [186028633, 185705414, 185629997, 185167980, 186515560, 186557465, 187718735, 188120308, 189710464, 190922642, 191564312, 193264790, 193796520, 196093903, 196523228, 197620602, 198204365, 199736767, 202637749, 202879868, 204581223, 204535637, 205068874, 205288830, 205142250, 204873180, 203755436, 204200516, 203375454, 204171772, 203047085, 202328167, 202590847, 202438755, 203515644, 202704010, 203898754, 204428062, 206236267, 208087883, 210528240, 214665051, 216689796, 219839172, 221243515, 224550076, 227921371, 230704155, 233685627, 236262493, 241400146, 244478207, 248181190, 250511208, 252261581, 253173847, 252029533, 250729637, 246234608, 243235207, 239724617, 236167145, 231762943, 228111820, 227569237, 226188965, 227477551, 227413635, 228619099, 230000267, 231417503]
1083B31417503L278408K205925L601723J891308L677387L987694L315620L093853K657795
1091.7B59127216L633290J832790K845745J192570J707115K234039J317883J022358
1099.4B74913006q61263O99749n70717K85911k3098K19460J432533k40383J705265
1108.1B77560463J331825K519551J970596K481422L400231J439361K817631K693996
1115.8B96215076K833214J539803J719074J615429J183147J682873M32797J297969
1123.5C08519382M50650J767940J677304J200122J739483J259384K339249R96723K584515
1132.2C22534752J583824J249390K195320K13241N70717r89418r74235j939392k263337
1140.9C22180862k281494k790165j797752l895874k852345k515010k233773k549877
$$ y = [231417503, 234695911, 236901836, 240503559, 242394867, 246072254, 250059948, 253375568, 256469421, 259127216, 262760506, 264593296, 267439041, 268631611, 270338726, 272572765, 273890648, 274913006, 274051743, 274751492, 274180775, 274466686, 274443588, 274663048, 276095581, 275855198, 277560463, 278892288, 281411839, 283382435, 285863857, 289264088, 290703449, 293521080, 296215076, 299048290, 300588093, 302307167, 303922596, 305105743, 306788616, 307221413, 308519382, 308970032, 310737972, 312415276, 313615398, 315354881, 316614265, 318953514, 319950237, 322534752, 324118576, 325367966, 327563286, 327776527, 328347244, 327357826, 326383591, 324444199, 322180862, 319899368, 317109203, 315311451, 311415577, 308563232, 306048222, 303814449, 301264572]
1148.6C01264572k289886p61624j800384L67870q85754q32901K91272K62012N59330
1157.3B96174507J33095J999760J627025L539334L180313K465591L599873L663940
1165C16383438N411987N504761O293068N780182O403046O831932P054367P758026P506790
1173.7C74927597Q362656O456794O419182O700554O093331O052475N347976N539284
1181.4D25899849N907631O319008N273208M711571L866081L259735L745385L292808
1189.1D62275276K893143J796226O99349P93495J939964J820298R35668O35071j20353
1197.8D73668137K84729K75459n40848o09817L51104R30596j31378M32205J300392
1206.5D75960579J173019J312523J256943J353531J327514J364213J175079O65283
$$ y = [301264572, 298974686, 298213062, 296412678, 296780548, 295894794, 295061893, 295353165, 295615177, 296174507, 296307602, 298307362, 299934387, 303473721, 306654034, 309119625, 312719498, 316383438, 321795425, 327300186, 333593254, 339373436, 345776482, 352608414, 359662781, 367420807, 374927597, 383290253, 389747047, 396166229, 402866783, 408960114, 415012589, 420360565, 425899849, 431807480, 438126488, 443399696, 448111267, 451977348, 455237083, 458982468, 462275276, 465168419, 466964645, 467663994, 468457489, 470397453, 472217751, 473153419, 473788490, 473668137, 473952866, 474228325, 473687477, 473077660, 473428764, 474359360, 474227982, 474660187, 475960579, 477133598, 478446121, 479703064, 481056595, 482384109, 483748322, 484923401, 485588684]
1214.2D85588684R72443J424217J222877J378441J131783N07469J66740k74276k48223
1222.9D91870155r8724p19528j604882r97505q22067j737633r81865k73475r28345
1231.5D83706131j225052j240883j157455r71222j107865j093711q18367m55170j32866
1240.2D75503540m69780j24397M75464n01061l73573K27470j77307K6055O10237R71145
1249.9D76167793P30477Q11157R68857R90982P26623J52245J15585O9657J48353K02294
1259.5D81084023M24537N01175K37312M51851O85768Q84934J099434J338272R17320
1268.2D87624626M76227Q39539J229820J097641P17125P08427Q75054R98764K72445
1276.9D94839668o1874j73226k78358j1520l34053q1368j47591j25885O18325Q70514
$$ y = [485588684, 486561127, 487985344, 489208221, 490586662, 491718445, 492225914, 492392654, 492118378, 491870155, 491771431, 491051903, 489447021, 488449516, 487627449, 485889816, 484907951, 484634476, 483706131, 482481079, 481240196, 480082741, 479111519, 478003654, 476909943, 476091576, 475636406, 475503540, 475033760, 474909363, 475384827, 474883766, 474510193, 474737663, 474560356, 474586411, 475196648, 476167793, 476898270, 477709427, 478678284, 479669266, 480395889, 480548134, 480663719, 480733376, 480881729, 481084023, 481508560, 482009735, 482247047, 482698898, 483384666, 484269600, 485369034, 486707306, 487624626, 488100853, 488940392, 490170212, 491267853, 491984978, 492693405, 493568459, 494567223, 494839668, 494777794, 494604568, 494326210, 494314690, 493980637, 493899269, 493751678, 493625793, 494244118, 495114632]
1286.5D95114632O60934J43128j59340n37339o45828r70955r81292o95076n84641m40674
1296.2D90903549o47430o61926j090889j098443j071815j683502k022705j184464m31938
1304.8D81010437j875305k060394j552163j483764q11653j049653r97772j064567j074562
1313.5D69040604j135903j887245j740303j491318r77859p42836r53331p14989o10504
1322.2D58786316m64363j002121j354866j539040k067451k035065k025833k014809
1329.9D46282768j928253j743050j746368j311569j075707j468467l51563k74238m24004
1338.6D35959549k75002r81216j069984p96471M11606N31425N47676O31600Q20923
1347.3D35780106N13267l28293k89116o41517K32277j40343j24779L98903n41534m2839
$$ y = [495114632, 495775566, 495918694, 495759354, 495222015, 494576187, 493605232, 492623940, 491928864, 491344223, 490903549, 490256119, 489594193, 488503304, 487404861, 486333046, 484649544, 482626839, 481442375, 481010437, 479135132, 477074738, 475522575, 474038811, 473227158, 472177505, 471179733, 470115166, 469040604, 467904701, 466017456, 464277153, 462785835, 461807976, 461065140, 460111809, 459396820, 458786316, 458321953, 457319832, 455964966, 454425926, 452358475, 450323410, 448297577, 446282768, 444354515, 442611465, 440865097, 439553528, 438477821, 437009354, 436657791, 436383553, 435959549, 435684547, 434703331, 433633347, 432836876, 433248482, 433779907, 434327583, 434959183, 435780106, 436293373, 435965080, 435675964, 435034447, 435266724, 435126381, 435001602, 435400505, 434858971, 434816132]
1356.9D34816132l90854m37317m62914k34375L0289j72691n88112j387635j58309n69497
1366.6D30444717q4343N58396m01154p8582l05253N90477O89927J026687L80058q0795
1376.2D32740135Q25157O77605J112900L34358M99420M78134O98052Q21266N31311
1384.9D38718338K351151K594947K128640N95588J279412J505241N80559P41806P98225
1393.6D51293907R45168j290207j213036j160774k18353n68581k323913p89757j026383
1402.2D43648071n90400m38385j101532k202530j773224q46100j638794p54547o73332
1410.9D33629227o19660p02972j133919l26309l15399M37889k46735J479492R6093
1419.6D32297707k431984L8795p8430K209969O99844J373N20859K48260J246758P04651
$$ y = [434816132, 434425278, 433987961, 433525047, 433290672, 433320961, 433148270, 432560158, 431172523, 431014214, 430444717, 430360374, 430918770, 430517616, 430439034, 430133781, 430724258, 431414185, 432440872, 432820930, 432740135, 433565292, 434242897, 435355797, 435690155, 436189575, 436667709, 437365761, 438187027, 438718338, 441069489, 443664436, 445793076, 446388664, 447668076, 449173317, 449753876, 450495682, 451293907, 452239075, 450948868, 449735832, 448575058, 448356705, 447788124, 445464211, 444674454, 443648071, 443057671, 442619286, 441517754, 439315224, 437542000, 436695900, 435057106, 434302559, 433629227, 433009567, 432306595, 431172676, 430846367, 430530968, 430968857, 430722122, 432201614, 432297707, 429865723, 429904518, 429826088, 432036057, 432735901, 432737274, 433258133, 433506393, 434753151, 435457802]
1429.2D35457802J316185m80957M23889Q15811O90193J807442J848297J888466j751404
1437.9D42015724M96292K32506N22461L64533M8561J123619l26042J028747Q18405
1446.6D46324806J278458j18332j279564k3460j003991J96877j168556P07626J223030
1455.3D46136894Q59795J850014l902016J263657j697999J553574J229324J497345
1463D48790588K914009J893540K912559L72467L230019K878838M409828N299301N291519
1471.7D77992668J0126000K680168N285568L187675N654946L574333K610168M712220
1479.4E15823746L516311N299645K571869L340530L335381L308906M328575K662087
1487.1E44187050M550781K479553M197388j37215m501J704636J362838K917595K249947
$$ y = [435457802, 436773987, 436293030, 436716919, 437532730, 438222923, 440030365, 441878662, 443767128, 442015724, 442512016, 442744522, 443266983, 443631516, 443680077, 444803696, 444477654, 445506401, 446324806, 447603264, 447484932, 446205368, 446181908, 445177917, 445374794, 444206238, 444913864, 446136894, 446996689, 448846703, 444944687, 446208344, 444510345, 446063919, 447293243, 448790588, 451704597, 453598137, 456510696, 456883163, 460113182, 462992020, 467401848, 472701149, 477992668, 488118668, 490798836, 496084404, 499272079, 504927025, 508501358, 511111526, 515823746, 519340057, 524639702, 527211571, 530552101, 533887482, 537196388, 541524963, 544187050, 548737831, 551217384, 555414772, 555277557, 555273056, 556977692, 558340530, 561258125, 563508072]
1495.8E63508072K134552J73836J532859R4071p9498J151695m01879J189347K005119
1504.5E71308174N433769Q030091n535088j470680k305412j176758j236534k0981r57794
1513.1E72068787P23152J669159J461601M174004l521576O55174K801857M004516L088723
1521.8E87125397l874512o68640R6207L60794J76429J662255K5558j680260M46740
1530.5E83669968R83238K097549J011772j600341r88312n20020J330338K498588M638367
1539.2E93121147j276588J370659L67698j415405P95059K49596k906304j542511j3427
1547.9E88749924J275482K388229j092911k96058J584282J585312J656112n63049J426201
1556.5E96713524L056717L082428R63173p533570n11856o97517j1368J090584K1324
$$ y = [563508072, 565642624, 565816460, 567349319, 567443390, 567363892, 568515587, 568113708, 569303055, 571308174, 576741943, 584772034, 579236946, 577766266, 575460854, 574284096, 573047562, 573026581, 572068787, 572791939, 574461098, 575922699, 580096703, 576575127, 577230301, 580032158, 584036674, 587125397, 583250885, 582582245, 582678452, 583039246, 583215675, 584877930, 584903488, 583223228, 583669968, 584653206, 586750755, 587762527, 586162186, 585173874, 584653854, 585984192, 588482780, 593121147, 591844559, 593215218, 593582916, 592167511, 592962570, 593212166, 590305862, 588763351, 588749924, 590025406, 592413635, 591320724, 591024666, 592608948, 594194260, 595850372, 595287323, 596713524, 599770241, 602852669, 603815842, 596282272, 595770416, 595072899, 595061531, 596152115, 596173439]
1565.2E96173439j514664j024322N73692J627731k375793k960434j645584j165314
1572.9E87688751l77121P34902K170982l921318l363228k172356j637458j692696k504272
1581.6E74926186j831322k516136k084122k342834j693268j756134k206688j428604
1589.3E59067078k416344j911850l247757k331657k176133l338356k676124l330765
1597E37638092k087936k941552j729049k364807k719689k025451l751526k401276k912102
1605.7E14704704k007065l278274k143669k130356m008179j818161l127098j798019
1613.4D94393883k670250q69026L32603n681152j718598k552032q57163k058906J54304
1622.1D78473663O56128l972358j946984j751404K74086k224159j753082j866646j476478
$$ y = [596173439, 594658775, 593634453, 594208145, 595835876, 593460083, 590499649, 588854065, 587688751, 587311630, 588046532, 590217514, 586296196, 582932968, 580760612, 579123154, 577430458, 574926186, 573094864, 570578728, 568494606, 566151772, 564458504, 562702370, 560495682, 559067078, 556650734, 554738884, 551491127, 549159470, 546983337, 543644981, 540968857, 537638092, 535550156, 532608604, 530879555, 528514748, 525795059, 523769608, 520018082, 517616806, 514704704, 512697639, 509419365, 507275696, 505145340, 501137161, 499319000, 496191902, 494393883, 491723633, 490854607, 491187210, 485506058, 483787460, 481235428, 480378265, 478319359, 478473663, 479129791, 475157433, 473210449, 471459045, 471733131, 469508972, 467755890, 465889244, 464412766]
1630.8D64412766p67136j510887J139755P57751K209893l181343j5030k104759j451645
1639.5D59489365R51461m71725J352806k68059J829453K892685J796722K447357j445579
1648.1D68574486L35998j022415K544785K917328J135940K337380m140816J376724
1655.9D74059410K25716J716232J073418J687545K297631J912651L493118K37579J904755
1664.5D88608055J489334K378044K741967L631897N325546N18608L404922J429253
1672.3E09527626K539101L514633M353866K875176J780624L296776L262673N749969
1680E36900444M413681L892746O325455Q854484N055123k051087K938347M146233M934044
1688.6E75409470M304351L434411L602790L997269M676781N445747O809273L975677
$$ y = [464412766, 463645630, 462134743, 463274498, 464032249, 466242142, 463060799, 463045769, 460941010, 459489365, 460440826, 459969101, 461321907, 461053848, 462883301, 465775986, 467572708, 470020065, 468574486, 468910484, 467888069, 470432854, 473350182, 474486122, 476823502, 472682686, 474059410, 474285126, 476001358, 477074776, 478762321, 481059952, 482972603, 486465721, 486703300, 488608055, 490097389, 492475433, 495217400, 498849297, 504174843, 504693451, 508098373, 509527626, 512066727, 515581360, 519935226, 522810402, 524591026, 527887802, 531150475, 536900444, 541314125, 545206871, 551532326, 560386810, 565441933, 563390846, 566329193, 570475426, 575409470, 579713821, 583148232, 586751022, 590748291, 595425072, 600870819, 607680092, 611655769]
1696.4F11655769K608414L429604N017051M279251j726989K479934K562638L665161
1704.1F33970833K239723K411499J036377l03383J232948J647721N19714L01132J963196
1712.8F45019760K903595K517853l07007J609955M575882k077866k550888j69143L33175
1721.4F51855316J09177Q03451K75650j23138P60574O77567R60388J442413P49817
1730.1F57511215o76727J761017L971252L511124n145950k496949N39551O43387K208939
1738.8F61826859K091140j888427J142425K702942K404709l68958J065598K506409
1746.5F71482697K564544L243103N48630K413635K624665k44141J671600J978989K756348
1755.2F89040070L661499K510452P68051J573639J895065L561478K581177j88752K629242
$$ y = [611655769, 614264183, 617693787, 622710838, 626990089, 625263100, 627743034, 630305672, 633970833, 636210556, 638622055, 639658432, 639355049, 640587997, 642235718, 642755432, 643056564, 645019760, 647923355, 650441208, 650134201, 651744156, 656320038, 654242172, 651691284, 651522141, 651855316, 651964493, 652767944, 653043594, 652920456, 653681030, 654358597, 655318985, 656761398, 657511215, 656834488, 658595505, 662566757, 666077881, 660931931, 658434982, 658974533, 659617920, 661826859, 663917999, 662029572, 663171997, 665874939, 668279648, 667910690, 668976288, 671482697, 674047241, 677290344, 677838974, 680252609, 682877274, 682633133, 684304733, 686283722, 689040070, 692701569, 695212021, 695980072, 697553711, 699448776, 703010254, 705591431, 705402679, 708031921]
1763.9G08031921K037506J898346K691956L588181J137085M15039L693084L635102
1771.6G27128220Q49075k997894Q68606J637421j87378J128387J160050J973419J601868
1780.3G33161774N3253m79660P89184J914750J38168l54767N02777J284027P20673
1788.9G37730179J551895K293320J727676J08109k252198J506043J269226l13110k02408
1797.6G43418732J038360J880341o92520Q76388J86310n81436M03137O35910O29730
1806.3G47794952J46637L63846L97110J579971Q2551l62168l4180l1967J109238r8267
1815.9G50947723P54471K11334j9760O90079J05896Q92944M4480O31866J599350J13526
1825.6G55971909j284028L07312K123337K249985j331635k197570M32129j01090L2120
$$ y = [708031921, 710069427, 711967773, 714659729, 718247910, 719384995, 719800034, 723493118, 727128220, 727977295, 724979401, 725848007, 727485428, 727298050, 728426437, 729586487, 731559906, 733161774, 733215027, 732735367, 733524551, 735439301, 735577469, 735222702, 735725479, 737009506, 737730179, 739282074, 741575394, 743303070, 743411179, 741158981, 742665024, 743934250, 743621140, 743418732, 744457092, 746337433, 745644913, 746521301, 746707611, 746126175, 746529312, 747165222, 747794952, 747941589, 748305435, 748702545, 750282516, 750365067, 750002899, 749968719, 749936752, 751045990, 750947723, 751702194, 751913528, 751893768, 752583847, 752689743, 753582687, 753627167, 754259033, 755858383, 755971909, 754687881, 754995193, 757118530, 759368515, 758036880, 755839310, 756271439, 756170349, 756202469]
1834.3G56202469M12369M22210J155091o51245j49994j56403M89655J165695J534424
1842.9G60424271K840881k687607j238861O16379N98068n64651r63822o3782j05896
1851.6G58854980P87659j34353j62049J96457K30560K41089k365O60401j96076R5825
1861.3G60572128k08969K58560L49884r6893J274185R09424J763687M08554j733169
1869.9G63497391j006241m74396J04447l30124M17099l10364k75574j1291K96020P66754
1879.6G62673721j31073L42484j34888M96979K45438l33252K19421r9945J216431J214065
1889.2G65709381o88934j226349l6774K72217Q29010J238098j024399k33688L3875
1897.9G64872437p1640j2436k7161M02451k79313J63880j47248j16653K26746P99636
$$ y = [756202469, 756614838, 757037048, 758192139, 757540894, 757390900, 757234497, 757724152, 758889847, 760424271, 763265152, 760577545, 759338684, 759955063, 760553131, 759988480, 759024658, 758960876, 758854980, 759642639, 759508286, 759346237, 759542694, 759773254, 760014343, 760011978, 760672379, 760476303, 760572128, 760363159, 760621719, 760971603, 760874710, 762148895, 763058319, 764822006, 765230560, 763497391, 762491150, 762016754, 762121201, 761791077, 762208176, 761897812, 761622238, 761610947, 761906967, 762673721, 762542648, 762885132, 762750244, 763247223, 763492661, 763159409, 763378830, 763278885, 764495316, 765709381, 765020447, 763794098, 763757324, 764029541, 764858551, 766096649, 765072250, 764838562, 764872437, 764800797, 764788361, 764761200, 765163651, 764884338, 765048218, 764900970, 764784317, 765011063, 765810699]
1907.6G65810699P16248o3782l46451j313400M00009M37699k23770j66398O7597J872711
1917.2G67191162J30386j346282m62342L46146J447220N73806j399383j073532M30145
1925.9G65837326r0256l01971j65100K30026K93350l63769L70636Q8119R7351l74145
1935.5G65621567k09732J97754r3537M60663j76392O63376P79648r47418m89731M35257
1945.2G66241455K37351o87485Q39J38626M25720p9574l19977K24304j05972J32141
1954.8G66207428l38821l281R8419L06244K26212k18811L57894p5607J80740k39181
1964.5G66501236K90451R57489j28555o69937o19736M09241j39161o5536L82614K67639
1974.1G67185745J32981o78559Q6289o6605j76468k27127j60980R0256n4779O77642
$$ y = [765810699, 766526947, 766463165, 766116714, 764803314, 765203323, 765641022, 765417252, 765250854, 765318451, 767191162, 767321548, 765975266, 765512924, 765859070, 767306290, 767880096, 766480713, 765407181, 765837326, 765747070, 765445099, 765279999, 765510025, 765803375, 765439606, 765810242, 765898361, 765995712, 765621567, 765411835, 765609589, 765516052, 765976715, 765800323, 766463699, 767243347, 766295929, 765806198, 766241455, 766478806, 765791321, 765792160, 765930786, 766356506, 766276932, 765956955, 766181259, 766075287, 766207428, 765868607, 765865326, 765963745, 766269989, 766496201, 766277390, 766635284, 766559677, 766740417, 766501236, 766791687, 767749176, 767620621, 766950684, 766330948, 766740189, 766601028, 766535492, 766918106, 767185745, 767318726, 766640167, 766726456, 766659851, 766483383, 766256256, 766095276, 766185532, 766130753, 766808395]
1983.7G66808395Q7052K5329k9525L93066M23126q04901K56729P96433j73416r26972
1993.4G66855316k85492l27453j94855L89633J85547L40042m43573j26038o0806k18201
2003G66114120m6920m43497o8054k81449J27869p6370q7433k94571n58548M87671k05765
2013.6G64667053l17611J84783M81720k67486l91541J10474p89413k39029p5379O7902
2023.3G63431473j69525j20469M3793q98895k16370K9908R689m86374j70593J87988
2032.9G61640625n24750k18582k73285K02561j02005l968r5672k18201K43912q23746
2042.6G59826889j63727j12533j13831k40250l72543K72980n33295K07672M53034p706
2052.2G59216690l65677j5259L89481n25665j85013j83716K86408M4555k69851K01339
$$ y = [766808395, 766895447, 766920776, 766891251, 767284317, 767707443, 766902542, 767159271, 767955704, 767782288, 766855316, 766569824, 766242371, 766047516, 766437149, 766622696, 766962738, 766519165, 766393127, 766332321, 766114120, 766067200, 765623703, 765555649, 765274200, 765402069, 765325699, 765238266, 764943695, 764385147, 764872818, 764667053, 764349442, 764534225, 765015945, 764748459, 764356918, 764467392, 763677979, 763438950, 763363571, 763431473, 763261948, 763141479, 763185272, 762286377, 762070007, 762099915, 762109604, 761623230, 761452637, 761640625, 761115875, 760897293, 760624008, 760826569, 760724564, 760720596, 760624924, 760406723, 760650635, 759826889, 759663162, 759550629, 759436798, 759196548, 758824005, 759096985, 758563690, 758771362, 759224396, 759216690, 758851013, 758835754, 759225235, 758699570, 758514557, 758330841, 758617249, 758661804, 758391953, 758593292]
2061.9G58593292J29624O38809q1635l84445m42352r2774K02408k36969O7978J69983
2071.5G58563919L87650j63041L58277M94995o1188J59912l26614j75324n26123k12020
2081.1G58500443M5700r0943K49787L58352L53928k91672L05176J80511P9804j43738
2090.8G59547348r17587l35617l44849L37677N26505M89883K80228j55869K08588j2894
2100.4G59623413K67563k59628l03955K8305p1412R1553o8969J21154l8833M72107
2110.1G59861298L32870P3013K04010j83868j28784l12805j37711k64206J13678k0981
2119.7G59536514k74353L12348K42309L05939j52435J54190r3384l14255o4010m28772
2129.4G59224091J2741j42365K15302J26571M47922O65360k2583J45874n02243k47727
$$ y = [758593292, 758722916, 759361725, 759280090, 758895645, 758453293, 758360519, 758562927, 758325958, 758393936, 758563919, 758951569, 758788528, 759146805, 759641800, 759580612, 759740524, 759413910, 759238586, 758712463, 758500443, 758546143, 758455200, 758704987, 759063339, 759417267, 759125595, 759430771, 759611282, 759691086, 759547348, 758629761, 758294144, 757949295, 758286972, 758813477, 759303360, 759583588, 759427719, 759636307, 759623413, 759890976, 759631348, 759327393, 759355698, 759284286, 759375839, 759306870, 759428024, 759389191, 759861298, 760194168, 760267181, 760471191, 760287323, 760158539, 759845734, 759708023, 759443817, 759557495, 759536514, 759262161, 759574509, 759816818, 760122757, 759970322, 760124512, 760031128, 759716873, 759652863, 759224091, 759236832, 759094467, 759309769, 759436340, 759884262, 760549622, 760527039, 760672913, 760170670, 759922943]
2139G59922943k63443l6697K69241M1199M41360r9334Q9950J06888K65579J56784o6681
2149.6G60827789O6223l20510l0213n03082j95007r6894K64893O13403j73187K06909
2159.3G60660324r0713K70767J58539P9116K12861l12653M90570M13818M46244p8888
2168.9G62249985k46887J98059Q9645K03476l76129K24533N99060N41534R9488j37863
2178.5G63444901L69567J50147K20566k73590k8992K01340J93786L26233K89993M77372
2188.2G65371323k07444K91214K52610L1356K82898J38626K1210n49774J54800J10779
2197.8G65897598r613J72882J85929K46811q4687M68674K73056K39029j68915j30615
2207.5G67090149O5231l62777K91442J26419O23856N24902K06223L07999J67694R0484
$$ y = [759922943, 759659500, 759622803, 759892044, 759933243, 760374603, 760275269, 760365219, 760472107, 760737686, 760894470, 760827789, 760894012, 760573502, 760543289, 760040207, 759845200, 759748306, 760013199, 760626602, 760453415, 760660324, 760569611, 760840378, 760998917, 761078033, 761290894, 760978241, 761468811, 761882629, 762328873, 762249985, 762003098, 762201157, 762290802, 762494278, 762118149, 762342682, 762941742, 763483276, 763582764, 763444901, 763814468, 763964615, 764185181, 763911591, 763882599, 764083939, 764277725, 764603958, 764893951, 765371323, 765163879, 765455093, 765707703, 765739059, 766021957, 766160583, 766181793, 765632019, 765786819, 765897598, 765887985, 766060867, 766246796, 766493607, 766408920, 766877594, 767150650, 767389679, 767220764, 767090149, 767155380, 766792603, 767084045, 767210464, 767834320, 768359222, 768565445, 768873444, 769041138, 769131622]
2217.1G69131622o94732j297l42255j78604L78418j1978M09546J04293M35410K33078
2226.8G69463501L51028J24665l17078k060l71170Q3389k13241J43127J64719Q5220
2236.4G69512100M44870P0877M73557l43399r0943J8616k29645J6175m50364J45264
2246G69567108R6436M20990K12707j45492L23867K93274M1352l39737q1253m08097
2255.7G69981155J71128P1106k84424M02298P5302K48260P5684N20325K40783k49939
2265.3G71251678j1673n37033n3939J78451L37601m2572l0365r4757k57950N15442
2275G71254883Q5602J32217l30276n36499l21732P0801L77655l21884L26461Q8883
2284.6G70826111J36185O4163k07443L97720M196R3002l68271J33286M01382R5826
$$ y = [769131622, 768436890, 768435593, 768093338, 767914734, 768293152, 768281174, 768690720, 768795013, 769230423, 769463501, 769814529, 769939194, 769622116, 769620056, 769248886, 769332275, 769119034, 769262161, 769426880, 769512100, 769956970, 770027847, 770501404, 770158005, 770067062, 770085678, 769856033, 769872208, 769421844, 769567108, 769663544, 770084534, 770297241, 770151749, 770475616, 770768890, 770810242, 770470505, 770389252, 769981155, 770152283, 770223389, 769938965, 770341263, 770416565, 770664825, 770740509, 771260834, 771501617, 771251678, 771240005, 770702972, 770649033, 770827484, 771165085, 771122513, 771092148, 770997391, 770739441, 771254883, 771340485, 771472702, 771142426, 770605927, 770284195, 770354996, 770732651, 770410767, 770737228, 770826111, 770962296, 771026459, 770819016, 771216736, 771220932, 771313934, 770945663, 771078949, 771480331, 771576157]
2294.3G71576157J64489m87518Q9264J63727K24457L3874M0054J63651k78244N4016
2303.9G71743927n7373N65872L83148J80970K64511j49384j40152n44510j36413k14920
2313.5G71895676L39203K96478N77392N88990q44498P27234R76486P07550K92969n10483
2323.2G75046997p22046j023865L80478k96554J28860J192627R45587l60489j138687
2331.9G74152908K57950l96728J94549N89676J6937m00009l76434J15585o7367K17132
2341.5G74304199K60468R97085o02188j435852j117859j493835j113510l51029J003418
2350.2G70450897N57099J395721R63745j103897M6692n74036r5749q26797J087799
2358.9G71901474J625824N16891l80020k093658P47452j226349K38571J119080j092072
$$ y = [771576157, 771740646, 771253128, 771342392, 771506119, 771730576, 771764450, 771804504, 771968155, 771689911, 771743927, 771686554, 772252426, 772635574, 772816544, 773081055, 772931671, 772791519, 772247009, 772110596, 771895676, 772234879, 772531357, 773108749, 773697739, 772853241, 773580475, 774556961, 775264511, 775557480, 775046997, 774324951, 773301086, 773681564, 773385010, 773513870, 774706497, 775652084, 775291595, 774152908, 774410858, 774014130, 774208679, 774798355, 774815292, 774415283, 774038849, 774154434, 774087067, 774304199, 774564667, 775561752, 774959564, 773523712, 772405853, 770912018, 769798508, 769447479, 770450897, 771007996, 772403717, 773367462, 772263565, 772310257, 771736221, 771640472, 770813675, 771901474, 773527298, 774044189, 773664169, 771570511, 772317963, 771091614, 771330185, 772449265, 771357193]
2367.6G71357193j212616j486587q8120j088028m30679l39585q25729l75443m22134
2376.2G65088272k23846r04389k84271n04761p59048o42548o22635k72827p81937m51736
2385.9G59640274j98364J0605l29743l05176Q6594m51660l8529m21600o58264m78592
2395.5G56855545q1634J39389k42386L54232o4163n60989l83682R8419l91998p46308
2405.2G54976425k1057j96152L03421l32489p55005k54745j50909K51617k37122l90014
2414.8G53193970o23474l41645m63333p71789l32489n68772j45569n8212K6932j19476
2424.5G49796143k24381j48010n31616m07715o08521j70059m58984p77970m66842p10984
2434.1G45291061m07104k46353n7221l16848k75879l09296l06168o3705p48901n69077
$$ y = [771357193, 770144577, 768657990, 768569870, 767481842, 767051163, 766711578, 765885849, 765510406, 765088272, 764864426, 763960037, 763675766, 763171005, 762411957, 761769409, 761146774, 760873947, 760092010, 759640274, 759441910, 759452515, 759122772, 758817596, 758904190, 758452530, 758414001, 757992401, 757334137, 756855545, 756773911, 756913300, 756670914, 757025146, 756960983, 756399994, 756016312, 756114731, 755722733, 754976425, 754955368, 754759216, 755062637, 754730148, 753975143, 753720398, 753569489, 753821106, 753583984, 753193970, 752570496, 752228851, 751765518, 750993729, 750661240, 750092468, 749946899, 749888687, 749915619, 749796143, 749571762, 749423752, 748892136, 748484421, 747875900, 747705841, 747246857, 746468887, 746002045, 745291061, 744883957, 744637604, 744580383, 744263535, 743987656, 743678360, 743372192, 743308487, 742559586, 741990509]
2443.7G41990509k38037j71967n46417l30810m2191n54428q1940k99911o15311o69098
2453.4G38440399k96173j29547o11038k77481k42615J2894l49427q11691o45447l74527
2463G34715347j53122p36541n87540r8114J06430l64761l75595O4392j98899k40020
2472.7G32131577o19202m54483o04248p14798j86463j22833k31018l95660N0964k74811
2482.3G28579025n17959m67835n61371n57861p05109j32675j78985K2430m2114L8070
2492G25475616K07139n67322l23715m12369m17023o77643n25665k17362m89044J56784
2501.6G22209396l17993j86004q6518l65906q5144j40228J79749n65110q33435p04574
2511.2G19104233l75061Q0719j93711P4234r231N8975Q850L8223j00708j001205j069565
$$ y = [741990509, 741752472, 741580505, 741034088, 740703278, 740661087, 740106659, 740024719, 739724808, 739109497, 738440399, 738144226, 738014679, 737403641, 737126160, 736883545, 736896439, 736547012, 735735321, 735089874, 734715347, 734562225, 733825684, 733238144, 733140030, 733246460, 732881699, 732506104, 732570496, 732371597, 732131577, 731512375, 731057892, 730453644, 729738846, 729552383, 729429550, 729198532, 728802872, 728853836, 728579025, 728061066, 727593231, 727031860, 726473999, 725768890, 725636215, 725457230, 725479660, 725437546, 725475616, 725682755, 725115433, 724791718, 724379349, 723962326, 723284683, 722759018, 722541656, 722052612, 722209396, 721891403, 721705399, 721618881, 721252975, 721167831, 721027603, 721207352, 720642242, 719808807, 719104233, 718729172, 718809891, 718616180, 718690414, 718681183, 718740158, 718749008, 718787231, 718686523, 717685318, 716615753]
2521.9G16615753j82113J12457r20029r13315l19366L90549N36575n09796m96369p7667
2531.5G14236679j97525r30710o47659l63541n25741J48468k27280n02701l61862j76620
2541.1G10451508j39237m15192o56204m81720J6861o06613m26178l27530o60019k79617
2550.8G06476059L2654L89557k70768m98352n52673o38351n12391p85675m75540l24402
2560.4G02840118j22985k12708l45383n36117n22690k8305j36871k90986r28039r67331
2570.1F98748703m70810K5635K44064j20315l66364r07898l49579j89132l78571j48087
2579.7F96087646m53033k77710l42331k59781m14428k36359j20392q02841m38690l205
2589.4F92738876n04379j063232j22605k8076o36902j83182l76815k41852j12152k97394
$$ y = [716615753, 716433640, 716546097, 715626068, 714712753, 714393387, 714783936, 715320511, 714810715, 714314346, 714236679, 714039154, 713108444, 712460785, 712097244, 711571503, 711719971, 711492691, 710989990, 710628128, 710451508, 710312271, 709897079, 709240875, 708759155, 708776016, 708169403, 707743225, 707415695, 706755676, 706476059, 706508713, 706898270, 706627502, 706129150, 705576477, 704938126, 704425735, 703640060, 703164520, 702840118, 702717133, 702504425, 702159042, 701622925, 701100235, 701071930, 700935059, 700644073, 699716034, 698748703, 698277893, 698303528, 698547592, 698427277, 698060913, 697153015, 696803436, 696614304, 696235733, 696087646, 695634613, 695356903, 695014572, 694754791, 694340363, 694104004, 693983612, 693180771, 692742081, 692738876, 692234497, 691171265, 691048660, 691020584, 690383682, 690200500, 689823685, 689581833, 689469681, 689172287]
2599F89172287n64346m98963l66440k66952J4648q25729o33545m6158M8218P5760o24161
2609.6F85484619q38547n29861l20053o99158l44314m19465r01489k13089j45798n01632
2619.3F80571213o16532j16424m16947q57544p51953q05130n60760j143952n27343
2627.9F74774628j46942r09729n86701j20315n6611n91888o30646r99908j049042n57938
2637.6F69124908q85925p73468n65109l82767l95508l80325m79813j62277j12152j144104
2647.2F63843460r41238q26874r65271p20062m59137m37088o76270m13589l35160j80664
2656.9F57888107q04977o87027j91879q79212q58230j021119q23593o65283m48456
2665.5F51508331Q4839p7286p9269n36499p50504n30242l96424p83157j049652o36902
$$ y = [689172287, 688607941, 688108978, 687742538, 687475586, 687490234, 686664505, 686030960, 685984802, 686033020, 686108780, 685484619, 684646072, 684116211, 683796158, 683097000, 682752686, 682333221, 681431732, 681218643, 681072845, 680571213, 679954681, 679838257, 679421310, 678563766, 677811813, 677006683, 676445923, 675301971, 674774628, 674627686, 673717957, 673131256, 673010941, 672954330, 672362442, 671731796, 670731888, 669682846, 669124908, 668238983, 667465515, 666900406, 666517639, 666122131, 665741806, 665261993, 665099716, 664987564, 663843460, 662902222, 662075348, 661110077, 660390015, 659930878, 659493790, 658817520, 658403931, 658068771, 657888107, 657083130, 656396103, 656204224, 655325012, 654466782, 653445663, 652622070, 651956787, 651508331, 651593170, 651515884, 651436615, 650900116, 650149612, 649619370, 649222946, 648439789, 647390137, 646753235]
2675.2F46753235m04205j9989l76206o63223m89044n64957n43442k90069k64054p00302
2684.8F42437744n33752p46994p48062l86811l41301k99835o48079n93071n45997n3673
2694.5F37540169l63045j074982p50694r10263l60718J32599k10190n87845l09257
2703.1F33105774j26381p22313o35796o63299q19550q12835m47502p63550j122246
2711.8F26992302l45154l01781j17263n58358q36753l30201l23524j48010m65889m94767
2721.5F23070602p01599q59489n76058k62718J8387n32417o38771m60091l60603o71845
2731.1F18025398o75125k82287m45786l33862m57382j19019l80554o92940J61247j50680
2740.8F14649010p49131o17752l53851o24580m33388K31476j27335m75006j88370n03044
$$ y = [646753235, 646349030, 646329041, 645952835, 645289612, 644800568, 644235611, 643692169, 643402100, 643138046, 642437744, 641903992, 641156998, 640408936, 640022125, 639680824, 639380989, 638732910, 638139839, 637593842, 637540169, 637177124, 636102142, 635351448, 634441185, 634080467, 634213066, 634002876, 633415031, 633105774, 632979393, 632257080, 631621284, 630957985, 630138435, 629325600, 628878098, 628114548, 626992302, 626647148, 626345367, 626228104, 625669746, 624832993, 624502792, 624179268, 624031258, 623565369, 623070602, 622369003, 621509514, 620933456, 620670738, 620689125, 620156708, 619517937, 619057846, 618697243, 618025398, 617350273, 617067986, 616622200, 616288338, 615830956, 615711937, 615331383, 614638443, 614799690, 614649010, 613899879, 613282127, 612928276, 612303696, 611870308, 612101784, 611974449, 611499443, 611311073, 610808029]
2750.4F10808029r56611k21749n87272j064644j11809K26097j73492o53344l06587
2759.1F06958618l47404n10674k19383j03073l78227j092492m53720j18179n02167
2767.8F03233299n76782K7237N76820l59497n38902o80122p55310n25437p75223p09610
2777.4E98916473p44705p17125q56781j63040K2316m38728j75019n39703r20677r69620
2787E93413391k90947m74090j055336n86434p09114p23915m65279n41420r86328m33655
2796.7E87146873k67372j338043j430893j188659o01273r74350j419182o15425o90613
2805.4E78621063o47774j09977p26280j599274j161995j016808j034317q57505j362992
2814E70104141j580734j218529l21159n28450j039124j143875j879654j661796r75228
$$ y = [610808029, 609851418, 609629669, 609042397, 607977753, 607865944, 608092041, 607918549, 607265205, 606958618, 606611214, 606100540, 605881157, 605778084, 605399857, 604307365, 603853645, 603735466, 603233299, 602656517, 602683754, 603260574, 602901077, 602362175, 601682053, 600926743, 600401306, 599626083, 598916473, 598171768, 597454643, 596597862, 596434822, 596457138, 596018410, 595843391, 595303688, 594383011, 593413391, 593122444, 592648354, 591593018, 591006584, 590297470, 589573555, 589108276, 588566856, 587580528, 587146873, 586879501, 585541458, 584110565, 582921906, 582320633, 581346283, 579927101, 579311676, 578621063, 577973289, 577863312, 577137032, 575537758, 574375763, 573358955, 572324638, 571467133, 570104141, 568523407, 567304878, 566983719, 566455269, 565416145, 564272270, 562392616, 560730820, 559755592]
2822.7E59755592j092529j426239j131630j429672j541290q72841j119500j447181
2830.4E49694710j663513j103630r68323j633606j832581k156753j813660j540832
2838.2E36981812j308213j503677k162209k187385k404824k510147k398796k235679
2845.9E20270882k449646k654076k884750k850800k251358k320862j926765j303559
2853.6E01629066r27619r48983j153640j129113j143646n96619q74824j131706j351662
2862.3D92371254j429138q84323j431961j341019j436920k456742k824630k237549
2870D78328972j662598k079353k159805k127228j877327j697121j840744j979866k337036
2878.7D60567894j861191j523933j949043j980629j040459q15125j252823p41958o82640
$$ y = [559755592, 558663063, 557236824, 556105194, 554675522, 553134232, 552261391, 551141891, 549694710, 548031197, 546927567, 545959244, 544325638, 542493057, 540336304, 538522644, 536981812, 535673599, 534169922, 532007713, 529820328, 527415504, 524905357, 522506561, 520270882, 517821236, 515167160, 512282410, 509431610, 507180252, 504859390, 502932625, 501629066, 500701447, 499752464, 498598824, 497469711, 496326065, 495729446, 494854622, 493722916, 492371254, 490942116, 490057793, 488625832, 487284813, 485847893, 483391151, 480566521, 478328972, 476666374, 474587021, 472427216, 470299988, 468422661, 466725540, 464884796, 462904930, 460567894, 458706703, 457182770, 455233727, 453253098, 452212639, 451397514, 450144691, 449402733, 448720093]
2887.3D48720093p86667o75316n57327n45807n69954m13933n09758m88586o05850k58484
2897D43308411n20172p52259k00920n89867o26182p47223o34346p89566j272316p98073
2906.6D36377487q87985p37991j063462j775245j901703j642075j325569k009773k118874
2915.3D22914810k249069k421799k088241k394638k266579j605339j405678j598167
2923D06885300j141930j262855j529160o08521p3509J7891n3673L74070N51529M46205
2932.7D03605347R89952J356010J760292J870880J726532J759034K215232K450180
2940.4D17733459K268639K765732L077583K632141K301598K708092K638282K250863
2948.1D38376389K604789K534561K521935K710304K201958J903343K152901K518463
$$ y = [448720093, 447933426, 447258110, 446700783, 446154976, 445585022, 445171089, 444661331, 444172745, 443566895, 443308411, 442788239, 442035980, 441835060, 441245193, 440619011, 439871788, 439237442, 438447876, 437175560, 436377487, 435489502, 434751511, 433688049, 431912804, 430011101, 428369026, 427043457, 425033684, 422914810, 420665741, 418243942, 416155701, 413761063, 411494484, 409889145, 408483467, 406885300, 405743370, 404480515, 402951355, 402342834, 402269325, 402287216, 402233543, 402607613, 403159142, 403605347, 404595299, 405951309, 407711601, 409582481, 411309013, 413068047, 415283279, 417733459, 420002098, 422767830, 425845413, 428477554, 430779152, 433487244, 436125526, 438376389, 440981178, 443515739, 446037674, 448747978, 450949936, 452853279, 455006180, 457524643]
2955.8D57524643K660789K259064K278099K507858K354241K209358J985550K019272
2963.5D75798874J962662K330246K393798J942864K191925J918945J800347K157516
2971.2D92497177K426567J994019J556854J918869J622429J703453J776085J679649
2979E07175102J833267J994400K138024J181183Q72459J490669J731911J241264Q52013
2987.6E20510292R23767Q78258J326065J239281R36241P96432N54352L92494L97568
2996.3E27954750K68517k33689L10364K70042m40521j05362O48384J91689o11611N35
3006E28253098l58239k51121q4343r35021n69152j85509l14369j116944q97712m16871
3015.6E23123817n91011n28488j044311r30214r31702j051788p69921m96635j050911
$$ y = [457524643, 460185432, 462444496, 464722595, 467230453, 469584694, 471794052, 473779602, 475798874, 477761536, 480091782, 482485580, 484428444, 486620369, 488539314, 490339661, 492497177, 494923744, 496917763, 498474617, 500393486, 502015915, 503719368, 505495453, 507175102, 509008369, 511002769, 513140793, 514321976, 515194435, 516685104, 518417015, 519658279, 520510292, 521434059, 522312317, 523638382, 524877663, 525813904, 526610336, 527164688, 527557182, 527954750, 528223267, 527989578, 528299942, 528569984, 528129463, 528024101, 528672485, 528864174, 528252563, 528253098, 527894859, 527643738, 527559395, 526624374, 526055222, 525869713, 525555344, 524438400, 523540688, 523123817, 522532806, 522004318, 520960007, 520029793, 519098091, 518046303, 517276382, 516779747, 515728836]
3024.3E15728836j559067q21075r56574p44934p04422j186981j333084j337433q42972
3033E06242294j067009r12208j289520j432038j018486j375007j112557j065216q41141
3041.6D96129112j049766j429520j433258j407013j286621j734619q86116l26538r51271
3050.3D85624390j480294j707000j361466j339874j118164j167374j574859j757279
3058D74118080j164322j069336j504478j019669j334228r97048q07686j170539r64661
3066.7D64086113j672325j565399j360092j218339q40835j229324j605149j615905
3074.4D52978745j012688p38411j082459j091194j006202j438485j335411j466331
3082.1D43807564j755753r59396j129990j405639j026459p71599j176605j554527j211396
$$ y = [515728836, 514169769, 513348694, 512392120, 511647186, 510942764, 509755783, 508422699, 507085266, 506242294, 505175285, 504263077, 502973557, 501541519, 500523033, 499148026, 498035469, 496970253, 496129112, 495079346, 493649826, 492216568, 490809555, 489522934, 487788315, 486902199, 486575661, 485624390, 484144096, 482437096, 481075630, 479735756, 478617592, 477450218, 475875359, 474118080, 472953758, 471884422, 470379944, 469360275, 468026047, 467028999, 466221313, 465050774, 464086113, 462413788, 460848389, 459488297, 458269958, 457429123, 456199799, 454594650, 452978745, 451966057, 451227646, 450145187, 449053993, 448047791, 446609306, 445273895, 443807564, 442051811, 441092415, 439962425, 438556786, 437530327, 436758728, 435582123, 434027596, 432816200]
3090.8D32816200j655159j349716j069221j247292j001701j213265r85946r95255j250267
3099.5D22048378j581421j359215j102523j397553j199875j458816j132088o88896
3107.2D12127991j006279j418267j467208r27086j079293j232490j290932j472854
3114.9D02233582j408005j062699p64236j071587j460609j485558q75587r38721j140251
3123.6C92026329r31663j454964j851349j677589j034203j202278j566696r91135l31612
3132.3C80984840p15141j655502j290741j135559j078606j054153j320229j455841
3140C71279068j718903r30976r39332j224174j002197j152230q54835j083145j382141
3148.7C60991135j390610j013985r05914j240692j076699j067008r39827j117897j441689
$$ y = [432816200, 431161041, 429811325, 428742104, 427494812, 426493111, 425279846, 424293900, 423298645, 422048378, 420466957, 419107742, 418005219, 416607666, 415407791, 413948975, 412816887, 412127991, 411121712, 409703445, 408236237, 407309151, 406229858, 404997368, 403706436, 402233582, 400825577, 399762878, 398998642, 397927055, 396466446, 394980888, 394105301, 393166580, 392026329, 391094666, 389639702, 387788353, 386110764, 385076561, 383874283, 382307587, 381316452, 380984840, 380269699, 378614197, 377323456, 376187897, 375109291, 374055138, 372734909, 371279068, 369560165, 368629189, 367689857, 366465683, 365463486, 364311256, 363456421, 362373276, 360991135, 359600525, 358586540, 357680626, 356439934, 355363235, 354296227, 353356400, 352238503, 350796814]
3157.4C50796814j501274j168938o03523o34155r41506j296692r98764p78160j129150
3166C41744652j217232j130142j063767j064109j091996j057892q11271r88159j004258
3174.7C32315826j275329j411438m95644p28149q60596p25326j150132j069526j089173
3183.4C23510513j147880j061516p08542o69899o52428q56762j341609j004639o93283
3192.1C15373955q55942j143723p39440p00016q55523n58948r06792q17909p72781
3200.8C08022881p10602q56571j216107j072197j003265o39935o98032l47595l63503
3209.4C01115074j179237p59163l60928n10921p79820p82089q21113q50564n31921
3218.1B94539318p83386j418553q94413K51179l79772j232948r30023m75655m76112
$$ y = [350796814, 349295540, 348126602, 347523079, 346888924, 345947418, 344650726, 343651962, 342873802, 341744652, 340527420, 339397278, 338333511, 337269402, 336177406, 335119514, 334308243, 333320084, 332315826, 331040497, 329629059, 329133415, 328405266, 327544670, 326819344, 325669212, 324599686, 323510513, 322362633, 321301117, 320592575, 319922676, 319270248, 318413486, 317071877, 316067238, 315373955, 314518013, 313374290, 312634850, 311934834, 311079311, 310520363, 309613571, 308795662, 308022881, 307312279, 306455708, 305239601, 304167404, 303164139, 302524204, 301826172, 301478577, 301115074, 299935837, 299176674, 298815746, 298304825, 297525005, 296742916, 295921803, 295071239, 294539318, 293755932, 292337379, 291442966, 291694145, 291314373, 290081425, 289151402, 288675747, 288199635]
3226.8B88199635p46975p30439p37228k37160m90284r59129r66358j101246l81336
3235.5B81849480j13163n35107j253223p49855J13754o60629q61893m88415k02045
3244.2B77098904o88782j123924q44975m97913k62356n70602l46413q06294q81004
3252.8B71076641n03940r84231m72126k34794o42243o55975k1782k17590r21307q30383
3262.5B65592270n77011p7858n92556q15335p56778q19378q2245n3520m70295q12054
3272.1B60535240l39241k07939m50478l53145o99234m19216l11432j56002l57590r80186
3281.8B56260777p78142l24764j74579l58506o580K4166j50089o69556q50544j69067
3291.4B52803116p60689p23896j61400j24569j61781o17085p37972o10561l28922l50075
$$ y = [288199635, 287452660, 286722221, 285984993, 285747833, 285257549, 284298420, 283332062, 282230816, 281849480, 281736317, 281201210, 279947987, 279198132, 279311886, 278651257, 277789364, 277300949, 277098904, 276410122, 275286198, 274441223, 273943310, 273680954, 273110352, 272763939, 271957645, 271076641, 270572701, 269588470, 269116344, 268881550, 268239307, 267583332, 267561550, 267343960, 266422653, 265592270, 265015259, 264937401, 264344845, 263529510, 262772732, 261953354, 261871109, 261817589, 261347294, 260535240, 260195999, 259988060, 259537582, 259184437, 258485203, 258065987, 257754555, 257598553, 257240963, 256260777, 255482635, 255157871, 254983292, 254624786, 254618206, 254642372, 254492283, 253822727, 252972183, 252803116, 252042427, 251318531, 251157131, 251032562, 250870781, 250253696, 249515724, 248905163, 248576241, 248226166]
3301B48226166r6970k31476p39097j87588j86634m43115l08495k27089k46410m95072
3310.7B45064220o45809n09662j70956K0294j60866p14168p52545m47979m56600o41651
3320.3B40584278n31254m58660o84128Q7014J9970n50213j93272n53207m67205j24112
3330B37129211m58488q92181q23803m8676J05972r6073K7504n57766n99384J06583
3339.6B33892899p17087j023617m75884n04589j66549n5504j41869o13060m90799k06699
3349.3B29497242o34785l75251l09411k12230k27299m65755l63198k51350l23010j46293
3358.9B26188660J62849p62100n17597K29053k64416o35452p85026j89152l79391m35428
3368.6B22612000k58961n19619m12560p13653j85547M77142M76074m23545q80127j21651
$$ y = [248226166, 248129196, 247897720, 247158623, 246971035, 246784401, 246341286, 246032791, 245805702, 245559292, 245064220, 244418411, 243908749, 243737793, 243758087, 243597221, 242883053, 242130508, 241682529, 241225929, 240584278, 240053024, 239594364, 238910236, 238997250, 239017220, 238467007, 238273735, 237720528, 237253323, 237129211, 236670723, 235778542, 234954739, 234906063, 235012035, 234915962, 234943466, 234385700, 233786316, 233892899, 233175812, 232152195, 231676311, 231171722, 231005173, 230949669, 230807800, 230194740, 229703941, 229497242, 228862457, 228487206, 228177795, 227965565, 227738266, 227272511, 226909313, 226657963, 226334953, 226188660, 226351509, 225589409, 225071812, 225300865, 225036449, 224400997, 223615971, 223426819, 223047428, 222612000, 222353039, 221833420, 221420860, 220707207, 220521660, 220998802, 221474876, 221051331, 220171204, 220049553]
3378.2B20049553k72198m88109o13633j78337K58065J70078L14503k65255n34630k99340
3387.8B18140697k48851m55132k81772R460p9288j91365m61178o0939N2929Q2073J90162
3398.4B16696796j63765J77613J71737k90737k67677l17879m42276L89843N07508l96119
3408.1B16065044l57608p8774K17743p3681K7275L20339k66246j2055J03302K6684
3417.7B15972023M43821M92039m0970l09792j48945K06547N17731L0441j98078k58045
3427.4B16706772P5989R3174r8458N96333L80764L30753N7564k6245O29825O04382
3437B19350853O90823L1757l5725P48959M68006j96571J88846L41568J44425R77840
3446.7B22710781N28050J68781O09417O36368M14981j72023L12557M57687N12638P47662
$$ y = [220049553, 219777355, 219289246, 218675613, 218497276, 218755341, 218925419, 219239922, 218974667, 218440037, 218140697, 217891846, 217436714, 217154942, 217164402, 217085114, 216893749, 216432571, 216371632, 216424561, 216506634, 216696796, 216533031, 216710644, 216882381, 216591644, 216323967, 216006088, 215563812, 215953655, 216461163, 216065044, 215707436, 215628662, 215846405, 215772724, 215799999, 216120338, 215854092, 215842037, 215945339, 215972023, 216415844, 216907883, 216866913, 216557121, 216408176, 216614723, 217132454, 217162895, 216964817, 216706772, 216782761, 216875935, 216777477, 217373810, 217754574, 218085327, 218142891, 218116646, 218746471, 219350853, 220041676, 220073433, 220037708, 220786667, 221254673, 221058102, 221246948, 221588516, 221732941, 222710781, 223238831, 223407612, 224017029, 224653397, 225068378, 224896355, 225208912, 225666599, 226179237, 226926899]
3456.3B26926899L75957l6010M11663R27658J35460N05962L39432K82841J383190J247444
3466B32500496O15387j34354L87764M50955N99823Q96454L94535J244754R00975J27525
3475.6B37984314L69034P83691J116162J078548Q50506L79371K57664j28078P23571
3484.3B43414783R91784P85675J276855O52084O66256N33925M78115M70047N67398
3493B49836922J094951J224728J477127M63944L29895P60917J079045J225547P29142
3501.6B58222218J102695O26450N88131N24578Q89301J727428J582623Q86002l10460
3510.3B65838966O91586Q46386Q55503J309433R10740J313476J055622J020470Q26664
3519B74668846R57413J451721J291962J436615J182365R46655P79610J399136J064815
$$ y = [226926899, 227302856, 227266846, 227678509, 228606167, 228741627, 229247589, 229587021, 229869862, 231253052, 232500496, 233115883, 232981529, 233369293, 233820248, 234420071, 235316525, 235711060, 236955814, 237856789, 237984314, 238353348, 239137039, 240253201, 241331749, 242182255, 242561626, 242819290, 242691212, 243414783, 244406567, 245192242, 246469097, 247121181, 247787437, 248321362, 248799477, 249269524, 249836922, 250931873, 252156601, 253633728, 254097672, 254427567, 255188484, 256267529, 257493076, 258222218, 259324913, 259951363, 260539494, 261064072, 261953373, 263680801, 265263424, 266149426, 265838966, 266530552, 267376938, 268232441, 269541874, 270452614, 271766090, 272821712, 273842182, 274668846, 275626259, 277077980, 278369942, 279806557, 280988922, 281935577, 282715187, 284114323, 285179138]
3527.7B85179138M11225R97734J453724J188049N37700J171589J019631J763763J579132
3536.4B95301685M616Q89111J244640K157841J279735P43504J299057J196232J652260
3545C05768681J198024K355233J106662R05400J341762J044960J984215M34494J432438
3553.7C17571869J632118J921234K095833P68166J939773J794510J930885J434784
3561.4C31089172K293625K722702J771660L426437J070900J418915J257630P9689K639732
3570.1C47770462K072449K357292J844902K089310K072029K223243L191071J360130
3577.8C64980888J809082K182351J739730K180863K702942K490768K110100M038467
3585.5C84235191K873574J999015K439881q37517K218857L193855L303528L166199
$$ y = [285179138, 285590363, 286588097, 288041821, 289229870, 289767570, 290939159, 291958790, 293722553, 295301685, 295306301, 296195412, 297440052, 299597893, 300877628, 301621132, 302920189, 304116421, 305768681, 306966705, 309321938, 310428600, 311334000, 312675762, 313720722, 315704937, 316139431, 317571869, 319203987, 321125221, 323221054, 323989220, 325928993, 327723503, 329654388, 331089172, 333382797, 336105499, 337877159, 341303596, 342374496, 343793411, 345051041, 345130730, 347770462, 349842911, 352200203, 354045105, 356134415, 358206444, 360429687, 363620758, 364980888, 366789970, 368972321, 370712051, 372892914, 375595856, 378086624, 380196724, 384235191, 387108765, 389107780, 391547661, 390710144, 392929001, 396122856, 399426384, 402592583]
3593.2D02592583K118797K944717Q86536K665215L882103K075653L209648J875191
3601D22250443J376609K211457J988678L036003L787765L674469J565018L761787R12476
3609.6D44564705l49007O208382K591362N5427M529419O73714L474655M775505J930695
3618.3D68454857J914978O38161K008094K913971K513314K350731K883224L149033
3626D86826363L256912O563339M430733o344490J713333L194008M413490J948738j045799
3634.7E04956627K135200L352280L192749J659165J286354K375145L433074K277909
3642.4E24668503O03523K414589M376793O494751K521629j545181M953613K072220
3650.1E46560440l525162j772232M155083L406410M035835N254441o411362J098747
$$ y = [402592583, 404711380, 407656097, 408542633, 411207848, 415089951, 417165604, 420375252, 422250443, 423627052, 425838509, 427827187, 430863190, 434650955, 438325424, 439890442, 443652229, 444564705, 444215698, 450424080, 453015442, 453070869, 457600288, 458274002, 461748657, 466524162, 468454857, 470369835, 471007996, 473016090, 475930061, 478443375, 480794106, 483677330, 486826363, 490083275, 496646614, 501077347, 494732857, 496446190, 499640198, 504053688, 506002426, 504956627, 507091827, 510444107, 513636856, 515296021, 516582375, 518957520, 522390594, 524668503, 525272026, 527686615, 532063408, 538558159, 541079788, 539534607, 544488220, 546560440, 543035278, 541263046, 545418129, 548824539, 552860374, 558114815, 551703453, 552802200]
3657.9E52802200N243798K489814J524582O86798J772194J031571K093086K059059
3665.6E69703102J308937M247589L709603K895546J204223n005874J504554O197930
3673.3E85765610Q445930L143158j3631210K21786N129052M007949j109924k92358
3681E91679993K078056J654396J743507J060334P25136M813346P535363n201569k330666
3689.7F03757896O871720m626808r47304L669815j00365J252899J341629K21596J278382
3698.4F12719460Q91189K226715L084107l108750j544876L554650J146049O70967Q60787
3707F20500298K607231M826736l220405L401489L236465j0911407K954941L194999
3714.8F26590347N43099L95775J918029J688042k537079J412316N370597j282920k942505
$$ y = [552802200, 558045998, 560535812, 562060394, 562747192, 564519386, 565550957, 567644043, 569703102, 571012039, 575259628, 578969231, 581864777, 583069000, 578063126, 579567680, 585765610, 594211540, 597354698, 583723488, 583945274, 589074326, 593082275, 591972351, 591679993, 593758049, 595412445, 597155952, 598216286, 598941422, 603754768, 611290131, 606088562, 603757896, 610629616, 606002808, 605055504, 608725319, 608624954, 609877853, 611219482, 611441078, 612719460, 613610649, 615837364, 618921471, 615812721, 614267845, 617822495, 618968544, 619639511, 620500298, 623107529, 627934265, 624713860, 628115349, 631351814, 620440407, 623395348, 626590347, 627133446, 627529221, 629447250, 631135292, 628598213, 630010529, 635381126, 634098206, 631155701]
3723.4F31155701L804855J455879Q57620j666488j422920K192649J491127N527573
3731.2F43395996j71661m411965P878533K596740o208801k086716J237793O17524J077499
3739.8F43924942K548599l143692K370758J0101242q720169j0368309Q840752M279175
3747.5F49833298M490051k605667n780792R243698o581421n613632M664840L636246
3755.3F51286621L189392m043503J700516M861221n315780j777954K481689N94177
3763F52976379P5379L621368j137695m618607L109818N543823R41849p928238J212158
3771.7F53796234L072128p0190j70822r3231J670303J171799K440719P46079o184616
3780.3F56378403J168136J989975J044236K320938k091828j639938J331329J335907
$$ y = [631155701, 634960556, 636416435, 637274055, 635607567, 634184647, 636377296, 637868423, 643395996, 643224335, 638812370, 646690903, 649287643, 643078842, 640992126, 642229919, 642847443, 643924942, 646473541, 643329849, 645700607, 655801849, 647081680, 636713371, 645554123, 649833298, 654323349, 651717682, 645936890, 655180588, 648599167, 642985535, 647650375, 651286621, 654476013, 650432510, 652133026, 656994247, 651678467, 649900513, 652382202, 652976379, 653051758, 656673126, 655535431, 650916824, 654026642, 659570465, 660512314, 652584076, 653796234, 656868362, 656798172, 656627350, 656534119, 658204422, 659376221, 661816940, 662563019, 656378403, 657546539, 659536514, 660580750, 662901688, 660809860, 659169922, 660501251, 661837158]
3788F61837158Q95233m25872n21851l6011N09491O00739K246551L434677j942596k392044
3797.7F64205475J298599L338776O339340k994537q820954R21478J016770M089661
3805.4F69394608N548553n912399l883362K610092P19605J49688O57044J89590J464844
3814.1F70938263N020828O56204r418945K571793M682464O545563L612442j6399841
3821.8F68208771L20511L274383P80564K291183J609116k564316j476670L37067K797699
3830.5F75578308K626419n598984K297440O119690l813553P39899O848984p124939
3838.2F77673264k759476P853775m644776k932586M892349m13895k927246J010819
3845.9F77752228O44302K55966J480561k15836J710281N325318j202545l89023j4916153
$$ y = [661837158, 662732391, 662306519, 661784668, 661748657, 662258148, 662858887, 665105438, 668540115, 666597519, 664205475, 665504074, 668842850, 675182190, 672187653, 663366699, 664288177, 665304947, 669394608, 674943161, 669030762, 665147400, 667757492, 668477097, 668626785, 669283829, 669473419, 670938263, 675959091, 676615295, 667196350, 669768143, 674450607, 680996170, 684608612, 668208771, 668529282, 671803665, 672584229, 674875412, 676484528, 673920212, 672443542, 672780609, 675578308, 678204727, 672605743, 674903183, 681022873, 677209320, 677949219, 684798203, 677673264, 674913788, 682767563, 678122787, 675190201, 680082550, 679668655, 676741409, 677752228, 678396530, 678652496, 680133057, 679917221, 681627502, 686952820, 685750275, 685361252, 670445099]
3854.6F70445099K037964R393005n62820k604828P88345J507111M080734k706375k023926
3863.3F80354309N147247l334884m324112K322845L674546O426010l534546p584534
3871F79146881J399155M677582M117431r644165j043320L201600J76239J565628L852996
3879.7F87450027k166824n903625L920517J243057K095718M709854j0873565j69373
3887.4F80305786K758484L21884L671875J811295m722138j96533J124878j529083P94296
3896.1F84340744J259537L417282K122345p725830L362198K166366k372589L517761
3903.8F90087814j123962j601486k390900j152267J164093k39182n77316j57089O89163
3912.5F84698868P99103P89337J119232J736526k354660l265304L457565J127167k772370
$$ y = [670445099, 672483063, 681876068, 681313248, 678708420, 679496765, 681003876, 685084610, 682378235, 680354309, 685501556, 682166672, 677842560, 680165405, 683839951, 690265961, 686731415, 679146881, 680546036, 685223618, 689341049, 679696884, 678653564, 681855164, 682031403, 683597031, 687450027, 685283203, 679379578, 683300095, 684543152, 686638870, 691348724, 680475159, 680305786, 683064270, 683386154, 687058029, 688869324, 684147186, 683950653, 685075531, 683546448, 684340744, 685600281, 689017563, 691139908, 683414078, 686776276, 688942642, 686570053, 690087814, 688963852, 687362366, 684971466, 683819199, 684983292, 684744110, 684166794, 684009705, 684698868, 685497971, 686287308, 687406540, 689143066, 686788406, 683523102, 686980667, 688107834, 685335464]
3921.1F85335464N55573R29108J942062k43530k943955K52915J260147J483993o89163
3929.8F87882614j262207J486282j176376j658707M78287J13297J50985L45002O40792
3938.5F86999969R5215k64511J808548J624069l295745j202546J109848R83429J260147
3947.2F89118423j629333R37424R29947k152787J196595M48913p56378l68500M73557
3955.8F88197861N44052j142655J6098p6599N98526L76664j518174K69471J098861
3964.5F88364105L4256j163940l59192J100006M85153k61459L31802L70178l63922
3973.2F88536987K24533P77741J60980r49402k82974N58014N112m2572m8218p0114
3982.8F88870087J23291N95398m82941p08313K85416n23072K0905P18689N91888K7466
$$ y = [685335464, 685891037, 686820145, 688762207, 688518677, 685574722, 685827637, 687087784, 688571777, 687882614, 686620407, 688106689, 686930313, 685271606, 685749893, 685863190, 686014175, 686359177, 686999969, 687095184, 686830673, 688639221, 690263290, 686967545, 685764999, 686874847, 687858276, 689118423, 687489090, 688426514, 689356461, 687203674, 688400269, 688849182, 688092804, 687724304, 688197861, 688741913, 687599258, 687615356, 687538757, 688137283, 688513947, 686995773, 687265244, 688364105, 688398361, 687234421, 686875229, 687975235, 688460388, 688198929, 688530731, 688900909, 688536987, 688761520, 689539261, 689700241, 688750839, 688467865, 689025879, 689030991, 688988419, 688940201, 688870087, 688993378, 689588776, 689105835, 688397522, 688682938, 688159866, 688180771, 688899460, 689491348, 689518814]
3992.5F89518814J85165M98963r38263m69971j5335k66647L22647Q34122
4000.2F89669495
$$ y = [689518814, 689703979, 690202942, 689264679, 688794708, 688779373, 688512726, 688835373, 689669495]
##END=$$ End of the data block
