##TITLE=$$ Begin of the data block
##JCAMP-DX=5.00 $$ ACD/SpecManager v 10.08
##SPECTROMETER/DATA SYSTEM=Varian
##DATE=20 Nov 2012 10:20:40
##DATA TYPE=INFRARED SPECTRUM
##DATA CLASS=XYDATA
##ORIGIN=
##OWNER=
##NPOINTS=3735
##FIRSTX=399.26403809
##LASTX=4000.35498047
##MAXX=4000.35498047
##MINX=399.26403809
##MAXY=77.75580597
##MINY=18.57722855
##XFACTOR=1.0000000000
##YFACTOR=0.000000100000000
##FIRSTY=50.34841156
##DELTAX=0.96440572
##XUNITS=1/CM
##YUNITS=TRANSMITTANCE
##XYDATA=(X++(Y..Y))
399.3E03484116p815628m373131k47498k00805J926841K376709m741401q258553j309814
407.9D80840836p66755L658448L410721p941056k461815M617195J739655k433052P51572
416.6D81415749R700889Q995056m881858k143670k479248o17828k514458p165756n553551
425.3D74755325J676636L473206j708298j100998K817764l840370m639206p94372j833611
434D68806076j291389J084594L080826l220787j784859J088562k641868m038010j953277
442.7D59129868O004524N434189l03154L62091M515571O494141N167046J028366m826622
451.3D83006020m860573r99642K006150M19960k493134J287995l124924m75693M629593
460D79395752J743278j54266k852631j951370j090507k121887j306687k178039j566773
$$ y = [503484116, 495668488, 491295357, 491047859, 490847054, 492773895, 495150604, 490409203, 482150650, 480840836, 480074081, 483732529, 487143250, 479202194, 476740379, 481357574, 483097229, 480664177, 481415749, 491116638, 500111694, 495229836, 493086166, 490606918, 489989090, 487474632, 480308876, 474755325, 476431961, 479905167, 478196869, 477095871, 479913635, 476073265, 471434059, 470639687, 468806076, 467514687, 468599281, 471680107, 468459320, 466674461, 467763023, 465121155, 461083145, 459129868, 465134392, 470568581, 470265427, 470627518, 475143089, 481637230, 486804276, 487832642, 483006020, 478145447, 477145805, 479151955, 479571915, 477078781, 478366776, 475241852, 474766159, 479395752, 481139030, 480984764, 478132133, 476180763, 475090256, 472968369, 471661682, 469483643, 467916870]
468.7D67916870p5493J264076M9820l968010k249450k73133j051521k478218m080696
477.4D55054245k971535j575088J41601K671967J701279k673340o458245P03011L387375
486.1D49981270J66282m23164j352005j075477k594834K192955N271263j839637n535546
494.7D44791107k341804L586692K11144k922440j897468J58157L01361l448028J252365
503.4D39691086j863632m220429N90325r02596m415932m748611j310883K10800j230163
512.1D21799965k712517j929550k834930l158875l37524j704903j99623r36394m60968
520.8D07524681j194076l529892j185761r70421Q3809j557274L34282N19371j327667
529.5C98697052J776276L42750r38415n36957J162338K017059K030411J521454o43082
$$ y = [467916870, 467841377, 469105453, 469155273, 465187263, 462937813, 462664680, 461613159, 459134941, 455054245, 452082710, 450507622, 450649223, 453321190, 455022469, 452349129, 445890884, 446593895, 449981270, 450147552, 449724388, 448372383, 447296906, 444702072, 446895027, 452166290, 450326653, 444791107, 442449303, 446035995, 446247139, 443324699, 441427231, 441585388, 441886749, 438438721, 439691086, 437827454, 433607025, 434197350, 433294754, 428878822, 424130211, 422819328, 423030128, 421799965, 419087448, 417157898, 414322968, 411164093, 410826569, 409121666, 408922043, 407985649, 407524681, 406330605, 402800713, 401614952, 400644531, 400728340, 399171066, 399505348, 400024719, 398697052, 400473328, 400816078, 399877663, 399340706, 400503044, 402520103, 404550514, 406071968, 405428886]
538.1D05428886K216797M246750L304558K012978J075172N47752k35519J595230K997398
546.8D23190002L04375k781372j836624p15523o06079m56467l46031R09767j574821
555.5D16087227j997223n93910m12102j91078k471848k478981j942825j286964j309700
564.2D03402596j710358j956062l821679l840294l507156j210708j607590k315140
571.9C83433609j828690j677742l7193j109962K88810J406479J624871Q07533J028137
580.6C83935852L034706K480316K941170K460823K423935J333160K453156L783760
588.3D04846878J256599P86324K031326J694146j098786J006928J314849r71260M15459
597D11282463n75752R0751J153450j88407j060181M85763J268616j078949j29089P37762
$$ y = [405428886, 407645683, 411892433, 415196991, 417209969, 418285141, 418832893, 418597374, 420192604, 423190002, 423494377, 420713005, 418876381, 418160858, 417554779, 417098312, 416752281, 417662048, 416087227, 414090004, 413496094, 413083992, 412892914, 410421066, 407942085, 405999260, 404712296, 403402596, 401692238, 399736176, 395914497, 392074203, 388567047, 387356339, 385748749, 383433609, 381604919, 379927177, 379889984, 378780022, 379068832, 380475311, 382100182, 382907715, 383935852, 386970558, 389450874, 392392044, 394852867, 397276802, 398609962, 401063118, 404846878, 406103477, 406889801, 408921127, 410615273, 409516487, 410523415, 411838264, 410867004, 411282463, 410706711, 410797462, 411950912, 411762505, 410702324, 411188087, 412456703, 411377754, 411248665, 411986427]
606.6D11986427K71416k10915O4583l58886j366120Q42781J114960J160812J534539
615.3D15039597J154098K2545J87492L002739K117844M29001K81296J779975J770516
624D25785103M01535J597710J357383Q42209J165772J451301M90990J115990K795372
632.7D37003365R41124j68572m64401M71039K069282K061043J570549J17798o88057
641.3D42913170N59502J734008L65219j85623J358185K736244K641602Q58536O43653
650D53624496L49045m20265N1651P62520J179809J060791R09310N90706N56755L02810
659.7D58967628N82467P97271j67312j34201N15098J061707R57374k4185J940499K785415
669.3D67281761k18048k28882J082726J23329m08249P65724J436959J445922O69861
$$ y = [411986427, 412257843, 412046928, 412111511, 411752625, 410386505, 411229286, 412344246, 413505058, 415039597, 416193695, 416216240, 416403732, 419406471, 421524315, 421953316, 422234612, 424014587, 425785103, 426186638, 427784348, 429141731, 429983940, 431149712, 432601013, 433092003, 434207993, 437003365, 437944489, 437775917, 437311516, 437782555, 439851837, 441912880, 443483429, 443601227, 442913170, 443472672, 445206680, 445571899, 445386276, 446744461, 449480705, 452122307, 452980843, 453624496, 453973541, 453553276, 453604927, 454367447, 455547256, 456608047, 457517357, 458108063, 458664818, 458967628, 459550095, 460347366, 460180054, 460045853, 460560951, 461622658, 462580032, 462555847, 464496346, 467281761, 467063713, 466834831, 467917557, 468040886, 467632637, 468398361, 469835320, 471281242, 471951103]
678D71951103l9902M26865J715241J949310J828842J428795N58739l87040j735153
686.7D77696800l65906K184449P48672j665344q70819O09703R89036R57604l22647
695.3D79961548j224404r97543j722717k329750j075936j907o15501o79322k75077
704D71039391l97454j24588J08299k18429k38762J37787k76528n0277J318016K011413
713.7D73308868K140656K414360J939087J733971L096237L316765K723388K331619
721.4D93004951K381020K106857J622506K816085L516541K769127K080765K910423
729.1E13208275L417625K548714J652031J211662J142082N26276J157723J536903J268158
737.8E27669449J812019J524887K12822n34973M32663O81839O90270M94651j108703
$$ y = [471951103, 471911201, 472338066, 474053307, 476002617, 477831459, 479260254, 479818993, 479431953, 477696800, 477330894, 479515343, 480264015, 478598671, 477727852, 478337555, 479326591, 480284195, 479961548, 478737144, 477739601, 476016884, 473687134, 472611198, 472609291, 471993790, 471314468, 471039391, 470641937, 470517349, 470625648, 470407219, 470168457, 470306244, 470029716, 469979439, 471297455, 473308868, 475449524, 477863884, 479802971, 481536942, 484633179, 487949944, 490673332, 493004951, 495385971, 497492828, 499115334, 501931419, 505447960, 508217087, 510297852, 513208275, 516625900, 519174614, 520826645, 522038307, 523180389, 523706665, 524864388, 526401291, 527669449, 529481468, 531006355, 531219177, 530684204, 531116867, 531798706, 532488976, 532983627, 531874924]
746.5E31874924j144142j450o72531j512947j218682j757965j195564p32994j968918
755.1E21669731k631988k708970j746292j632652k113418j758767j571655q01353q17109
763.8E05887527q40873L26614K57874r63936j008301R28116K314110K330398J838303
772.5E11069832K541008L289604K297096L115311L297615K353859L524971L814087
780.2E35303383K671814K444000L226395M427604L895874K857247L837776L783302
787.9E62447395L875542L819084J995735J554222K345353J859970R37462K319450L140526
796.6E84294739K210083J245804K005844J501960o2980J413154R28879Q17414R64202
805.3E95319099J75362N40848L75099M95453n24597m01383q69217j626625j169548
$$ y = [531874924, 530730782, 530729332, 530056801, 528543854, 527325172, 525567207, 524371643, 523638649, 521669731, 519037743, 516328773, 514582481, 512949829, 510836411, 509077644, 507505989, 506704636, 505887527, 505046654, 505373268, 505631142, 504667206, 503658905, 504587021, 506901131, 509231529, 511069832, 513610840, 516900444, 519197540, 522312851, 525610466, 527964325, 531489296, 535303383, 537975197, 540419197, 543645592, 548073196, 551969070, 554826317, 558664093, 562447395, 566322937, 570142021, 572137756, 573691978, 576037331, 577897301, 578834763, 581154213, 584294739, 586504822, 587750626, 589756470, 591258430, 591195450, 592608604, 593537483, 594354897, 595319099, 595494461, 596035309, 596410408, 596905861, 596381264, 595979881, 595110664, 593484039, 592314491]
814E92314491j383323r20525m87518k9679m00772L15514K12555L78303R00421q47969
823.6E90051498j03149r11446r32121L60298p45010j833344j788520n46303j511154
832.3E82040749n55802j99585j302948j058883k091217j426163j426735j150894r08852
841E71919670j566582j233825q76656k53296j017952j314735k267494l111840j841163
849.6E58436127r90143j690674k705612k364273k606774k343101k345734k388878k406158
858.3E38594780l294907k250328j882171j121445Q06122K242164L943749M507751M755059
867E46300774M232254M619331N607567M914818M134407M371795M387589L342361L862343
875.7E85773239K872887K749405K516746P60308J152687J50604j55869q06999j347656
$$ y = [592314491, 590931168, 590010643, 589523125, 589493446, 589092674, 589408188, 589620743, 589999046, 590899467, 590051498, 589948349, 589036903, 588104782, 588465080, 587720070, 585886726, 584098206, 583551903, 582040749, 581484947, 581285362, 579982414, 578923531, 576832314, 575406151, 573979416, 572828522, 571919670, 570353088, 569119263, 568242607, 567989311, 566971359, 565656624, 563389130, 560277290, 558436127, 557445984, 555755310, 553049698, 550685425, 548078651, 545735550, 543389816, 541000938, 538594780, 535299873, 533049545, 531167374, 530045929, 530852051, 533094215, 537037964, 541545715, 546300774, 550533028, 555152359, 560759926, 565674744, 569809151, 574180946, 578568535, 581910896, 585773239, 588646126, 591395531, 593912277, 594672585, 595825272, 595975876, 595820007, 595013008, 593665352]
884.4E93665352j727371k732697k371406k643471k587357k399673k476502l147659
892.1E73579216k964134k766953k778129j632119k110137k749520l059044k462272
899.8E53056908j508446j771584k092895k397537k262650k583733l233108m118805
907.5E33088150m021111l343200m240532m930115m649887m776649n305291m920578
915.2D96900787m810257m875145m300460l948746m101181m236145l233910j661453
922.9D65733490r10110j56632O9542n79681l36113l07541J16424R59435R94949Q40912
932.6D66424675J007004J391983J506882J933059J808586K040062K277756J495972
940.3D79885979J904602K263641J622734J473236J359482L35693l56254k24075j030198
$$ y = [593665352, 591937981, 589205284, 586833878, 584190407, 581603050, 579203377, 576726875, 573579216, 570615082, 567848129, 565070000, 563437881, 561327744, 558578224, 555519180, 553056908, 551548462, 549776878, 547683983, 545286446, 543023796, 540440063, 537206955, 533088150, 529067039, 525723839, 521483307, 516553192, 511903305, 507126656, 501821365, 496900787, 492090530, 487215385, 482914925, 478966179, 474864998, 470628853, 467394943, 465733490, 464823380, 464666748, 464736290, 464156609, 463820496, 463512955, 463629379, 464588814, 465583763, 466424675, 467431679, 468823662, 470330544, 472263603, 474072189, 476112251, 478390007, 479885979, 481790581, 484054222, 485676956, 487150192, 488509674, 488845367, 488489113, 488265038, 487234840]
949D87234840k194976k958756m344864m595260m372979n321960o230202o299400o015396
957.7D44901047o267395o780434o818581o222419o294327p053223p913704q017845
965.4C89533119q231430p624283p427444q951340q542023r105491q951912q495674
973.1C22203522r037457r565563r856701q081455q917332q458271p833309p383347
980.8B53070087p044658p938729o033916n164852l871136m947147m457188l757057
988.5B09855404l642063j823635k719422j029796j825409p45888n05123j665631k11334
997.2A95687103r99546L46394r23405k0370j93119l48607J088257n58185M15745j202698
1006.8A93291569m62265j024437j162415p4291j635227n99365j272889L57743m79527
$$ y = [487234840, 485039864, 482081108, 477736244, 473140984, 468768005, 463446045, 457215843, 450916443, 444901047, 438633652, 431853218, 425034637, 418812218, 412517891, 405464668, 397550964, 389533119, 381301689, 373677406, 366249962, 357298622, 348756599, 339651108, 330699196, 322203522, 313166065, 303600502, 293743801, 285662346, 276745014, 268286743, 260453434, 253070087, 246025429, 238086700, 232052784, 226887932, 223016796, 218069649, 213612461, 209855404, 206213341, 204389706, 201670284, 200640488, 198815079, 198069191, 197564068, 195898437, 195687103, 194687557, 195033951, 194110546, 194090176, 193897057, 193548450, 194636707, 194078522, 194494267, 193291569, 192829304, 191804867, 190642452, 190568161, 188932934, 188333569, 187060680, 187418423, 186938896]
1015.5A86938896l32699j64661o69251J575222K01169J029586n63755P17926J556912
1024.2A90289345M91066J678581L20225K107086J428814J623649J064835J154881J852512
1032.9B02010994Q68454J878338l82252O38409m97952m3239M92859q88825O19679j735783
1042.5B02960682J54705l21026O4049L36056o19889R06659o37894J591778M64801J426850
1052.2B06326771K037372K199746M123268K282123K379551R11846L912373L728218
1059.9B27901268K930241L385963K365666M691886K728692L683528K660523J782589
1067.6B52130356J053352j206302j624508m550496k828464l924484l966637l395271
1075.3B31687546l305702j222573j328335J687394O95705K113857J332608O36329L030606
$$ y = [186938896, 186606197, 186441536, 185772285, 187347507, 187548676, 188578262, 188014507, 188732433, 190289345, 190780411, 192458992, 192779217, 194886303, 196315117, 197938766, 199003601, 200158482, 202010994, 202879448, 204757786, 204375534, 205013943, 204515991, 204472752, 204965611, 204076786, 204696465, 202960682, 203115387, 202794361, 202858410, 203194466, 202574577, 203481236, 202843342, 204435120, 204899921, 206326771, 208364143, 210563889, 214687157, 216969280, 219348831, 220260677, 224173050, 227901268, 230831509, 234217472, 236583138, 241275024, 244003716, 247687244, 250347767, 252130356, 253183708, 251977406, 250352898, 245802402, 242973938, 239049454, 235082817, 231687546, 228381844, 227159271, 225830936, 227518330, 228214035, 230327892, 231660500, 232296829, 235327435]
1084B35327435K010822K845745K029858L668632K458077L112049M001312K964706M494839
1092.7B62913475J842136K621041K531051K134228M48818k37579J664562P3376J085586
1101.4B75076694l13873J13545K8839j70593R59968K518J663074J096039K878456K391701
1111B83726368J923904K811585K131424L111458J792030L021240K149315J847630J901702
1119.7C04416656P61242J723004Q38127J171131N81360J898212J786614J158199J546078
1128.4C15880623P96299K356987J325855J975556J415290J354027K111893M02908O08406
1137C28227844r05494q72803j873398k574539k941017l348503j786938k914353j856803
1145.7C09153996k588997k527180k185879k201385m79069j791020n41782o13499o17714
$$ y = [235327435, 237338257, 240184002, 242213860, 245882492, 248340569, 251452618, 255453930, 258418636, 262913475, 264755611, 267376652, 269907703, 272041931, 272490749, 272253170, 273917732, 273991108, 275076694, 274762821, 274876366, 274905205, 274734612, 275694580, 275697098, 277360172, 278456211, 281334667, 283726368, 285650272, 288461857, 290593281, 293704739, 295496769, 298518009, 300667324, 302514954, 304416656, 305177898, 306900902, 307739029, 308910160, 309491520, 311389732, 313176346, 314334545, 315880623, 316676922, 319033909, 320359764, 322335320, 323750610, 325104637, 327216530, 327619438, 328227844, 327322350, 326449547, 324576149, 322001610, 319060593, 315712090, 313925152, 311010799, 309153996, 306564999, 304037819, 301851940, 299650555, 299171486, 297380466, 296838684, 296225185, 295607471]
1154.4B95607471o21337k13929Q50544O91052K361202J864090K856770K733764L614350
1163.1C09743977M127159L144130M972382N281754O304206N980492O817970P041893
1170.8C53413963P044487P637711O834335P770958O440354O435241O857186O254654
1178.5D08688889N950851N602837N979461N651551N990829N350266M667243M368401
1186.2D52250328L958702L424263K477875K313690K074127J711045J188850J285667
1193.9D70684547J339417J183548R07020l21044j73531O08826Q9073q13866l99475
1202.6D73104515N50575N46227N52101Q15353J596833J578750J027336R83544J144066
1211.3D81899300J464996J180382J228752J318359R83887J032677J364975J168594
$$ y = [295607471, 294986134, 294772205, 295622749, 296313801, 298675003, 300539093, 303395863, 306129627, 309743977, 313871136, 317015266, 321987648, 327269402, 333573608, 339554100, 346372070, 353413963, 360458450, 368096161, 374930496, 382701454, 389141808, 395577049, 402434235, 408688889, 414639740, 420242577, 426222038, 431873589, 437864418, 443214684, 447881927, 452250328, 456209030, 459633293, 462111168, 464424858, 466498985, 468210030, 469398880, 470684547, 472023964, 473207512, 474114532, 473793488, 473619957, 474228783, 474317856, 473503990, 473104515, 473655090, 474201317, 474753418, 475568771, 477165604, 478744354, 479771690, 480755234, 481899300, 483364296, 484544678, 485773430, 487091789, 488075676, 489108353, 490473328, 491641922]
1219D91641922O24771P3357l61595k32735l08189p55005j009980r11636j244202j305236
1228.6D86211472q41675j020966r65423q36258j160889j501694j210670m87786r96704
1237.3D77189407j177978m12140j9760Q4991l09334k20871k67715l31421J86043K97317
1247D75018539K79656M91600Q60443O93474O40831P91931R57756Q33969P9842L0899
1256.6D80678940M45289M49906N9280j54800L81813J049385N58319O0310P13272R41926
1266.3D85183640J176681J122017O46896R08776J469001J228295M55742N14755Q24814
1274.9D93530617J010360M75541J09138M768l87077l61595m19846k36091J47552K62909
1284.6D94136276L1014N95398J007614L98407J74713m79088q18329j166801p99484
$$ y = [491641922, 492266693, 492340050, 491978455, 491745720, 491437531, 490682526, 489672546, 488760910, 487516708, 486211472, 485369797, 484348831, 483383408, 482547150, 481386261, 479884567, 478673897, 478186111, 477189407, 476011429, 475599289, 475579529, 475664520, 475355186, 475134315, 474866600, 474535179, 474721222, 475018539, 475298195, 475789795, 476650238, 477343712, 477984543, 478776474, 479734230, 480568199, 480648041, 480678940, 481124229, 481574135, 481633415, 481478615, 481860428, 482909813, 483468132, 483528442, 484241714, 485183640, 486360321, 487482338, 488129234, 489038010, 490507011, 491735306, 492191048, 492705803, 493530617, 494540977, 495016518, 495125656, 495130424, 494743347, 494381752, 493961906, 493725815, 493873367, 494136276, 494167290, 494762688, 495770302, 496168709, 496343422, 495864334, 495046005, 493879204, 493079720]
1293.3D93079720j78986o64749n61638p85217p90902p29332j361846j542511j436959
1301.9D85027580j261825j175118j798744k206421j423836j226463j279411j292000
1309.7D73363762j358681p46689p55577j086769j603813j852112j342583j257705p65534
1318.3D62594299p50694j341057p81288l68805n68771j088600j395340j629563j990509
1327D52679672k120323k359886k142601j704102j539306j601105j579895j212769r82399
1335.7D37437286p04727r33494j38359J85508r79461j148148n72510L62702M42505
1344.4D33951302R92775O06994N05142O40030k75802m0779n20974l29780k56005p4195
1354D35198708L08761k71835k10076m50859j00555n18990m12063K46467M28658p42378
$$ y = [493079720, 492900734, 492235985, 491674347, 490889130, 490098228, 489368896, 488007050, 486464539, 485027580, 483765755, 482590637, 480791893, 478585472, 477161636, 475935173, 474655762, 473363762, 472005081, 471258392, 470502815, 469416046, 467812233, 465960121, 464617538, 463359833, 462594299, 461843605, 460502548, 459721260, 459352455, 458783684, 457695084, 456299744, 454670181, 452679672, 450559349, 448199463, 446056862, 444352760, 442813454, 441212349, 439632454, 438419685, 437437286, 436732559, 435799065, 435660706, 435846214, 434866753, 433718605, 433146095, 433508797, 433951302, 434944077, 435551071, 436056213, 436696243, 436420441, 436379662, 435858688, 435528908, 435272903, 435198708, 435507469, 435235634, 435025558, 434574699, 434474144, 433955154, 433543091, 433789558, 434218216, 433475838]
1363.7D33475838j998139l93524o47697j5526O92139m83094j07651O6910O26030L94745
1373.3D31610031J145630M93546J6059P69577O88057J173706Q3542O00128O45867O67763
1382.9D37893906R24186M95224J962204K266579K111282L09716J126632J697274R79843
1391.6D49766846R93805O79130R22165j434708j105308q66394j62087n94825k375794
1400.3D45822830q68797j521988p87392l09105j190681j898804j817169p84607j341629
1409D35302658p68814o25496q16193q88710n23948M03404n03845N2910o77872L87154
1418.6D31341248L45077j701050j2741q3504J763573L82118M01917R31740N92041J217994
1428.3D35178413Q04825J762963p20406K01111O64291K64244J634865J885758J931648
$$ y = [433475838, 431477699, 431084175, 430436478, 430420952, 431113091, 430629997, 430522346, 430589256, 431215286, 431610031, 432755661, 433249207, 433265266, 434034843, 434722900, 435896606, 435980148, 436580276, 437226143, 437893906, 438818092, 439313316, 441275520, 443542099, 445653381, 445963097, 447089729, 448787003, 449766846, 450760651, 451439781, 452361946, 450927238, 449821930, 448955536, 448793449, 448198624, 445822830, 444954033, 443432045, 442644653, 442335548, 441144867, 439246063, 437428894, 436644287, 435302658, 434533844, 433908348, 433092155, 432203445, 431679497, 432082901, 431579056, 431631966, 430954094, 431341248, 431686325, 429985275, 429972534, 429889030, 431652603, 432034721, 432436638, 433368378, 433960419, 435178413, 435983238, 437746201, 437025795, 437226906, 437891197, 438155441, 439790306, 441676064, 443607712]
1437D43607712j636925J090164L21846J9036P58705O180O54068o6567R35593N66253
1446.6D46256065J422501q1368j407508K95791m73633M2534j700897L88336J201630
1455.3D45943451O29539J790352k499275J434975j902962J405220Q62808J201248L212166
1464D52077522K333756K394905K94113L539543L038826M421272N210724M807587R790802
1472.6D87909050L088760N376015L243065N556984L636818K893905M538346L263626
1480.3E19506569N708008K717704L239975L336297L141250M221764K535743M376221
1488.1E48783531K416916M654350Q8959j73759J799011J010704K916641L318215K291259
1496.7E67105827n83152J061515q5029Q0261J480560k28386J027336J940003M886246
$$ y = [443607712, 441970787, 443060951, 443382797, 443401833, 444160538, 444166718, 444820786, 444754219, 445689812, 446256065, 447678566, 447597198, 446189690, 446485481, 446011848, 446054382, 444353485, 444741821, 445943451, 446572990, 448363342, 445864067, 447299042, 445396080, 446801300, 447664108, 448865356, 452077522, 454411278, 456806183, 457100296, 460639839, 463678665, 468099937, 473310661, 478118248, 487909050, 490997810, 496373825, 499616890, 505173874, 508810692, 511704597, 516242943, 519506569, 525214577, 527932281, 531172256, 534508553, 537649803, 541871567, 544407310, 548783531, 551200447, 555854797, 555943756, 555769997, 557569008, 558579712, 561496353, 564814568, 567105827, 566522675, 567584190, 567499161, 567579422, 569059982, 568831596, 569858932, 571798935, 576685181]
1505.4E76685181N974159l249855m28391k732010j646728j464996M46586n51986M64668
1514.1E73496628J809730J191178L691444l285141N01785L248825L925477J610221
1521.8E86190147l547020J0109J165581P73888o60820R11445K99225j429291R0943
1530.5E83804207J218185K536392J505394k307167j231079N1270J158218K252312N528297
1539.2E94516029o96144Q85926n64843j830749M24270K33880k717896j584854J31645
1547.9E88797264R79080K418747l04489m33693J777535K227859J424675j076584J802941
1556.5E97613335L969078O751175M205703j4648132j243133k91825n2185R17320j28975
1565.2E97092361j584854j009864O18896J941833k924270l134232j182670j150055
$$ y = [576685181, 582659340, 579409485, 578981094, 576249084, 574602356, 573137360, 573583946, 573031960, 573496628, 575306358, 576497536, 580188980, 576903839, 577405624, 580654449, 584579926, 586190147, 582643127, 582653236, 583818817, 584592705, 583931885, 584843330, 585142555, 583713264, 583804207, 585022392, 587558784, 589064178, 586757011, 585525932, 585577202, 586735420, 588987732, 594516029, 593819885, 594705811, 594140968, 592310219, 592734489, 592968369, 590250473, 588665619, 588797264, 589776344, 592195091, 591890602, 591456909, 593234444, 595462303, 596886978, 595810394, 597613335, 601582413, 608333588, 612539291, 597891159, 596648026, 596356201, 596304016, 597221336, 597092361, 595507507, 594497643, 595116539, 597058372, 594134102, 590999870, 589817200, 588667145]
1572.9E88667145l49007J060333J827469l924103k872352k397537k220307k067337
1580.6E77724304k327194j547394k439384j961251k285156j931572j903839j994858
1588.4E61333656j380691k769432j902657k866554k422028k355156k976150k535858
1596.1E42125130l761902k299385k809906j878052k519722k566032j776162l639030
1603.8E20874939k683144k938995j704369l449020k498283j921082l775978k155724
1611.5D99748344l177566j623573k601891l90587R18846o520614k330551k633591o58264
1620.2D80730553k034340L4103O49681l615875j966629j974945M99000j391220j912651
1628.9D69017677k446975j659127r53674j560593J429024P15485J802559k508889L67432
$$ y = [588667145, 588318138, 589378471, 591205940, 587281837, 584409485, 582011948, 579791641, 577724304, 575397110, 573849716, 571410332, 569449081, 567163925, 565232353, 563328514, 561333656, 559952965, 557183533, 555280876, 552414322, 549992294, 547637138, 544660988, 542125130, 538363228, 536063843, 533253937, 531375885, 528856163, 526290131, 524513969, 520874939, 518191795, 515252800, 513548431, 510099411, 507601128, 505680046, 501904068, 499748344, 496570778, 494947205, 492345314, 491954727, 492873573, 486352959, 484022408, 481388817, 480730553, 478696213, 478730316, 479379997, 475764122, 473797493, 471822548, 472321548, 470930328, 469017677, 466570702, 464911575, 463957901, 462397308, 463826332, 464541817, 466344376, 463835487, 464202919]
1637.5D64202919k434654j654396J075859n22232J538963J21460J822205K512550J380119
1646.2D68042793K977829j535339N68123o01044K539787L034668J954384J136208m216004
1654.9D73901405J558342L12348J270218Q13446J592292K306824K529259M054909j46561
1663.6D88192482J370316J242256K564048L201218L840790M434585P48292L656692
1671.3E09250679J455002K518387L261566N148544K782669J369248L704147L451042
1679E32941284N706787L805619L449020O240730P863388N711327q16422K852097L798675
1687.7E71552505M769898M422722L537712L522453L760262M425430N026741O829453
1695.4F07847176N627212K124558K713394M524994N150222j064300K100792K470741
$$ y = [464202919, 461768265, 460113869, 461189728, 460667496, 462206459, 462327919, 464150124, 466662674, 468042793, 471020622, 469485283, 470053406, 469452362, 471992149, 475026817, 476981201, 478117409, 473901405, 475459747, 475772095, 477042313, 477855759, 479448051, 481754875, 484284134, 488339043, 488192482, 489562798, 490805054, 493369102, 496570320, 500411110, 504845695, 505593987, 509250679, 510705681, 513224068, 516485634, 521634178, 524416847, 525786095, 529490242, 532941284, 538648071, 542453690, 545902710, 552143440, 560006828, 565718155, 564901733, 567753830, 571552505, 576322403, 580745125, 584282837, 587805290, 591565552, 595990982, 601017723, 607847176, 613474388, 615598946, 618312340, 622837334, 627987556, 626923256, 629024048, 631494789]
1703.1F31494789L569451K783241L012199Q12912j074295P51801J874313Q52966j40152
1711.8F43937225J019287K061310K838288J744766K961120M013596l742981k217255
1719.5F52615356k14462K63519L07160Q07495j87378r6741R37348M25033Q42591J834106
1729.1F57534027J402512r50623J804276M169922J643981m663925j525268Q95385N31769
1737.8F60842056J802674K616882j859131P62634K771531K461013n91583J136017K555771
1746.5F72497864K233124L295288P66601K420044K680206j80130J623307J836471K655411
1755.2F89828186L497314K423630O17371J648636K543716M254913L014374q55636J840362
1763.9G08812866J877365K392197K493820K961350J282119L47062L719253M269791
$$ y = [631494789, 635064240, 637847481, 640859680, 641672592, 640598297, 641350098, 643224411, 644077377, 643937225, 644956512, 647017822, 649856110, 651600876, 654561996, 658575592, 654832611, 652615356, 652400894, 652664413, 652971573, 653779068, 653591690, 653494949, 654432297, 654857330, 655699921, 657534027, 658936539, 657985916, 659790192, 663960114, 665604095, 660940170, 659414902, 660310287, 660842056, 662644730, 665261612, 663402481, 664165115, 666936646, 669397659, 668806076, 669942093, 672497864, 674730988, 678026276, 678792877, 681212921, 683893127, 683712997, 685336304, 687172775, 689828186, 693325500, 695749130, 696366501, 698015137, 700558853, 704813766, 707828140, 706972504, 708812866, 710690231, 713082428, 715576248, 718537598, 719819717, 720166779, 723886032, 728155823]
1771.6G28155823J090011l954086Q83713K905044J55564M57000R54590J957703J516266
1780.3G34121628J33667m32205N04989K027512L07693n42068O37665J399231O01730
1788.9G38759842J231689K506485K478714M64402k675324P39212R16672m19159j26419
1797.6G43876114J708450J996918j102982R01032J14670l17688M65545J0300L52631
1806.3G48004990N32837O62841M78592K107849L27607q07343L0060k32163P77893r7961
1815.9G51785202O62308M62570P3242M48532k4490Q17184j7547M88891J660233K96860
1825.6G56652985j238022L48511K212753K689285j077957k329788K91214k39258L9749
1834.3G57349472M92401M33808P92312r04693l6316n5542L47900J060410J671753K494659
$$ y = [728155823, 729245834, 725291748, 726175461, 729080505, 729236069, 729693069, 730647659, 732605362, 734121628, 734255295, 733823090, 734328079, 736355591, 736663284, 736121216, 736758881, 738158112, 738759842, 739991531, 742498016, 744976730, 745441132, 742765808, 743505020, 744421692, 744002533, 743876114, 745584564, 747581482, 746478500, 747379532, 747494202, 747176514, 747642059, 747652359, 748004990, 748537827, 749200668, 749679260, 751787109, 752114716, 751307373, 751337433, 751105270, 751883163, 751785202, 752447510, 752910080, 752983322, 753431854, 753407364, 754224548, 754207001, 754695892, 756356125, 756652985, 755414963, 755763474, 757976227, 760665512, 759587555, 757257767, 757548981, 757309723, 757349472, 757841873, 758275681, 759067993, 758163300, 758126984, 758071442, 758419342, 759479752, 761151505, 763646164]
1843.9G63646164k575378q85773N59234P87354o05011q47855L20588l8682O07834l87802
1853.6G60580673q3923l2578k05917N67093L30353M73175l75519M19693l9291j84021
1863.2G61449738K35519J03149J269532O67038J665725L40805j906356p89490m94004
1871.9G62541656L9216j17569L98559m00848k1897L75672J19018L10059j86462O57196
1881.5G63714600L26538N42297P4692m75998P7438p5989J149140J311798m28467j096039
1891.2G65120010R9411q3847L59574J319122q42056m36402J00098J94473j63269J6175
1900.8G65683289L80935n88989K95334Q1558N1727K49710M86680O27365J59301l47976
1910.4G67078934j415863L59039Q7280k27356K94876P2709J731567R3994j404037m05198
$$ y = [763646164, 761070786, 760185013, 760744247, 761531601, 760926590, 760078735, 760399323, 760360641, 760968475, 760580673, 760496750, 760464172, 760258255, 760825348, 761155701, 761628876, 761253357, 761673050, 761633759, 761449738, 761685257, 761788406, 763057938, 763724976, 765390701, 765731506, 763825150, 763035660, 762541656, 762580872, 762463303, 762861862, 762461014, 762439117, 762814789, 762933807, 763243866, 763057404, 763714600, 764041138, 764583435, 764658127, 764182129, 764259567, 764183578, 765332718, 766644516, 766216049, 765120010, 765219421, 765135574, 765495148, 766814270, 765972214, 765535812, 765635910, 765830383, 765667114, 765683289, 766064224, 765475235, 765770569, 765852127, 765903854, 766153564, 766640244, 767267609, 767426910, 767078934, 765663071, 766022110, 766109390, 765882034, 766176910, 766249619, 767981186, 768075180, 766671143, 766265945]
1920.1G66265945L30964J258392N50690j227112j171112L87268O2332q9722j41906
1928.8G66225739K8533N25437O0425L36685m72870l24402p3395K05994L69263j84021
1938.4G66697388K52456j44119O07224N99517q16421l70255L57666k0752p97576K36969
1948.1G66602097J83486L29209J17416p2784L64456n7755J22757l95813j52664j91116
1957.7G66849289Q8348M45710J56478K46354o03104K80991K19650K17285Q43277l60947
1967.3G68383331q92715o97174K65350J89896J75171K61001J26267P9269k26288L20893
1977G67985001k97470k03400j37177j8234M4556l68881L60641k4033K35978K35824
1986.6G67812805N09491K91367p52716L45688O20574J01243p96128l87192m03671k97317
$$ y = [766265945, 766596909, 767855301, 768405991, 767178879, 766007767, 766395035, 766457367, 766367645, 766225739, 766254272, 766779709, 766840134, 767176819, 766703949, 766379547, 766306152, 766512146, 766881409, 766697388, 766949844, 766805725, 767412949, 768012466, 767196045, 766825790, 767183456, 767162704, 766365128, 766602097, 766785583, 767114792, 767232208, 767159424, 767523880, 767466125, 767588882, 767193069, 767040405, 766849289, 766937637, 767383347, 767539825, 767786179, 767183075, 767464066, 767683716, 767901001, 768744278, 768383331, 767490616, 766793442, 767058792, 767248688, 767423859, 767684860, 767811127, 767890396, 767664108, 767985001, 767687531, 767484131, 767346954, 767328720, 767373276, 767004395, 767365036, 767341003, 767576981, 767812805, 768322296, 768613663, 767860947, 768206635, 768827209, 768928452, 768132324, 767745132, 767341461, 767044144]
1996.3G67044144P14569K40402K79160n34897o17600j1444J14670p2937o95038o2866
2005.9G66398163k3041K42767P1793j20010j84632l91082K46887p6905j51138j67770
2015.6G65845032L84826q2779n96542j24435n71213K441j50070j33438l54538k90070
2025.2G63929214k3880m44870J18943n26810p7820K9068k20184r4757n34744l5019
2034.9G62119141m47388K7771j94473k97547J38855L3875L98102m88129p3547l16697
2044.5G60899963o49719l00674J33209N01938n10941M2191r4528q0491J20163n2413
2054.1G60008698J97906n66025J0681p7438o8207K33689K8305R8877o9580P22808K12937
2064.7G60732651p02057n06592M5776R7962j17951R4147M2114L56522k213K35367K77405
$$ y = [767044144, 767758713, 767999115, 768278275, 767743378, 767125778, 767114334, 767229004, 767156067, 766461029, 766398163, 766375122, 766617889, 766689682, 766569672, 766385040, 765993958, 766240845, 766163940, 766012802, 765845032, 766229858, 766147079, 765550537, 765426102, 764854889, 764857330, 764707260, 764573822, 764219284, 763929214, 763905334, 763460464, 763579407, 763052597, 762974777, 763003845, 762783661, 762688904, 762154160, 762119141, 761671753, 761699524, 761505051, 761207504, 761346359, 761380234, 761778336, 761290207, 761216660, 760899963, 760250244, 759949570, 760082779, 760584717, 760073776, 760115967, 760021439, 759940948, 760061111, 760008698, 760206604, 759640579, 759651260, 759573822, 759505615, 759739304, 759767609, 759866486, 759796906, 760519714, 760732651, 760030594, 759524002, 759569778, 759667740, 759549789, 759643936, 759686050, 760042572, 760040359, 760275726, 760553131]
2075.4G60553131j46255N3939L9368J84326m71496m86756k13089J48392Q8425k365
2085G59747620M41436j14746L39890K8839o5842N6381n76248k42538j52054L43018
2094.6G59805756L128K94418M60052j27182K25678O0120J80740k89078k21329K54288
2104.3G60646591K46277j52893l03116K75345r92L81546m8294k22015J67389M5013
2113.9G61034851J76926k73056M1122l87192l0822L86886M1352K87704K5101M19540
2123.6G61722412j71051k74887j32599k91901j21002J984M65927l36380K14462K23847
2133.2G61300812j07193M99725J92261J14364m83856k2430K136k05002k6855o4087
2142.9G61199875K19192j65405K72522J15433K95029L74984O9657j15128o28967J82571
$$ y = [760553131, 760406876, 760460815, 760500183, 760684509, 760213013, 759726257, 759513168, 759661560, 759749985, 759747620, 760189056, 760074310, 760414200, 760443039, 760377197, 760433578, 759857330, 759614792, 759462738, 759805756, 759808884, 760103302, 760563354, 760436172, 760661850, 760721970, 760902710, 760613632, 760392303, 760646591, 760892868, 760739975, 760436859, 760712204, 760711212, 761092758, 761044464, 760822449, 760989838, 761034851, 761211777, 760938721, 760979843, 760592651, 760561829, 760948715, 760990067, 761277771, 761302872, 761722412, 761551361, 761276474, 761143875, 760851974, 760730972, 760732956, 761198883, 760862503, 761076965, 761300812, 761193619, 761693344, 761885605, 761999969, 761516113, 761493683, 761495819, 761290817, 761263962, 761199875, 761419067, 761253662, 761526184, 761641617, 761936646, 762311630, 762381287, 762266159, 761637192, 761819763]
2152.5G61819763k13013j59149J2894J21307L68576j69601M59137J068J09253J08566
2162.1G62458801k0675K29110k07672K51618J19934N56946J4724m14047K75726J84632
2171.8G63449097J58233l30429N5771L01285P98263N21164l58734J51596M15268L03269
2181.4G65464783m68521K08664K82287k30713L82843M57764M78363j22223L78113K89001
2191.1G67120361L3570L95736j44119k86789l79257L82996K60772Q3466J33056o6528
2200.7G67533264K11563J15204P93305K80456r9792k20032m28543J07574O562K87094
2210.4G68586655L04794N13611J27258J01318K61612O9046M72794m39301l07006j09558
2220G69581223p935J47476p8735N27344L83529M78745J92947K70386o3172l36990R1782
$$ y = [761819763, 761606750, 761447601, 761460495, 761581802, 761950378, 761780777, 762239914, 762240982, 762350235, 762458801, 762438126, 762667236, 762459564, 762711182, 762831116, 763388062, 763402786, 762988739, 763264465, 763449097, 763607330, 763276901, 763332672, 763633957, 764432220, 764953384, 764594650, 764746246, 765161514, 765464783, 764996262, 765204926, 765487213, 765256500, 765639343, 766097107, 766575470, 766453247, 766831360, 767120361, 767153931, 767549667, 767405548, 767118759, 766739502, 767122498, 767383270, 767466736, 767599792, 767533264, 767744827, 767860031, 768653336, 768933792, 768834000, 768613968, 768185425, 768292999, 768299561, 768586655, 768891449, 769405060, 769532318, 769633636, 769895248, 769964294, 770437088, 769997787, 769690781, 769581223, 769573288, 769720764, 769642029, 770169373, 770552902, 771031647, 771224594, 771494980, 771431808, 771094818, 771186600]
2230.6G71186600n96314k54135k33993K37426L86582O3247M27552R2315M76609K02789
2240.3G71988678o3553k58331k49252j25809l09830Q6365j77307L14407K36816J39084
2249.9G71581268L85437P172j16196j67846M28619l46146m56390q1406k48565K48489
2259.5G71234436J02539M30222N07660K45056j79596q469l7994m36020j25122l6469
2269.2G71696243P11670j1978r4757K44827j69449M62418J46942Q8349n52521m66995
2278.8G72054749o562k975J92947l41873M66766M54636K16446k13013l29819L28904
2288.5G72820206k44980K9373l31802Q0413L41111j8692M63409j20163m8599L6468
2298.1G73006744K31858J1673k07749j29318j46255M03289j23062p934M00543Q37326
$$ y = [771186600, 770590286, 770336151, 770102158, 770339584, 770726166, 770789413, 771216965, 771309280, 771785889, 771988678, 771925125, 771666794, 771417542, 771291733, 770981903, 771068268, 770890961, 771205368, 771442184, 771581268, 771966705, 771973877, 771857681, 771689835, 772118454, 771772308, 771315918, 771234512, 770985947, 771234436, 771336975, 771767197, 772274857, 772519913, 772340317, 772331848, 772293854, 771857834, 771732712, 771696243, 772407913, 772395935, 772301178, 772546005, 772376556, 772838974, 772985916, 773074265, 772521744, 772054749, 772048187, 772045212, 772238159, 771896286, 772363052, 772817688, 773034134, 772821121, 772491302, 772820206, 772575226, 772604599, 772272797, 772353210, 772694321, 772675629, 773139038, 773018875, 772970276, 773006744, 773238602, 773250275, 773042526, 772913208, 772766953, 773170242, 773047180, 773039246, 773439789, 774277115]
2307.8G74277115O1264n00488N41458k15378l98636j45645J70975r6894M43726P60803
2317.4G74898300m29382P55462N52292P75986L12119p68662l6240o11114q3771M9362
2327.1G75414352R89533N89981m52576J51749J33667k976j002578O2027L9825m60510
2336.7G75462494m39301k78930L76510J40381J232910R6054N31922M36020k022095
2345.4G75535965j759033j087113n78231k26136N93338M00009O6452J90506L45612
2354.1G73481369O17905m78669Q32291R003L84903k17743j663895j90964q392J572723
2363.7G74338531k01492k32010p46841q46863Q15811o30569p05567j751327j250916
2372.4G68788757n66559p16400m77676q13675l15704k62070m58069j254196q60291
$$ y = [774277115, 774338379, 773837891, 774379349, 774163971, 773765335, 773619690, 773790665, 773693771, 774137497, 774898300, 774468918, 775224380, 775776672, 776552658, 776864777, 776096115, 776059875, 775448761, 775364990, 775414352, 776403885, 776993866, 776541290, 776693039, 776826706, 776823730, 775821152, 775883179, 775923004, 775462494, 775023193, 774744263, 775120773, 775261154, 776494064, 776590118, 777122040, 777558060, 775535965, 773776932, 772689819, 772111588, 771885452, 772478790, 772878799, 772945251, 773135757, 773481369, 774099274, 773620605, 774452896, 774461899, 774846802, 774629059, 772965164, 772774200, 772765808, 774338531, 774137039, 773905029, 773158188, 772311325, 773127136, 772496567, 771791000, 770039673, 768788757, 768222198, 767505798, 767028122, 766214447, 765898743, 765636673, 765178604, 763924408, 763064117]
2381.1G63064117j69448n70832o49643o00280k59400k02255K27661q2703j68838P3852
2390.7G60662231o02188j06048k78244m67224l87116m56619l9902j19858n4626k08740
2400.3G57941666k35596k30637j10550l97491l29895q316n35050M6998j84479n78003
2410G55378647k88696o2256J52511l34091m02527n79605L9673J7548p49588q28629
2419.6G52342987q77914k51465k20642M9896Q1482j40076l70788o72379l23334p26165
2429.3G48891602j59913j43432o77033l79715m35409k09885m45175m49448m34265j69296
2438.9G45388031q8882m70810k68402m47312m14963m85305l74527l85437m12369p6981
2448.6G41963043l38516k62985l21274n26276p67364o87943k29721o2866l02734m11225
$$ y = [763064117, 762894669, 762323837, 761674194, 761073914, 760814514, 760612259, 760839920, 760757217, 760588379, 760662231, 760060043, 759953995, 759675751, 759208527, 758821411, 758364792, 758324890, 758205032, 758150406, 757941666, 757706070, 757475433, 757364883, 756967392, 756637497, 756629181, 756094131, 756141129, 755956650, 755378647, 755089951, 755027695, 755180206, 754846115, 754443588, 753863983, 753903656, 753921204, 753171616, 752342987, 751465073, 751213608, 750992966, 751042862, 751124344, 750984268, 750613480, 749941101, 749617767, 748891602, 748731689, 748588257, 747911224, 747531509, 747096100, 746886215, 746441040, 745991592, 745557327, 745388031, 745299149, 744828339, 744559937, 744112625, 743697662, 743212357, 742837830, 742452393, 742040024, 741963043, 741624527, 741361542, 741040268, 740513992, 739746628, 739058685, 738828964, 738766098, 738463364, 738052139]
2458.2G38052139K15760l20206q07190n46799k58255j449o30875o61697k56882j21384
2467.8G34663162m52270n75486k23236j69830k92206l97186q0795m96826m97208j06735
2477.5G31371384m17786j10474L05100j00784q88291o09054n33600o52161p04498q49610
2487.1G26810226j33743j02234r1018n0507K96249K23694n77316n50232o31561o0578
2496.8G25132980k88467n30853r5215j79596j7471l91083r0866j37177l14789J6632
2506.4G23104095j11084k75726p88803p36847o53305j33133K3041m15268j47705j32523
2516.1G19732742j58615j67236L10135j37558j029740n97610j28479m56925p87429
2524.7G16579285j02158p629J8158n4169l76968l59574k27661J50986q12912r50546
$$ y = [738052139, 738267899, 737947693, 737140503, 736593704, 736335449, 736334000, 735703125, 735041428, 734784546, 734663162, 734210892, 733635406, 733412170, 733242340, 732950134, 732552948, 732472153, 731975327, 731478119, 731371384, 730953598, 730843124, 731148224, 731047440, 730159149, 729550095, 729016495, 728364334, 727659836, 726810226, 726676483, 726574249, 726483231, 726432724, 726728973, 726952667, 726375351, 725825119, 725193558, 725132980, 724844513, 724313660, 724218445, 724038849, 724021378, 723630295, 723539429, 723402252, 723087463, 723104095, 722993011, 722717285, 721928482, 721191635, 720538330, 720405197, 720428238, 720012970, 719865265, 719732742, 719574127, 719406891, 719717026, 719579468, 718549728, 717952118, 717823639, 717366714, 716579285, 716477127, 716469498, 716487656, 716433487, 716056519, 715696945, 715469284, 715620270, 714807358, 713856812]
2534.4G13856812o06690l18222K16751m12979l16696k99606j18256p4616k64740l97033
2544G11264725p04575k92435o76498m34952m45251o84586q9111J56250L06473n88227
2553.7G07811813q21075n76019l21045l28064p95059m42353k47345o3171m58069l62472
2563.3G03397141o3477k26975k08282m13284k78626q03985o48880l91694l76358j24206
2573F99861374m99878k84500k87705J04828k7466p25708p98111o09893j46790l45917
2582.6F96240234j97525m99115m65316q5526k34451J02997l26081p33795q77075m15497
2592.2F92508850j57547k49710k91138p36084J1063l1662l51028j93940m07715m83322
2601.9F89617767o80999l95050m54941m45862l18222k4109o0806p19223m64630m25415
$$ y = [713856812, 713250122, 712931900, 713148651, 712735672, 712418976, 712119370, 712001114, 711926498, 711661758, 711264725, 710560150, 710267715, 709591217, 709156265, 708711014, 708026428, 707937317, 708093567, 708400040, 707811813, 706990738, 706414719, 706093674, 705765610, 704970551, 704528198, 704280853, 704217682, 703759613, 703397141, 703333664, 703106689, 702898407, 702485123, 702206497, 701402512, 700753632, 700361938, 699985580, 699861374, 699361496, 699076996, 698789291, 698894119, 698866653, 698140945, 697342834, 696732941, 696586151, 696240234, 696042709, 695543594, 695078278, 694992752, 694758301, 694861298, 694535217, 693801422, 692924347, 692508850, 692351303, 692101593, 691810455, 691074371, 691085434, 691053772, 690702744, 690508804, 690101089, 689617767, 688936768, 688541718, 688086777, 687640915, 687322693, 687298584, 687237778, 686518555, 686053925, 685628510]
2611.5F85628510m81492l02963l41492q20388p55768k31476m99115n75943l92456j18179
2621.2F81109238o41861m82178K289p61261j065369j253357n53512k88315o36444l17078
2630.8F75112152k37350l08304p13806p08695r46274o45065k75345r42764j077652
2639.5F69256897r21707n99899m05961K8000j48010m59137n22308j148987q54950n93414
2649.1F63630524q37708r96628j60598j82648r31778l85971n23224k76871n99365o90994
2658.8F58044739j12000r11407j002045o90994n31616q08258n71900m27627p07932
2667.5F52280960p1335k12250m30755o14777m95987m45785r42459r12781o17065j03989
2677.1F47433777j80054j29013m64477q28782o04248n82885l99399m65012l00674p95441
$$ y = [685628510, 685147018, 684844055, 684502563, 683682175, 682926407, 682694931, 682195816, 681619873, 681227417, 681109238, 680467377, 679985199, 679987488, 679226227, 678160858, 676907501, 676353989, 676065674, 675429230, 675112152, 674874802, 674566498, 673852692, 673143997, 672197723, 671552658, 671277313, 670334549, 669256897, 668335190, 667735291, 667329330, 667357330, 667209320, 666750183, 666227875, 665078888, 664223938, 663630524, 662792816, 661796188, 661635590, 661452942, 660521164, 660135193, 659611969, 659335098, 658735733, 658044739, 657932739, 657021332, 656019287, 655328293, 654796677, 653988419, 653416519, 652988892, 652280960, 652209625, 651997375, 651566620, 650951843, 650455856, 650010071, 649067612, 648154831, 647537766, 647433777, 647253723, 647124710, 646660233, 645831451, 645227203, 644644318, 644244919, 643779907, 643479233, 642683792]
2686.8F42683792p68661l93906n58090l38211n22385K8687k37427p42150q16535r81255
2696.4F37353859l99056o93779l88984J42517L1586m65622p80259m01382p16972p07703
2706F32974205p77473q44460p12433o50024m22974k65503p9498n86777o77299p66182
2715.7F27191582p39441l67241n90324o29998l47023k9373p40242p85637j05896l09639
2725.3F22546768o30340m52881j60942q37899n82389l96843o31142j43585k87438m73861
2735F17949448o62117j02921m6387m26330k56272m78820o16989o81000j5602l85399
2744.6F14277611p02057L9596j94587l09334k62833l54347q36029o67839m32205k82135
2754.3F10275841m0627q91418m89311k74201n89676j11656J06888k213n60341p23800
$$ y = [642683792, 641915131, 641521225, 640963135, 640624924, 640102539, 640131226, 639893799, 639151649, 638335114, 637353859, 636954803, 636261024, 635872040, 636014557, 636046143, 635580521, 634800262, 634398880, 633681908, 632974205, 632196732, 631352272, 630639839, 629989815, 629566841, 629301338, 629221840, 628635063, 627957764, 627191582, 626452141, 626084900, 625494576, 624864578, 624517555, 624488182, 623747940, 622962303, 622856407, 622546768, 621916428, 621463547, 621302605, 620464706, 619882317, 619485474, 618854332, 618710747, 618423309, 617949448, 617287331, 617184410, 617138023, 616711693, 616455421, 615976601, 615359612, 614678612, 614663010, 614277611, 613575554, 613615150, 613420563, 613111229, 612848396, 612494049, 611658020, 610990181, 610557976, 610275841, 610235214, 609343796, 608854485, 608580284, 607990608, 607878952, 607985840, 607983627, 607423286, 606699486]
2763.9F06699486o45142k49710l16696m81224j93329j94283P9728k08283m32968n06706
2773.5F03550873q62236j104584o26793k69356p42569n12695q75893o82830p9689j58310
2783.2E97635918J6937o07338r48563q60824k4834k64931j462326r14116o07795m87480
2792.8E91474648p03736p37190n23186r85069r76524r48029j003990r57184m49409
2801.5E84190331q50678j599579q65364n59235p67288o13708n05600r35097j148453
2810.2E76345329j029052j236077j480636j157914n33447r82513j256104j140175j023903
2818.9E66505508j073455j650277j163902j021004j498565j461029j162606j068573
2826.6E56406097j521644j230812r02710j108628j288070j598015j565781j244163
$$ y = [606699486, 606054344, 605804634, 605487938, 605006714, 604813385, 604619102, 604698830, 604490547, 604057579, 603550873, 602688637, 601584053, 600957260, 600687904, 599945335, 599432640, 598556747, 597873917, 597794228, 597635918, 597652855, 597045517, 596096954, 595236130, 595211296, 594946365, 593484039, 592569923, 591962128, 591474648, 590770912, 590033722, 589510536, 588525467, 587548943, 586600914, 585596924, 584639740, 584190331, 583339653, 581740074, 580874710, 580315475, 579548187, 578934479, 578428879, 577493782, 576345329, 575316277, 574080200, 572599564, 571441650, 570908203, 569925690, 568669586, 567529411, 566505508, 565432053, 563781776, 562617874, 561596870, 560098305, 558637276, 557474670, 556406097, 554884453, 553653641, 552750931, 551642303, 550354233, 548756218, 547190437, 545946274]
2834.3E45946274j659317k053452j596718j731948j649819j684303k391586k160836
2842E31018295j926880k134437k409630k501488k394180k611198l087426k874832k081222
2850.7E08997002k099190k010765j671028j325074q15391q66890j043816r74235m94271
2859.4D97696342o90422j453018j414222j178513j541863j959457j825027j801644
2867.1D85832176j863785j945533j891518j872597j895294j982231k774582k319603
2874.8D69287033j530380j741829j859779k192727j962699j570549j596413j478539
2882.5D55354118j088714j006279j341896j218186r35402o04438p14570p29370n76095
2891.2D47139168q25234n16433k30256R2850L4218n08537q85391j082650m96177l09983
$$ y = [545946274, 544286957, 542233505, 540636787, 538904839, 537255020, 535570717, 533179131, 531018295, 529091415, 526956978, 524547348, 522045860, 519651680, 517040482, 513953056, 511078224, 508997002, 506897812, 504887047, 503216019, 501890945, 501075554, 500208664, 499164848, 498190613, 497696342, 497005920, 495552902, 494138680, 492960167, 491418304, 489458847, 487633820, 485832176, 483968391, 482022858, 480131340, 478258743, 476363449, 474381218, 471606636, 469287033, 467756653, 466014824, 464155045, 461962318, 459999619, 458429070, 456832657, 455354118, 454265404, 453259125, 451917229, 450699043, 449763641, 449159203, 448444633, 447715263, 447139168, 446313934, 445797501, 445567245, 445660095, 445694313, 445185776, 444300385, 443217735, 442721558, 442411575]
2900.8D42411575o75544q40989p42759q06313j029854p52716r58214j383934j445350
2909.5D33775902j057282j060829k023849j962548j700477k322235k623558k166100
2917.2D18859024j769791k400741k280312j741028j866798r43489o61736j212120q00438
2925.9D05182571o64634o82373m87557j22528J48354L34320R58862J259422J513825
2934.6D07440262J432113J492463J862068J978264K492904K354927K473069K603988
2942.3D24130058K451325K793884K684631K836113K496224K292442K469101K414208
2950D44567986K806091K734718K427292J945763K026977K428665K431870K412758K394371
2958.7D66176491K538185K253265K015152J872292K133140K248536J869201K112808
$$ y = [442411575, 441736031, 440895042, 440152283, 439345970, 438316116, 437563400, 436605186, 435221252, 433775902, 432718620, 431657791, 429633942, 427671394, 425970917, 423648682, 421025124, 418859024, 417089233, 414688492, 412408180, 410667152, 408800354, 407856865, 407195129, 405983009, 405182571, 404517937, 403835564, 403348007, 403225479, 403373833, 403708153, 404667015, 405926437, 407440262, 408872375, 410364838, 412226906, 414205170, 416698074, 419053001, 421526070, 424130058, 426581383, 429375267, 432059898, 434896011, 437392235, 439684677, 442153778, 444567986, 447374077, 450108795, 452536087, 454481850, 456508827, 458937492, 461369362, 463782120, 466176491, 468714676, 470967941, 472983093, 474855385, 476988525, 479237061, 481106262, 483219070]
2966.4D83219070K497406K384224J911621K385025K447358J850776J648064J542854
2974.1D99886398J759606J520691K024917K058411J629448K297096K158089J335068
2981.8E14669724Q75015J532593J847267J509819J190262R10034J128044J072388J218566
2990.5E25953712Q90503Q03337R06601J85547K78626P90176M62647l26538K50969N10482
3000.2E30706062k01530j20354J18866L77655L6774n17922p36465k72217j20048l44048
3009.8E28926773L6163m36363p28988j010628q62541k85378p38029p14646o74629p87277
3019.5E22724457q27980j193123j420288p09801k90146j236191j448745j190453r10721
3028.1E13497009o99196q87909j200523j487427j026191q07648j046982j207619j176414
$$ y = [483219070, 485716476, 488100700, 490012321, 492397346, 494844704, 496695480, 498343544, 499886398, 501646004, 503166695, 505191612, 507250023, 508879471, 511176567, 513334656, 514669724, 515544739, 517077332, 518924599, 520434418, 521624680, 522534714, 523662758, 524735146, 525953712, 526844215, 527647552, 528554153, 528739700, 529018326, 529808502, 530271149, 529944611, 530195580, 530706062, 530504532, 530384178, 530503044, 530880699, 530917473, 530399551, 529663086, 529390869, 529270821, 528926773, 528962936, 528526573, 527797585, 526786957, 525924416, 525639038, 524901009, 524186363, 523511734, 522724457, 521896477, 520703354, 519283066, 518573265, 518283119, 517046928, 515598183, 514407730, 513497009, 512797813, 511909904, 510709381, 509221954, 508195763, 507388115, 506341133, 505133514, 503957100]
3036.8E03957100j123123j058769j338692j232491m44183j132774j437607j266861
3044.5D94922600j565170j472321j624870j157952j110878j246872q90121q94165j372299
3053.2D83587952j625977j013451j196289j335792j440735j583099j291161j387825
3060.9D72713623j029434r15146q07762j320763j531868o74057j390114j773147j158753
3069.6D62112579j210899j685791j436119p71523r46273j244240j402397j381989q59680
3078.3D51173668o39610j630402j845169j186333j174583q79975j111335j486969j250038
3087D39969254r09729r53026j459427j767426j865081j320916j127433j094971p31163
3095.6D28740082r51195j508369j320649n32951j208076j477318j212998j392402r23310
$$ y = [503957100, 502833977, 501775208, 500436516, 499204025, 498759842, 497627068, 496189461, 494922600, 493357430, 491885109, 490260239, 489102287, 487991409, 486744537, 485854416, 484960251, 483587952, 481961975, 480948524, 479752235, 478416443, 476975708, 475392609, 474101448, 472713623, 471684189, 470769043, 469961281, 468640518, 467108650, 466434593, 465044479, 463271332, 462112579, 460901680, 459215889, 457779770, 457008247, 456061974, 454817734, 453415337, 452033348, 451173668, 450534058, 448903656, 447058487, 445872154, 444697571, 443817596, 442706261, 441219292, 439969254, 439059525, 438106499, 436647072, 434879646, 433014565, 431693649, 430566216, 429471245, 428740082, 427788887, 426280518, 424959869, 424426918, 423218842, 421741524, 420528526, 419136124, 418212814]
3104.3D18212814j341743j386795j175156j351738j141052j342011j248321j067581
3112D08158417j132698j080780j252747j450996j203270j102562j076203j430626j551322
3120.7C96877213n44549r02061j534500j334725j195487j033822j505546j238861q93021
3129.4C86694641j100273j568298j368523q33015j425858j013947q30040j254768j139488
3138.1C76160431j249580j353035j504097j431504j081886o98471j210213j365089
3145.8C66266556j042824j020622q49419j525459j362839j017303j135636j030044
3153.5C57282410j059609q64754j233100j226731j278686j057778q15849j055107q21495
3162.2C47869301j239243j058159r29946r42803q30803j147499j098595j446647j086045
$$ y = [418212814, 416871071, 415484276, 414309120, 412957382, 411816330, 410474319, 409225998, 408158417, 407025719, 405944939, 404692192, 403241196, 402037926, 400935364, 399859161, 398428535, 396877213, 396332664, 395430603, 393896103, 392561378, 391365891, 390332069, 388826523, 387587662, 386694641, 385594368, 384026070, 382657547, 381824532, 380398674, 379384727, 378554687, 377299919, 376160431, 374910851, 373557816, 372053719, 370622215, 369540329, 368841858, 367631645, 366266556, 365223732, 364203110, 363353691, 361828232, 360465393, 359448090, 358312454, 357282410, 356222801, 355358047, 354124947, 352898216, 351619530, 350561752, 349745903, 348690796, 347869301, 346630058, 345571899, 344641953, 343699150, 342868347, 341720848, 340622253, 339175606, 338089561]
3170.9C38089561j120948j429634q18711n77888q29201j290359r96857r20830j024666
3179.5C29080467o98356p10068j368370j398812l92227o10504j097641j204643q26416
3188.2C20773430p00569j027088p19758j273365j070804p70493r60693m79317p96470
3196.9C12974873j152745r69143n76496m68864m51794r58080j361370q75988o41423
3205.6C05518970o48441r15775n04952p83043j191673p29046r25998o91185p45259
3214.3B98383598p81936q50239m50535k48547j058826n79624q42991r50775o68469
3222.9B91951656n66597P6485p95441j062240m27857n56755j059055j079006m71211
3231.6B86009979j02272l31650j063366q12740n41687p98721p75299o53000q13446
$$ y = [338089561, 336968613, 335538979, 334720268, 334142380, 333313179, 332022820, 331025963, 330105133, 329080467, 328382111, 327672043, 326303673, 324904861, 324512634, 323902130, 322804489, 321599846, 320773430, 320072861, 319045773, 318326015, 317052650, 315981846, 315211353, 314250660, 313771343, 312974873, 311822128, 310852985, 310276489, 309807625, 309355831, 308397751, 307036381, 306160393, 305518970, 304870529, 303954754, 303449802, 302666759, 301475086, 300746040, 299820042, 299128857, 298383598, 297601662, 296751423, 296300888, 296052341, 294993515, 294413891, 293570900, 292620125, 291951656, 291385059, 291461544, 290666103, 289603863, 289176006, 288619251, 287560196, 286481190, 286009979, 285907707, 285576057, 284512691, 283699951, 283158264, 282359543, 281584244, 280931244, 280117798]
3240.3B80117798r90391k44694l50170p25078l97606m93336o09818q12683j004467
3249B74489555q93306n11685l23925l43323l82652j94340o36596j014824k75917o05316
3258.6B69307671q61493p51152n37204O2866j54171l78113o86188n72948p66850p23514
3268.3B63938904l38631o82678k85435k89669j92032o12220j245728n59292m37660
3276.9B59295559l66993k19975m43115q93802m76208N91j57051m07848o13327K92320
3286.6B56010151k45915r11693l48072l27225m58679q05493k65293l62815n92404k76031
3296.2B51416531l00179l32260o09665k00310m54330k04582p344q67633m99707m03900
3305.9B47536621l01952j41430j80130l05004p00989m10748j80416l52726n42011k80113
$$ y = [280117798, 279127407, 278882713, 278532543, 277807465, 277409859, 276916523, 276306705, 275494022, 274489555, 273596249, 273084564, 272760639, 272417316, 272034664, 271840324, 271203728, 270188904, 269912987, 269307671, 268446178, 267695026, 267157822, 267220688, 267066517, 266688404, 266002216, 265429268, 264662418, 263938904, 263600273, 262917595, 262632160, 262342491, 262150459, 261538239, 260292511, 259733219, 259295559, 258928566, 258708591, 258265476, 257371674, 256895466, 256896057, 256739006, 256331158, 255717831, 256010151, 255764236, 254852543, 254504471, 254177246, 253718567, 252913074, 252647781, 252284966, 251692562, 251416531, 251116352, 250784092, 250174427, 249974117, 249519787, 249315205, 249307861, 248440228, 247940521, 247536621, 247234669, 247093239, 246913109, 246608105, 245907116, 245496368, 245315952, 244963226, 244421215, 244141102]
3315.5B44141102m85459o72473j74809k67181m27933l84903k90813k14005l75805p61013
3325.2B40086708o52409l94859j47800O5498n05581l55816l98578q74386n97801j89763
3334.8B36035213j46312n36766l33214o16760p14302l90950o60419o56166l85742K79617
3344.4B31874199j80302p00092l32813j70975l8757k03896k55127o77891n66520k82307
3354.1B28465519m68140m86831p83329m73328j79882l04508n92041k43550L01419j55068
3363.7B25080261o34880o32725k2354O7978l4790k63195l96538m49276p33299j52683
3373.4B21828499l88699l51829j77861m72679k35824m79222j10244j32370q4305p1526
3383B19323940l62911K34890p8297k25906j27258j95484q5297l9959J26305m67034
$$ y = [244141102, 243655643, 242983170, 242808361, 242541180, 242113247, 241728344, 241437531, 241223526, 240847721, 240086708, 239434299, 239039440, 238891640, 238957138, 238451557, 238095741, 237697163, 236822777, 236224976, 236035213, 235888901, 235352135, 235018921, 234402161, 233687859, 233296909, 232636490, 231980324, 231594582, 231874199, 231693897, 230993805, 230660992, 230490017, 230451260, 230247364, 229992237, 229314346, 228747826, 228465519, 227997379, 227510548, 226727219, 226253891, 226074009, 225769501, 225177460, 224933910, 225235329, 225080261, 224445381, 223812656, 223790302, 223858280, 223823490, 223560295, 223163757, 222714481, 221981182, 221828499, 221439800, 221087971, 220910110, 220437431, 220201607, 219722385, 219612141, 219479771, 219395466, 219323940, 218961029, 219195919, 219117622, 218891716, 218764458, 218568974, 218483677, 218443718, 218570023, 218102989]
3392.7B18102989o86855J69849j92222j028900m7207L32641R2449k05135n62420N08290
3402.3B16483479L91502Q3218j46523m94022j54095l04775L71875M85554p3719l09868
3412B16332626m7378K82955M5814j67922m76609L67394M09355K1400K79999K29645
3421.6B17277279K26669m77314R6035M39263K47764J10569m47254K08073N31501L19443
3431.2B18532028j93558N818J97067M25415J196480M22974L376m43783l55339O02588
3440.9B20393066N70431M60701P13539M97093k04715M00200L88431L48358N50175P6675
3450.5B24193954P22046L56522n1479K72026Q72078P54470J87092N72491M01821J136398
3460.2B29417419O29464k71359M01344P93229J175651N74989M48933J83067N00412
$$ y = [218102989, 217416134, 217585983, 217393761, 216364861, 216317654, 216650295, 216742744, 216537609, 215975189, 216483479, 216874981, 216958199, 216811676, 216317654, 216163559, 215858784, 216230659, 216716213, 216642494, 216332626, 216285248, 216568203, 216614017, 216446095, 215969486, 216336880, 216746235, 216767635, 217047634, 217277279, 217503948, 217026634, 217122669, 217561932, 217809696, 217920265, 217473011, 217681084, 218212585, 218532028, 218338470, 218344288, 218541355, 218966770, 220163250, 220586224, 220589600, 220145817, 219790478, 220393066, 220963497, 221424198, 222137737, 222634830, 222430115, 222830315, 223218746, 223567104, 224117279, 224193954, 224916000, 225272522, 225221043, 225493069, 226365147, 227119617, 227306709, 227879200, 228281021, 229417419, 230046883, 229775524, 230176868, 230970097, 232145748, 232720737, 233169670, 233352737, 233853149]
3468.8B33853149J042748L94535O17638M04224O18610Q14915P10316P50541K24877
3477.5B39431553P10029J344700J286488L89728J28441O91109O12965M18834N35183
3486.2B45549030J094017J057988J069107J034298K42939L27682J332722J145534L99628
3494.9B53252945O15272R87683J035175N14412M86107M89826R22451J719151O63891
3503.6B60686913N40409J039638J152306P55710P48387J141433N37167J329727J092720
3512.2B69024410N56984Q45070R40533J268215J024246R24511M22382J025391J739540
3520.9B77771282J601715J012440J20010R48067J164723J838035J317558P52430J267510
3529.6B87793770O61011J169967J125469R29928N40047J396961J971150O62193J267338
$$ y = [233853149, 234895897, 235290432, 235908070, 236312294, 236930904, 237745819, 238456135, 239206676, 239431553, 240141582, 241486282, 242772770, 243162498, 243290939, 243982048, 244595013, 245013847, 245549030, 246643047, 247701035, 248770142, 249804440, 250047379, 250375061, 251707783, 252853317, 253252945, 253868217, 254855900, 255891075, 256405487, 256891594, 257381420, 258303871, 260023022, 260686913, 261227322, 262266960, 263419266, 264174976, 264923363, 266064796, 266601963, 267931690, 269024410, 269581394, 270426464, 271366997, 272635212, 273659458, 274583969, 275006351, 276031742, 277771282, 279372997, 280385437, 280505447, 281453514, 282618237, 284456272, 285773830, 286526260, 287793770, 288454781, 289624748, 290750217, 291680145, 292220192, 293617153, 295588303, 296250496, 297517834]
3538.3B97517834J354675J488400J056823J198712J584034J254100J607953R93595
3546C08056126J816463N60093P69463K068405K195072K775192J016064J174831P25403
3554.7C21157112J072083J922264J261062K089348J262856J341095J715698K975731
3562.4C34797249K826958J583175L666115J176643J013375J645813k7275K591972K402039
3571.1C51676064K132682K075386K338143J707916J874809K482109J675568K741203
3578.8C68703880K184105J618157K369041L186188K555809J457138M017906L131600
3586.5C89223824J122894K250442q8157K467880L605308L691216K695465J322556K845649
3595.2D09137077J240692K906495M102630K197571L597488J715279O86150K862510
$$ y = [297517834, 298872509, 300360909, 301417732, 302616444, 304200478, 305454578, 307062531, 308056126, 309872589, 310432682, 311202145, 313270550, 315465622, 318240814, 319256878, 320431709, 321157112, 322229195, 324151459, 325412521, 327501869, 328764725, 330105820, 331821518, 334797249, 337624207, 339207382, 342873497, 344050140, 345063515, 346709328, 346682053, 349274025, 351676064, 353808746, 355884132, 358222275, 359930191, 361805000, 364287109, 365962677, 368703880, 370887985, 372506142, 374875183, 378061371, 380617180, 382074318, 386092224, 389223824, 390346718, 392597160, 392509003, 394976883, 398582191, 402273407, 404968872, 406291428, 409137077, 410377769, 413284264, 417386894, 419584465, 423181953, 424897232, 425583382, 428445892]
3602.9D28445892K097817J879196L444481M071045J751480L705482J288109o0348N852775
3611.6D52475929K875901Q20846M244652N49240L158455M347420K271080J782150J53541
3620.3D72679214J631546K705460K900963K859955L343506L490638L575478O875343
3628E00062103M471092p532691P48748L368225N113869K635155m49333K052269K899131
3636.6E13368568K726975J201591J592675K883873L207931K003822R73397K739143
3644.4E30697975M070740N819511J687241p76520N897179J572342j107064j728744
3652.1E46132660K268677K914161M018250N820923m847489J87149L670617J755561
3659.8E61920509J966095J158905K041931J367188J940269J589356J561584M800873
$$ y = [428445892, 430543709, 432422905, 435867386, 439938431, 441689911, 445395393, 446683502, 446623154, 452475929, 455351830, 456172676, 460417328, 460966568, 464125023, 468472443, 470743523, 472525673, 472679214, 474310760, 477016220, 479917183, 482777138, 486120644, 489611282, 493186760, 500062103, 504533195, 497000504, 497749252, 501117477, 506231346, 508866501, 508417168, 510469437, 513368568, 516095543, 517297134, 518889809, 521773682, 524981613, 526985435, 527958832, 530697975, 534768715, 540588226, 542275467, 541498947, 547396126, 548968468, 547861404, 546132660, 548401337, 551315498, 555333748, 561154671, 556307182, 556494331, 560164948, 561920509, 563886604, 565045509, 567087440, 568454628, 570394897, 571984253, 573545837, 578346710]
3667.5E78346710M044647L814583J658287o365852Q81195N978050P876435L099327
3675.2E99333382j2632065J88904N394096L753777j244126k72484J807404J552849
3682.9E97881737J255035J245499J412697M521942O856384n370140k036743O428566
3690.6F12194977m519119q42095L413506N40123J676674J106224L52821J147652P02743
3699.3F15773506L027039L532104l328209j468658L480453J310845L64570P59926K645989
3708F26097565L889389l979416L630752M470787j0894317K603950L671418N49469N97190
3716.7F30636787J765900J788673j455383J041260M388275j181526k416306L345986
3724.4F37913666J039428O37589j719971r77668K260932J443406N336685o75202m311523
$$ y = [578346710, 582391357, 586205940, 587864227, 581498375, 582379570, 588357620, 596234055, 599333382, 586701317, 586890221, 592284317, 596038094, 594793968, 594521484, 596328888, 597881737, 599136772, 600382271, 601794968, 606316910, 613173294, 607803154, 605766411, 612194977, 607675858, 606833763, 610247269, 610787392, 612464066, 613570290, 613923111, 615070763, 615773506, 618800545, 622332649, 619004440, 617535782, 621016235, 622327080, 622691650, 623451576, 626097565, 629986954, 626007538, 629638290, 634109077, 623214760, 625818710, 629490128, 630039597, 630636787, 632402687, 634191360, 632735977, 633777237, 638165512, 636983986, 634567680, 637913666, 638953094, 639590683, 637870712, 636893044, 639153976, 640597382, 645934067, 645258865, 640947342]
3733.1F40947342P936706K554932n719376j710891J185150N85556J293411L199616
3740.8F50272446k835923J557312Q930512r128876r419517P928352L728790N348740
3748.5F56381836m0360n182418R573745n269241p825317L240966K400284K300415l366012
3757.2F52213898K325973N794068n286560l106232K883224J518936M37623L839798
3764.9F60620728r85871n370712J784210M790955J354141p076187J197357K451782
3772.6F58766403k91672N51987P02438J401520K10419K235718J449966n586700R08508
3781.3F60348587J698227J127624K551728j608505j756135Q29316P71484J21155m09699
3790F63673782K67334P43866P82547J64109J767959L770447j153717k935181P68357
$$ y = [640947342, 648884048, 651438980, 645719604, 644008713, 645193863, 645779419, 647072830, 650272446, 647436523, 648993835, 657924347, 648795471, 639375954, 647304306, 651033096, 656381836, 656341476, 651159058, 660732803, 655463562, 647638245, 650879211, 653279495, 655579910, 652213898, 654539871, 660333939, 655047379, 651941147, 654824371, 656343307, 656780930, 660620728, 659634857, 654264145, 656048355, 660839310, 662193451, 655117264, 656314621, 658766403, 658474731, 659026718, 659729156, 661130676, 661341095, 663576813, 665026779, 659440079, 660348587, 662046814, 663174438, 665726166, 664117661, 662361526, 663190842, 663962326, 664083481, 663673782, 663941116, 664684982, 665467529, 665631638, 667399597, 671170044, 670016327, 667081146, 667849503]
3798.7F67849503L241806O342315k774124q542633P92160Q64182M648895N483551p011185
3807.3F70894470l249206K701568R88007L09601N1803M23432J699447M514542J004257
3816F79337921r478378K515564M665069N164872M352035j3504562j167984L015671
3823.7F74900208J090850K601548Q41751l689652n77469J089249K631912K225113o357040
3832.4F74756470J507415O536332k766114m50592O611176n549698l418732O426926
3840.1F83653183m300232j599579M818497k98843k761384L50190L04184L63006J555405
3848.8F82084427k15225K396087O334381j826171j810227j3045730K015075P968903
3856.5F83901520p66525k122498M35638J202317L184280j947937J64337N622177l665390
$$ y = [667849503, 671091309, 677433624, 674659500, 666116867, 666909027, 667773209, 672422104, 677905655, 670894470, 667645264, 670346832, 671334839, 671644440, 671696243, 672119675, 673819122, 678333664, 679337921, 669859543, 672375107, 677040176, 682205048, 686557083, 673052521, 671884537, 674900208, 675991058, 678592606, 679434357, 675744705, 675167236, 676256485, 678888397, 681113510, 674756470, 676263885, 682800217, 680034103, 679583511, 686194687, 680644989, 677226257, 683653183, 679352951, 677753372, 682571869, 682273026, 679511642, 679861832, 680166016, 680529022, 682084427, 681869202, 684265289, 690599670, 688773499, 686963272, 673917542, 675932617, 683901520, 683134995, 681012497, 681448135, 682650452, 685834732, 683886795, 684051132, 689673309, 686007919]
3865.2F86007919n385055J879425M101257O933746k955017p997360J036835M351120
3872.9F87972870L424148q657989l00369K236557m45557K576447N106124j747894o473083
3881.6F83691254L150177N64804J538696M181137j0009918m2572K567062R36890L733063
3890.3F90310593J095657n264359m15115J612702j439744P25098J440811K927780K361527
3898.9F93354950o786728L788452K063370m191666L767472n39627k241135k128906
3906.7F87086182o10810J633454m35868q07037n7373N36728L87268N07278J944504
3915.3F90184326K479019k742233m062500L022385J091537k944717J309433J657867
3923.1F89995117J224823j173172k886810N53589J252746J891175o22025q85239K655335
$$ y = [686007919, 680622864, 682502289, 686603546, 693537292, 690582275, 682584915, 683621750, 687972870, 691397018, 682739029, 682438660, 684675217, 684229660, 686806107, 691912231, 690164337, 683691254, 686841431, 687406235, 688944931, 693126068, 683116150, 683073578, 685640640, 686577530, 690310593, 691406250, 686141891, 685726776, 687339478, 685899734, 686624832, 688065643, 690993423, 693354950, 686568222, 690356674, 692420044, 688228378, 691995850, 691456223, 689215088, 687086182, 686475372, 688108826, 687672958, 686865921, 686808548, 687345276, 687732544, 688239822, 690184326, 692663345, 689921112, 685858612, 688880997, 689972534, 687027817, 688337250, 689995117, 691219940, 690046768, 687159958, 687713547, 688966293, 690857468, 690235443, 689350204, 692005539]
3931.7F92005539j710510k105408M96750P3471O93588K11487L6240j02997k3499J983032
3941.4F91557693J527176l491363j436234R74732Q40606J651078q92334Q02307N14221
3950.1F92047882j563263J610947l73993j168671m50592n8746Q09173l33709K68783
3958.7F90787811j52435M30450K74735j246872K16827O53382l71170j048584M09164
3967.4F89953308J217499J48468k59476N63278J90583j217652R2087P01599J1444n11093
3977.1F90890045l89099M9057K06757J022415L68652N6152N2872o19659q35266l78037
3986.7F90423889M24194j81045K42004O87333K7084n9357J19782M89502k31400n11703
3996.3F91430283K36511M32434j09100j80512
$$ y = [692005539, 690295029, 688189621, 688686371, 688759842, 689453430, 689664917, 689701157, 689598160, 689574661, 691557693, 693084869, 689593506, 688157272, 689132004, 689972610, 691623688, 690731354, 691533661, 692047882, 690484619, 692095566, 691721573, 690552902, 690102310, 690043564, 690852737, 690519028, 690787811, 690635376, 691065826, 691340561, 690093689, 690310516, 690963898, 690592728, 689544144, 689953308, 691170807, 691319275, 691059799, 691623077, 691813660, 690596008, 690688095, 691389694, 691401138, 690890045, 690500946, 690550003, 690756760, 691779175, 692147827, 692203979, 692256851, 691637192, 690801926, 690423889, 690848083, 690667038, 690909042, 691596375, 691623459, 691564102, 691683884, 692173386, 691941986, 691430283, 691666794, 692099228, 691990128, 691809616]
4000.2F91809616
$$ y = [691809616]
##END=$$ End of the data block
