##TITLE=$$ Begin of the data block
##JCAMP-DX=5.00 $$ ACD/SpecManager v 10.08
##SPECTROMETER/DATA SYSTEM=Varian
##DATE=20 Nov 2012 10:20:34
##DATA TYPE=INFRARED SPECTRUM
##DATA CLASS=XYDATA
##ORIGIN=
##OWNER=
##NPOINTS=3735
##FIRSTX=399.26403809
##LASTX=4000.35498047
##MAXX=4000.35498047
##MINX=399.26403809
##MAXY=77.88259888
##MINY=18.57231140
##XFACTOR=1.0000000000
##YFACTOR=0.000000100000000
##FIRSTY=50.08576584
##DELTAX=0.96440572
##XUNITS=1/CM
##YUNITS=TRANSMITTANCE
##XYDATA=(X++(Y..Y))
$$ plain form
399.3 500857658 505803223 502254868 494656982 490368919 490382881 491942482 486458092 480227890 482505302
407.9 482505302 480977974 481826363 480386810 471892662 466375160 469336700 481183434 486019936
415.7 486019936 491674919 500175171 504070816 498371964 484680328 483429260 482502975 481914062 483315735
424.3 483315735 486330872 487175255 480829964 475487099 469811897 468392258 470517654 471592827 469077835
433 469077835 466970901 471142960 473699913 471385689 463284874 461329803 465250092 466061897 463058395
441.7 463058395 461507263 468611298 466970749 468030891 475617409 475643387 477198372 477311478 477172890
450.4 477172890 478514709 480232239 478050270 472379951 475510750 481193466 479959641 470737419
458.1 470737419 472448196 474683342 476100426 482710342 481497421 476429863 476739845 476461830 472087440
$$ packed form
399.3E00857658M945565l548355p597886m288063J3962J559601n484390o230202K277412
407.9D82505302j527328Q48389j439553q494148n517502K961540J1846734M836502
415.7D86019936N654983Q500252L895645n698852j3691636j251068r26285n88913J401673
424.3D83315735L015137Q44383o345291n342865n675202j419639K125396J075173k514992
433D69077835k106934M172059K556953k314224q100815j955071L920289Q11805l003502
441.7D63058395j551132P104035j640549J060142P586518K5978J554985J13106j38588
450.4D77172890J341819J717530k181969n670319L130799N682716j233825r222222
458.1D70737419J710777K235146J417084O609916j212921n067558L09982k78015m374390
$$ plain form
466.8 472087440 468401299 466226692 465518379 468084450 467324486 464369125 463394890 458706055 452273331
475.5 452273331 450844078 452974739 452798004 450069466 450231972 454024048 455802116 454913025 450932732
484.1 450932732 452297707 452823219 448744469 448085175 448549080 452072639 449754028 447079964 452550430
492.8 452550430 452483788 448669128 446156006 446891479 443612137 436942368 434798813 436513596 437433891
501.5 437433891 436207275 438260689 438285255 437925797 435329361 431644211 431252251 431231079 432062302
510.2 432062302 426599045 424652901 424598122 419891205 418022652 415561295 413519058 411216087 409461403
518.9 409461403 407118607 405734177 404679794 402208099 402913132 402884598 404811897 404156075 399418755
527.5 399418755 397672920 397337990 397564812 398259048 400246010 401153984 402099266 402333908 403290482
$$ packed form
466.8D72087440l686141k174607p08313K566071p59964k955361r74235m688835o432724
475.5D52273331j429253K130661j76735k728538J62506L792076J778068q89091l980293
484.1D50932732J364975N25512m078750o59294M63905L523559k318611k674064N470466
492.8D52550430o6642l814660k513122P35473l279342o669769k143555J714783R20295
501.5D37433891j226616K053414K4566l59458k596436l685150l91960k1172Q31223
510.2D32062302n463257j946144n4779m706917j868553k461357k042237k302971j754684
518.9D09461403k342796j384430j054383k471695P05033k8534J927299o55822m737320
527.5C99418755j745835l34930K26822O94236J986962R07974R45282K34642R56574
$$ plain form
536.2 403290482 405712852 406804085 408967171 410834579 412717056 414119072 416684685 419002151
543.9 419002151 419201736 421733856 422549210 421278877 420235176 419971886 419798546 418523636 417838249
552.6 417838249 416579704 416433182 416900177 416965599 415019150 413101921 412735558 409570389 407610664
561.3 407610664 407517204 407335320 404703178 401231956 399659920 397079659 394262047 390754051 388213577
570 388213577 384290886 382190552 382413597 380109863 380201149 381090584 381658669 381135254 381483345 383285599
579.6 383285599 385491295 388643074 390970535 393736458 395649185 399045563 401534195 403116035
587.3 403116035 405468979 406519012 409645195 411898804 411489944 410917282 412239227 413231010 411347275
596 411347275 410494499 409765701 409657326 411223564 412353401 410949364 410039215 411235886 411795197
$$ packed form
536.2D03290482K422370J091233K163086J867408J882477J402016K565613K317466
543.9D19002151J99585K532120Q15354j270333j043701k63290j73340j274910o85387
552.6D17838249j258545j46522M66995O5422j946449j917229l66363l165169j959725
561.3D07610664r3460j81884k632142l471222j572036k580261k817612l507996k540474
570C88213577l922691k100334K23045k303734R1286Q89435N68085n23415L48091J802254
579.6C83285599K205696L151779K327461K765923J912727L396378K488632J581840
587.3D03116035K352944J050033L126183K253609m08860n72662J321945R91783j883735
596D11347275q52776p28798j08375J566238J129837j404037r10149J196671N59311
$$ plain form
604.7 411795197 412781754 412130051 411595764 412222404 412718010 412672424 411896439 412930298 412717209 413521957
614.3 413521957 415643234 416877022 418101273 418000221 418839111 419888458 421635590 423209267 423939896
623 423939896 425593719 427679634 430101814 431430054 432765465 433511620 433873062 435273514 436941147
631.7 436941147 438321342 438601189 438924065 438674774 439191017 441165733 442666702 443836975 444170876
640.4 444170876 443793983 443889961 444830971 445621910 447368698 449321098 450198021 451067467 451904907 453623581
650 453623581 454695396 454717751 454759216 456197472 457518044 457072716 458941460 460959892 461281281 460797997
659.7 460797997 460002060 460008125 459796982 460623779 461125870 461900215 463907051 465853119 469101219 467787857
669.3 467787857 467196350 467673988 468980484 470163689 470585327 471015091 471186752 471890869 472608643
$$ packed form
604.7D11795197R86557o51703n34287O26640M95606m5586p75985J033859k13089Q04748
614.3D13521957K121277J233788J224251j01052Q38890J049347J747132J573677P30629
623D23939896J653823K085915K422180J328240J335411P46155L61442J400452J667633
631.7D36941147J380195K79847L22876k49291N16243J974716J500969J170273L33901
640.4D44170876l76893R5978R41010P90939J746788J952400Q76923Q69446Q37440J718674
650D53623581J071815K2355M1465J438256J320572m45328J868744K018432L21389m83284
659.7D60797997p95937O065k11143Q26797N02091P74345K006836J946068L248100j313362
669.3D67787857n91507M77638J306496J183205M21638M29764J71661P04117P17774
$$ plain form
678 472608643 473082428 474030190 475671997 477921066 479052582 479448738 480656052 480860710 479541206
686.7 479541206 479897728 480609436 479492111 479350319 480030632 480156555 480962639 481693802 480411682
695.3 480411682 479280968 479028931 477354698 475249290 474356918 474008064 472850494 472201004 472421989
704 472421989 472552643 472486305 471462326 471276131 471694412 471482086 471351051 471407776 472275734 474314880
713.7 474314880 477126732 479097977 480692177 483468285 487256775 490897827 492786407 494082985
721.4 494082985 496597214 499782982 502985649 505150337 506531906 509232407 512455177 514351349
729.1 514351349 516354561 519307632 521469765 523135490 524618797 525487938 526407394 527326088 529138451
737.8 529138451 530714035 531377983 532450714 533455467 534111671 533583374 533140793 533816757 533621140
$$ packed form
678D72608643M73785R47762J641807K249069J131516L96156J207314K04658j319504
686.7D79541206L56522P11708j117325j41792O80313J25923Q06084P31163j282120
695.3D80411682j130714k52037j674233k105408q92372l48854j157570o49490K20985
704D72421989J30654o6338j023979j86195M18281k12326j31035N6725Q67958K039146
713.7D74314880K811852J971245J594200K776108L788490L641052J888580J296578
721.4D94082985K514229L185768L202667K164688J381569K700501L222770J896172
729.1E14351349K003212K953071K162133J665725J483307Q69141R19456R18694J812363
737.8E29138451J575584O63948J072731J004753O56204n28297m42581O75964j95617
$$ plain form
746.5 533621140 532446671 531568909 531134567 530570221 529586754 528094215 526293449 524258003 522322388
755.1 522322388 520106392 517625122 515860252 513837242 511112823 509051285 508025513 507665634 507566109
763.8 507566109 506962051 506389961 506208916 505162621 504313545 505548706 507979469 510708733 513043022
772.5 513043022 515016632 517764091 521066818 523986092 526408348 529305878 532299118 535627556
780.2 535627556 539333191 542416954 545464172 548876152 552866669 557329979 561596451 564627533
787.9 564627533 567436028 571081657 574005814 575279770 576678162 579576454 582391281 584307251
795.6 584307251 585446205 587062950 589163361 591581955 593520966 593650246 594488029 595320435 595577431
804.3 595577431 596344604 597385330 598077583 597943954 597959862 597247467 596133575 595139351 593997726
$$ packed form
746.5E33621140j174469q77762m34342n64346r83467j492539j800766k035446j935615
755.1E22322388k215996k481270j764870k023010k724419k061538j025772l59879r9525
763.8E07566109o04058n72090j81045j046295q49076J235161K430763K729264K334289
772.5E13043022J973610K747459L302727K919274K422256K897530K993240L328438
780.2E35627556L705635L083763L047218L411980L990517M463310M266472L031082
787.9E64627533K808495L645629K924157J273956J398392K898292K814827J915970
795.6E84307251J138954J616745K100411K418594J939011J29280Q37783Q32406K56996
804.3E95577431P67173J040726O92253j33629J5908p12395j113892r94224j141625
$$ plain form
813 593997726 592313385 590869598 590674057 591381683 592131004 590864868 590166245 590962067 591842422 592195168
822.6 592195168 591336479 591273346 591086426 590514183 589185410 587576866 586734886 585902519 585259666 583121338
832.3 583121338 581308365 581052933 581013947 580129700 578034973 576171532 574549141 573230515 572167816
841 572167816 571837997 570937233 569440002 568231506 566761322 565455017 563343811 561499367 559320450
849.6 559320450 557343750 556060791 553380852 550763626 548993988 547480011 544142380 540961571
857.4 540961571 538718185 535418816 533481674 532235298 531700821 533020897 535126076 537780075 541765366
866 541765366 546879234 551455688 556828232 561871376 566079483 570858116 575375328 580116348 583543587
874.7 583543587 585921516 588118629 591368637 594257088 595232964 596426086 596511345 595961227 595204048
$$ packed form
813E93997726j684341j443787j95541P07626P49321j266136o98623P95822Q80355L52746
822.6E92195168q58689o3133j86920n72243j328773j608544q41980q32367o42853k138328
832.3E83121338j812973k55432l8986q84247k094727j863441j622391j318626j062699
841E72167816l29819r00764j497231j208496j470184j306305k111206j844444k178917
849.6E59320450j976700j282959k679939k617226j769638j513977l337631l180809
857.4E40961571k243386l299369j937142j246376n34477J320076K105179K653999L985291
866E41765366N113868M576454N372544N043144M208107M778633M517212M741020L427239
874.7E83543587K377929K197113L250008K888451R75876J193122Q5259n50118p57179
$$ plain form
883.4 595204048 594124756 592034721 589020615 586634636 584260406 581730042 579058342 576837387
891.1 576837387 574583702 571787376 568393517 565610123 563837585 561254425 558207054 555607376
898.8 555607376 553805161 551512909 549372215 548004570 546021080 543542938 540523567 537108002
906.5 537108002 532785797 528785934 525350914 521420250 517011414 511763382 506710472 501781921
914.3 501781921 497143898 492771721 487906342 482949371 478416176 474444771 470737305 467572174
922 467572174 465834656 465285645 465029144 464356956 463623466 464094467 464374847 464022713 464411621 465539436
931.6 465539436 466601028 467415581 468792458 470491066 472658844 474912186 476864891 478274307 479301453
940.3 479301453 481774063 484019012 485178528 487284241 489226952 489697495 488913727 487712212 486581993
$$ packed form
883.4E95204048j079292k090035l014106k385979k374230k530364k671700k220955
891.1E76837387k253685k796326l393859k783394j772538k583160l047371k599678
898.8E55607376j802215k292252k140694j367645j983490k478142l019371l415565
906.5E37108002m322205l999863l435020l930664m408836n248032n052910m928551
914.3E01781921m638023m372177m865379m956971m533195l971405l707466l165131
922D67572174j737518n49011k56501o72188p33490M71001K80380l52134L88908J127815
931.6D65539436J061592Q14553J376877J698608K167778K253342J952705J409416J027146
940.3D79301453K472610K244949J159516K105713J942711M70543p83768j201515j130219
$$ plain form
949 486581993 484659958 481560974 477147751 472602234 468295441 462896347 456705551 450873718 444647141
957.7 444647141 437730789 431030998 424521408 418073807 410977859 404067345 396933746 389009895
965.4 389009895 380959702 373316536 365467720 356465683 348529358 340388756 331887665 322388802
973.1 322388802 312429676 303835869 294321117 285509415 276706696 268477993 260121174 252080173
980.8 252080173 245214214 237993298 232524376 226699715 222052765 217262459 212982197 210028973
988.5 210028973 206643810 204744453 202168789 200873737 198991966 197497196 196944237 196180649 196640606
997.2 196640606 196007442 195732517 194367199 194081821 194047508 193899555 194035816 192970486 193911152 193475056
1006.8 193475056 193327522 192432060 191108875 190596428 189413471 189243755 187505016 187435131 186872387
$$ packed form
949D86581993j922035l098984m413223m545517m306793n399094o190796n831833o226577
957.7D44647141o916352o699791o509590o447601p095948o910514p133599p923851
965.4C89009895q050193p643166p848816r002037p936325q140602q501091r498863
973.1C22388802r959126q593807r514752q811702q802719q228703q356819q041001
980.8B52080173o865959p220916n468922n824661m646950m790306m280262k953224
988.5B10028973l385163j899357k575664j295052j881771j494770n52959p63588M59957
997.2A96640606o33164k74925j365318k85378l4313j47953J36261j065330R40666m36096
1006.8A93475056j47534q95462j323185n12447j182957j69716j738739o9885n62744
$$ plain form
1015.5 186872387 186403370 186400623 185723114 187104740 187454929 188524971 188687687 189451427 190022335 190726814
1025.2 190726814 192928200 193635464 195541115 196094475 198001442 199421139 200069141 201719971 202356396
1033.8 202356396 204647121 205177059 205602627 205013008 204667130 204459095 203404732 204153061 203840904
1042.5 203840904 204476738 203116322 203217659 204033470 203767319 204803028 204102364 205131836 204867897
1051.2 204867897 206328697 208808727 211213055 214004459 215473461 219733810 221787987 224825706
1058.9 224825706 227956219 230839958 234597874 237372761 241622696 244284992 248056812 250093822
1066.6 250093822 252009525 253619938 252125740 250452290 246608143 243424149 238712215 235357418
1074.4 235357418 233381348 231314793 230022602 227534771 228041039 227678261 228858910 230543518 232427998
$$ packed form
1015.5A86872387m69017k747o77509J381626L50189J070042J62716P63740N70908P04479
1025.2A90726814K201386P07264J905651N53360J906967J419697O48002J650830O36425
1033.8B02356396K290725N29938M25568n89619l45878k08035j054363P48329l12157
1042.5B03840904O35834j360416J01337Q15811k66151J035709p00664J029472k63939
1051.2B04867897J460800K480030K404328K791404J469002M260349K054177L037719
1058.9B24825706L130513K883739L757916K774887M249935K662296L771820K037010
1066.6B50093822J915703J610413j494198j673450l844147l183994m711934l354797
1074.4B35357418j976070k066555j292191k487831N06268l62778J180649J684608J884480
$$ plain form
1083 232427998 234807587 236023026 239956627 242278595 245451660 248040543 251215496 255437050 258439732
1091.7 258439732 262067966 264034367 267522316 269541340 271214085 272265644 272165394 273834476
1099.4 273834476 274338131 275199547 274714527 274966869 275133533 275100403 275409489 275162029 277308331 278728218
1109.1 278728218 281289749 283121548 285566616 288904266 290785255 293691502 295919933 298927326
1116.8 298927326 300274200 302212105 304307823 305125351 307174129 308117809 309205608 309251785 310721645
1125.5 310721645 312122326 313125401 315411339 316719284 319197903 320990601 323221321 324572754
1133.2 324572754 325380859 326764984 327483330 327993965 326705627 326266670 324496880 322144356 319670162
1141.9 319670162 316724796 314750271 311397419 309771671 307447090 304969234 302752838 301003113
$$ packed form
1083B32427998K379589J215439L933601K321968L173065K588883L174953M221554L002682
1091.7B58439732L628234J966401L487949K019024J672745J051559j00250J669082
1099.4B73834476N03655Q61416m85020K52342J66664l3130L09086k47460K146302J419887
1109.1B78728218K561531J831799K445068L337650J880989K906247K228431L007393
1116.8B98927326J346874J937905K095718Q17528K048778R43680J087799M6177J469860
1125.5C10721645J400681J003075K285938J307945K478619J792698K230720J351433
1133.2C24572754Q08105J384125P18346N10635j288338m38957j769790k352524k474194
1141.9C19670162k945366j974525l352852j625748k324581k477856k216396j749725
$$ plain form
1149.6 301003113 299982185 297234077 297473965 297185249 296216469 295390301 295122337 296249733 297188683
1158.3 297188683 300030346 301858978 304269676 306750755 309895077 313681602 317574196 323225975
1166 323225975 328041954 334183044 339939232 346644592 353909531 360659637 368541527 375586433 383032951
1174.6 383032951 389619827 396300774 402798080 408614807 414859161 421264420 427555351 432507553
1182.4 432507553 437897072 443222542 448174706 452800331 456461754 459588203 462010345 464610062
1190.1 464610062 466935081 468469315 469538040 470618935 471632576 472532578 473702164 474336243 474571762
1198.8 474571762 474642639 474471855 474047585 473920555 474402428 474603004 475011292 475976982 477208633 478360977
1208.4 478360977 479609871 480855446 482156715 483904915 485209503 486317749 487310066 488178406 489209633
$$ packed form
1149.6C01003113j020928k748108K39888k88716r68780q26168k67964J127396R38950
1158.3B97188683K841663J828632K410698K481079L144322L786525L892594N651779
1166C23225975M815979O141090N756188O705360P264939O750106P881890P044906P446518
1174.6C83032951O586876O680947O497306N816727O244354O405259O290931M952202
1182.4D32507553N389519N325470M952164M625625L661423L126449K422142K599717
1190.1D64610062K325019J534234J068725J080895J013641R00002J169586O34079K35519
1198.8D74571762P0877j70784m24270j27030M81873K00576M08288R65690J231651J152344
1208.4D78360977J248894J245575J301269J748200J304588J108246R92317Q68340J031227
$$ plain form
1217.1 489209633 490497017 491722717 492410316 492956390 492563858 491453285 491056328 490865097 489980240
1225.8 489980240 489050369 488274345 486917648 485712509 484828682 484075851 483631935 482154579 480334396
1234.4 480334396 479417725 478530617 477277756 476290207 475871620 475309143 474988708 475508575 476010208
1243.1 476010208 475637589 474971619 474576912 474647331 475250626 475855789 476632385 477406807 478330917 479411430
1252.8 479411430 480175858 480668945 481047554 481313629 481216431 481352501 481827240 482531471 482905464 482771149
1262.4 482771149 483625755 484777412 485237083 485519753 486193581 487416954 488447647 489407387 490724068
1271.1 490724068 491830330 492539101 493071289 493811531 494994125 495540695 495368881 494992142 494843292
1279.8 494843292 494697723 494209595 494204559 494261665 494483109 495029106 495487671 495978889 496110802 496035233
$$ packed form
1217.1D89209633J287384J225700O87599N46074l92532j110573l96957j91231q84857
1225.8D89980240r29871p76024j356697j205139q83827p52831m43916j477356j820183
1234.4D80334396r16671q87108j252861r87549m18587n62477l20435N19867N01633
1243.1D76010208l72619o65970l94707P0419O03295O05163P76596P74422R24110J080513
1252.8D79411430P64428M93087L78609K66075r7198J36070M74739P04231L73993j34315
1262.4D82771149Q54606J151657M59671K82670O73828J223373J030693R59740J316681
1271.1D90724068J106262P08771N32188P40242J182594N46570j71814l76739j48850
1279.8D94843292j45569m88128n036N7106K21444N45997M58565M91218J31913p5569
$$ plain form
1289.4 496035233 496042061 495829048 494613380 493276520 492704849 492337875 491764526 491224594 490813026 489668083
1299 489668083 488287735 487023315 485344849 483512459 482782135 481999283 479496651 477508659 476135101
1307.7 476135101 474898758 473921242 472661858 471776581 470942078 470022354 468541489 466786613 465490303
1316.4 465490303 464055939 463011398 462254868 461272202 460186882 459438248 458967247 458015213 457009926
1325.1 457009926 455476189 453358650 451004639 448415451 446605339 444912529 443142242 441630020
1332.8 441630020 440242844 439180374 437964630 437146530 436545944 436519814 436542053 435750084 434813805
1341.5 434813805 434086342 434503021 434872704 435317192 435744514 436147118 436762581 436820221 436627464 436026306
1351.1 436026306 436027107 435894966 436094360 436549149 436029587 435874443 435633888 435361366 434590454 434232635
$$ packed form
1289.4D96035233O828k13013j215668j336860n71671l66974n73349n39932m11568j144943
1299D89668083j380348j264420j678466j832390p30324p82852k502632j987992j373558
1307.7D76135101j236343r77516j259384q85277q34503r19724j480865j754876j296310
1316.4D65490303j434364j044541p56530r82666j085320p48634m71001r52034j005287
1325.1D57009926j533737k117539k354011k589188j810112j692810j770287j512222
1332.8D41630020j387176j062470j215744q18100o00586k6130K2239p91969r36279
1341.5D34813805p27463M16679L69683M44488M27322M02604O15463N7640j92757o01158
1351.1D36026306Q01j32141J99394M54789n19562j55144k40555k72522p70912l57819
$$ plain form
1360.8 434232635 434315262 434193344 433441238 431837349 431588135 430907059 430895653 431692009 431332893 430955620
1370.4 430955620 430503387 431193657 432055321 433633919 434016724 433552704 434422455 435100975 436010513
1379.1 436010513 436445999 437022514 437313194 437897415 438928452 439691849 441362000 443289719 445993347
1387.8 445993347 446661034 448005524 449614029 449933090 450426140 451190834 452593384 451246986 450047112
1396.4 450047112 449203262 449052658 448741264 446510124 445492744 444035873 443164711 442631149 441752434
1405.1 441752434 440047646 438352699 437419243 435762978 435007401 434067001 433348503 432821693 432036018
1413.8 432036018 432156525 431707840 432524529 432419510 432560387 432846832 431035919 430950508 431068954 433060646
1423.4 433060646 433057289 433087921 433974800 434689941 436000938 436463623 437980347 437372093 437684441 438712234
$$ packed form
1360.8D34232635Q2627j21918p52106j603889k49214o81076j1406P96356l59116l77273
1370.4D30955620m52233O90270Q61664J578598L82805m64020Q69751O78520R09538
1379.1D36010513M35486N76515K90680N84221J031037P63397J670151J927719K703628
1387.8D45993347O67687J344490J608505L19061M93050P64694J402550j346398j199874
1396.4D50047112q43850j50604l11394k231140j017380j456871q71162n33562q78715
1405.1D41752434j704788j694947r33456j656265p55577r40400p18498n26810p85675
1413.8D32036018J20507m48685Q16689j05019J40877K86445j810913q5411J18446J991692
1423.4D33060646l357L0632Q86879P15141J310997M62685J516724o08254L12348J027793
$$ plain form
1433.1 438712234 439044380 440256691 441579361 444037819 443184471 444048882 444433517 444577560 444858551
1441.8 444858551 444804497 445571671 445297928 446057777 446624832 448484344 448359985 446998520 447449074
1450.5 447449074 446497002 446511803 445576553 446773949 447641907 447139053 450334740 447191277 448000031
1459.1 448000031 445914955 446952515 448025894 449659615 452725029 454539719 457275734 457578506
1466.8 457578506 461046410 464122162 468545189 474251175 480130501 491153641 493170586 497267685
1474.6 497267685 500385780 506007233 509552231 512240486 516867065 520334778 525898476 528472290
1482.3 528472290 531682243 535308151 538554726 542864799 545676537 549469261 551628532 556478729
1490 556478729 557039871 556580048 557880478 559038162 562001114 564939270 567062111 566586990 567968826
$$ packed form
1433.1D38712234L32146J212311J322670K458458q53348Q64411L84635J44043K80991
1441.8D44858551n4054P67174k73743P59849N67055J859512j24359j361465M50554
1450.5D47449074r52072J4801r35250J197396Q67958n02854L195687l143463Q08754
1459.1D48000031k085076J037560J073379J633721L065414J814690K736015L02772
1466.8D57578506L467904L075752M423027N705986N879326J1023140K016945M097099
1474.6D97267685L118095N621453L544998K688255M626579L467713N563698K573814
1482.3E28472290L209953L625908L246575M310073K811738L792724K159271M850197
1490E56478729N61142m59823J300430J157684K962952K938156K122841m75121J381836
$$ plain form
1498.7 567968826 568268433 568389740 569647522 569060440 569966621 571963768 576604958 582358475 579959145
1507.3 579959145 578851776 576265030 574995499 574191208 575164604 573808746 573713531 575363541 576812782
1516 576812782 580439873 577186623 578022957 580724945 584009209 587900772 585287743 584375000 584520416
1524.7 584520416 584816399 584706802 586429634 586243134 584475060 585103416 586466217 588925171 590382652
1533.4 590382652 588560944 587262535 586708069 587694855 590438995 597816238 594206810 593653564 594660034
1542.1 594660034 594754944 595407295 594780045 591193161 589374886 589511642 591077728 593707466 593122292
1550.7 593122292 593140793 594919281 596329079 597714653 597380638 599252281 603847313 609915390 606625786
1559.4 606625786 596906776 597406197 596889915 596664467 597710571 597689819 596401978 595744705 596815796
$$ packed form
1498.7E67968826K99607J21307J257782n87082R06181J997147M641190N753517k399330
1507.3E79959145j107369k586746j269531q04291R73396j355858r5215J650010J449241
1516E76812782L627091l253250Q36334K701988L284264L891563k613029r12743J45416
1524.7E84520416K95983j09597J722832j86500j768074O28356J362801K458954J457481
1533.4E90382652j821708j298409n54466R86786K744140P377243l609428n53246J006470
1542.1E94660034R4910O52351o27250l586884j818275J36756J566086K629738n85174
1550.7E93122292J8501J778488J409798J385574l34015J871643M595032O068077l289604
1559.4F06625786r719010M99421n16282k25448J046104k0752j287841o57273J071091
$$ plain form
1568.1 596815796 599178963 595606918 592122612 590892906 589703751 589038811 589593277 591228142 587067070
1576.8 587067070 584687309 582971687 581108284 578907127 576139946 574468117 572261887 570704727
1584.5 570704727 568697968 566588058 564427185 562119484 560578613 558006477 556210213 553147163
1592.2 553147163 550668945 548371201 544948807 542403183 539188042 537077789 534233398 532244911
1599.9 532244911 529935417 527508163 525517159 522001343 519288445 515964813 514114799 511221466
1607.6 511221466 509173126 506912842 502768440 500630035 497429810 495655861 493253860 493194046 493983078
1616.3 493983078 487599335 485329857 482677078 481991386 479792786 479855347 480344772 476244659 474458199
1625 474458199 472809067 473257217 471124458 469606171 467761841 466211815 465527573 463990631 465108643
$$ packed form
1568.1E96815796K363167l572045l484306j229706j189155o64940N54466J634865m161072
1576.8E87067070k379761j715622j863403k201157k767181j671829k206230j557160
1584.5E70704727k006759k109910k160873k307701j540871k572136j796264l063050
1592.2E53147163k478218k297744l422394k545624l215141k110253k844391j988487
1599.9E32244911k309494k427254j991004l515816k712898l323632j850014k893333
1607.6E11221466k048340k260284m144402k138405l200225j773949k402001n9814P89032
1616.3D93983078o383743k269478k652779o85692k198600O2561M89425m100113j786460
1625D74458199j649132M48150k132759j518287j844330j550026o84242j536942J118012
$$ plain form
1633.7 465108643 466046486 468299446 464447212 464531403 462894707 461683426 462872009 462306480 463573303
1642.4 463573303 463291435 464753380 467418022 469703674 473224640 471488800 471245461 470290794 472694206
1651 472694206 475831070 478351822 478902626 475807838 477273941 477161980 478432121 479348640 480982437
1659.7 480982437 483304291 485837746 489715691 489202423 490817184 492455139 494970169 497850952
1667.4 497850952 502276726 507579422 507220306 510944061 512375374 514442444 517588120 522207146
1675.1 522207146 525414352 527041702 530522041 534088020 540079689 543955879 547832146 555315285
1682.9 555315285 565585480 569122963 566159210 568747292 572351151 576934853 581793556 585464516
1690.6 585464516 589195404 593271942 597559280 602640648 609101753 613203049 615935707 619459572
$$ packed form
1633.7D65108643R37843K252960l852234Q4191j636696j211281J188583n65529J266823
1642.4D63573303k81868J461945K664642K285652L520966j735840k43339r54667K403412
1651D72694206L136864K520752N50804l094788J466103j11961J270141R16519J633797
1659.7D80982437K321854K533455L877945n13268J614761J637955K515030K880783
1667.4D97850952M425774N302696l59116L723755J431313K067070L145676M619026
1675.1E22207146L207206J627350L480339L565979N991669L876190L876267P483139
1682.9E55315285J0270195L537483k963753K588082L603859M583702M858703L670960
1690.6E85464516L730888M076538M287338N081368O461105M101296K732658L523865
$$ plain form
1698.3 619459572 624392891 627370911 626567154 629863358 632869835 636679916 638959961 641462326
1706 641462326 642347488 641602783 642406158 644175949 645062027 645223923 646549454 649083328 652710953
1714.7 652710953 653468933 655414200 660173416 656308212 653142776 653170090 653756332 653908386 654679642
1723.4 654679642 654758911 654705734 655555344 656001968 656807098 658438034 659842300 658979645 660685196
1732 660685196 665258331 668165283 662188339 660190811 661215591 661953964 663955917 666322937 664486313
1740.7 664486313 665582428 668308716 670771408 670321808 671084824 673481369 676107178 679094315 679358444
1749.4 679358444 681830826 684793396 684912415 686483459 688147507 690659637 694377518 696918945
1757.1 696918945 697491150 699406967 701621628 705325699 708502731 707760086 709674072 711874847 714077225
$$ packed form
1698.3F19459572M933319K978020q03757L296204L006477L810081K280045K502365
1706F41462326Q85162p44705Q03375J769791Q86078J61896J325531K533874L627625
1714.7F52710953P57980J945267M759216l865204l165436K7314N86242J52054P71256
1723.4F54679642P9269n3177Q49610M46624Q05130J630936J404266q62655J705551
1732F60685196M573135K906952n976944j997528J024780P38373K001953K367020j836624
1740.7F64486313J096115K726288K462692m49600P63016K396545K625809K987137K64129
1749.4F79358444K472382K962570J19019J571044J664048K512130L717881K541427
1757.1F96918945N72205J915817K214661L704071L177032p42645J913986K200775K202378
$$ plain form
1765.8 714077225 716454010 719677658 720557632 721188583 725473862 729396820 730177231 726854782 727926331
1774.5 727926331 730185165 729865265 730826035 731989670 733859634 735235672 735117416 734904251 735589828
1783.2 735589828 737398987 737703934 737192154 737740860 739254990 740006409 741497116 743820419 745597000
1791.8 745597000 745727310 743322067 744621887 745920410 745624542 745475235 746834030 748609695 747661591
1800.5 747661591 748717041 749051361 748598175 748638077 748644791 749290543 749787292 750173721 750420074 752545929
1810.2 752545929 753159561 752503815 752497330 752145538 752880554 753055725 753820038 753776703 753662186 754369965
1819.8 754369965 754745178 755896530 755941467 756498337 758028030 757893906 756593170 756966095 759153976
1828.5 759153976 761830444 760776901 758142242 758249588 758351059 758650055 758911285 759204178 760123596
$$ packed form
1765.8G14077225K376785L223648Q79974O30951M285279L922958P80411l322449J071549
1774.5G27926331K258834l19900R60770J163635J869964J376038j18256k13165O85577
1783.2G35589828J809159L04947n11780N48706J514130P51419J490707K323303J776581
1791.8G45597000J30310k405243J299820J298523k95868j49307J358795J775665r48104
1800.5G47661591J055450L34320m53186L9902O714O45752M96749L86429K46353K125855
1810.2G52545929O13632o55746o485l51792P35016J75171P64313m3335j14517P07779
1819.8G54369965L75213J151352M4937N56870J529693j34124j300736L72925K187881
1828.5G59153976K676468j053543k634659J07346J01471K98996K61230K92893R19418
$$ plain form
1837.2 760123596 759309006 759252243 759337234 760253906 761462860 762630997 764902191 762201691 761168518
1845.8 761168518 761628876 762547913 762289047 761579666 761656418 761088562 761643219 761446075 761564713 761961975
1855.5 761961975 761949615 762239838 762061081 762567596 762588043 763250275 763227463 762819901 763055191 763000870
1865.1 763000870 764256210 765425415 766958847 767040329 765174637 764258575 763895035 764226913 764149704
1873.8 764149704 764266357 763883209 764131317 764310913 764164047 764583130 764452820 764948273 764991150 765331650
1883.4 765331650 765714493 765666275 765596695 765421906 766701660 767712479 767076645 766125717 766234360 766333542
1893.1 766333542 766955948 768362885 767591324 767156143 766695480 766560059 766918335 767022552 767271729
1901.8 767271729 766888046 767136765 767012024 766976624 767280045 767543869 768004684 768503189 768488159 767099686
$$ packed form
1837.2G60123596q14590n6763Q4991R16672J208954J168137K271194k700500j033173
1845.8G61168518M60358R19037k58866p09381P6752n67856N54657j97144J18638L97262
1855.5G61961975j2360K90223j78757N06515K0447O62232k2812m07562K35290n4321
1865.1G63000870J255340J169205J533432Q1482j865692r16062l63540L31878p7209
1873.8G64149704J16653l83148K48108J79596j46866M19083j30310M95453M2877L40500
1883.4G65331650L82843m8218o9580j74789J279754J010819o35834r50928J08643R9182
1893.1G66333542O22406J406937p71561m35181m60663j35421L58276J04217K49177
1901.8G67271729l83683K48719j24741l5400L03421K63824M60815M98505j5030j388473
$$ plain form
1911.4 767099686 767131805 766986542 766759186 767029266 767040176 768680420 769091568 767942657 767460251 767706375
1921.1 767706375 769136887 770166397 768862762 767546692 768124924 768185883 767796402 767525330 767523499
1929.7 767523499 767671738 767439575 767974854 767921753 767876053 767856827 768012085 768276596 767992630 768132019
1939.4 768132019 767645950 768290024 769831772 769170532 768297653 768580017 768631744 768102264 768210526 768157501
1949 768157501 768499832 768369827 767999039 768305588 768541870 768730087 768069229 768102112 768324280 768355484
1958.7 768355484 768504486 768769150 769338379 768863831 768863449 769006729 769406586 769917221 769430923 768917923
1968.3 768917923 768461151 768589630 768621750 768850327 768928146 769128265 769424820 769120941 769335632 769091568
1978 769091568 769055099 768818283 768716736 768756027 768292999 768800812 769085617 769378281 769270782 769468231
$$ packed form
1911.4G67099686L2119j45263k27356K70080J0910J640244M11148j148911m82406K46124
1921.1G67706375J430512J029510j303635j316070N78232O0959l89481k71072j831
1929.7G67523499J48239k32163N35279n3101m5700j9226J55258K64511k83966J39389
1939.4G68132019m86069O44074J541748o61240q72879K82364N1727n29480J08262n3025
1949G68157501L42331j30005l70788L06549K36282J88217o60858L2883K22168L1204
1958.7G68355484J49002K64664N69229m74548l82J43280L99857N10635m86298n13000
1968.3G68917923m56772J28479L2120K28577P7819K00119K96555l03879K14691k44064
1978G69091568l6469k36816j01547L9291m63028N07813K84805K92664j07499J97449
$$ plain form
1987.6 769468231 769765625 769017334 769248123 769741135 769580231 768935776 769092560 768970566 768540344 768762131
1997.2 768762131 768869095 769311981 768892059 768734283 768684464 768408966 768480835 767933502 767726135 767741776
2006.9 767741776 768236618 768185883 767711945 767437744 767283096 767768021 767608795 767313766 767213669 767756577
2016.5 767756577 767594681 766664810 766290207 765817108 765960693 765786896 765887146 765890732 765617676 765369949
2026.2 765369949 764583359 764432983 763931885 763831482 763814087 763769989 763972244 763638763 763657990 763553696
2035.8 763553696 763472061 762683029 762322006 762419662 762281418 762538452 762350159 762719116 762162704 761475525
2045.5 761475525 761547775 761583939 761780090 761502914 761758804 761521835 761356049 761429825 761338196 761414795
2055.1 761414795 761078186 761115417 760812302 760894623 761087494 761128922 761108398 761018982 761750717 761905060
$$ packed form
1987.6G69468231K97394p48291K30789M93012j60904o44455J56784j21994m30222K21787
1997.2G68762131J06964M42886m19922j57776m9819k75498P1869n47333k07367J5641
2006.9G67741776M94842n0735m73938k74201j54648M84925j59226k95029j00097N42908
2016.5G67756577j61896r29871l74603m73099J43585j73797J00250L586k73056k47727
2026.2G65369949p86590j50376n01098j00403j7395m4098K02255l33481J9227j04294
2035.8G63553696q1635p89032l61023R7656j38244K57034j88293L68957n56412o87179
2045.5G61475525P2250L6164J96151k77176K55890k36969j65786P3776r1629P6599
2055.1G61414795l36609L7231l03115Q2321J92871M1428k0524q9416P31735J54343
$$ plain form
2064.7 761905060 761764297 761126251 760762634 760971375 761146393 761539612 761405640 761416168 761087646 761357040
2074.4 761357040 761781311 761853180 762187424 761946411 761945038 761378708 761177216 761366806 761165695 761176987
2084 761176987 761383743 761911469 761797791 762026901 762251663 762219467 762050171 761673126 761423798 761045456
2093.7 761045456 761681061 761815720 761911621 762043381 761738892 762430725 762625732 762378464 762053757 762042160
2103.3 762042160 762206497 762423401 762319107 761824493 762122040 762056808 762260666 762587738 762657089 762525253
2113 762525253 762382965 762739182 762421341 762289200 762040710 762173004 762342529 762190933 762793961 762954559
2122.6 762954559 763079453 763052216 763317032 763123398 762325897 762083664 762116928 762642975 762467575 762633667
2132.3 762633667 762731628 762669601 763149872 763122177 763262177 762949753 762956085 763021088 762754364 762681961 762675095
$$ packed form
2064.7G61905060j40763o38046l63617K08741J75018L93219j33972J0528l28522K69394
2074.4G61357040M24271P1869L34244k41013j373n66330k01492J89590k01111J1292
2084G61176987K06756N27726j13678K29110K24762l2196j69296l77045k49328l78342
2093.7G61045456O35605J34659R5901J31760l04489O91833J95007k47268l24707j1597
2103.3G62042160J64337K16904j04294m94614K97547o5232K03858L27072O9351j31836
2113G62525253j42288L56217l17841j32141k48490J32294J69525j51596O03028J60598
2122.6G62954559J24894k7237K64816j93634p97501k42233L3264N26047j75400J66092
2132.3G62633667R7961o2027M80271k7695J40000l12424O332O5003k66724p2403o866
$$ plain form
2142.9 762675095 762856979 762844009 763375320 763461304 763533859 763548355 763283539 763462296 763284607 763346176
2152.5 763346176 762953033 762777252 762801971 762989273 763625183 763674011 763778839 763590240 764011688 764166718
2162.1 764166718 763938522 764105225 763920288 764185715 764285583 764771729 764880676 764509277 764820404 765447235
2171.8 765447235 765938644 765400925 765122223 765300140 765902405 766347504 766177597 766315765 766742325 767421875
2181.4 767421875 767423248 767369614 767063065 766732635 767097931 767556000 767969131 767891998 768482437 768978348
2191.1 768978348 768998642 769236145 769400482 768981934 768184433 768526001 768700638 768983994 769350815 769341812
2200.7 769341812 769454651 769343185 769787521 770021591 770432358 770253220 769685669 769795837 769784927 770088577
2210.4 770088577 770185699 770796814 771291504 771401138 771419830 771528168 771985855 771436539 771466370 771588821
$$ packed form
2142.9G62675095J81884j2970N31311Q5984P2555J4496k64816J78757j77689O1569
2152.5G63346176l93143j75781K4719J87302O35910M8828J04828j88599M21448J55030
2162.1G64166718k28196J66703j84937K65427R9868M86146J08947l71399L11127O26831
2171.8G65447235M91409n37719k78702J77917O02265M45099j69907J38168M26560O79550
2181.4G67421875J373n3634l06549l30430L65296M58069M13131p7133N90439M95911
2191.1G68978348K0294K37503J64337m18548p97501L41568J74637K83356L66821r003
2200.7G69341812J12839j11466M44336K34070M10767j79138n67551J10168j0910L03650
2210.4G70088577R7122O11115M94690J09634J8692J08338M57687n49316K9831J22451
$$ plain form
2220 771588821 771570053 771587906 771308899 771705246 771979523 772326279 772302780 772621994 772806091 772566681
2229.7 772566681 772632675 772296448 772410202 772076111 771946411 772238312 772516174 772742081 772791214 773359680
2239.3 773359680 773255310 773280640 772984619 772791443 772811203 772282867 772776184 773133087 773466339 773462677
2248.9 773462677 773232193 773232498 773118744 773383484 773586655 773748779 773137512 773126602 773337555 773135910
2258.6 773135910 773330307 773456726 774019394 773858871 773855972 773837280 773631744 773800507 773396301 773219223
2268.2 773219223 773241959 774062958 774313126 774041519 774066238 774036484 774568253 774608612 774655762 774074936
2277.9 774074936 773570251 773414001 773334198 773913422 773737183 774086227 774427567 774380798 774136810 773832169
2287.5 773832169 774182816 774268570 774572678 774130859 773914490 774319611 774574966 775022202 774987640 775111084
$$ packed form
2220G71588821j8768J7853k79007L96347K74277L46756k3499L19214J84097k39410
2229.7G72566681O5994l36227J13754l34091j29700K91901K77862K25907M9133N68466
2239.3G73359680j04370K5330k96021j93176J9760n28336M93317L56903L33252l662
2248.9G73462677k30484L05j13754K64740K03171J62124o11267j0910K10953k01645
2258.6G73135910J94397J26419N62668j60523k899j8692k05536J68763m04206j77078
2268.2G73219223K2736Q20999K50168k71607K4719k9754N31769M0359M7150n80826
2277.9G74074936n04685j56250p9803N79224j76239L49044L41340m6769k43988l04641
2287.5G73832169L50647Q5754L04108m41819k16369M05121K55355M47236l4562J23444
$$ plain form
2297.2 775111084 774800720 774549179 774560242 774663010 774718933 774559250 774944687 775008698 775303040 775597229
2306.8 775597229 776161118 776340256 775855408 776192322 775969238 775435410 774637909 774658585 775534668 776885605
2316.4 776885605 777982559 777301331 777418976 777575684 777657471 777902679 777830505 777686920 776831818 776777115
2326.1 776777115 776916351 778221893 778820877 778109589 778507309 778563843 778169708 777436142 777210999 777430954
2335.7 777430954 778069992 777952728 777666702 777448273 776578369 777261505 778061447 778825989 778458633 776789932
2345.4 776789932 775145035 774040146 773385696 773226089 774860535 775710449 775771790 775887451 775472870
2354.1 775472870 776017609 775317154 775911713 776349716 776810837 776992874 776128769 776052094 775852203 776702957
2363.7 776702957 776103058 776091232 775005417 773740005 773734894 773135529 773168945 771742706 770922699 770267792
$$ packed form
2297.2G75111084l10364k51541J1063J02768N5923j59683L85437O4011K94342K94189
2306.8G75597229N63889J79138m84848L36914k23084n33828p97501K0676Q76083J350937
2316.4G76885605J096954o81228J17645J56708Q1787K45208p2174j43585q55102n4703
2326.1G76777115J39236J305542N98984p11288L97720N6534l94135p33566k25143K19955
2335.7G77430954O39038j17264k86026k18429q69904O83136P99942P64542l67356j668701
2345.4G76789932j644897j104889o54450j59607J634446Q49914O1341J15661m14581
2354.1G75472870N44739p00455N94559M38003M61121J82037q64105p6675j99891Q50754
2363.7G76702957n99899j1826j085815j265412n111n99365L3416j426239q20007o54907
$$ plain form
2373.3 770267792 769636459 769235153 767985001 767453384 767230682 767049866 765942764 764829712 764362411
2382 764362411 764045181 763586273 762758179 762798615 762717590 762426224 762052841 761839523 762028580 761675797
2391.7 761675797 761544495 761034393 760339584 759758911 759597244 759943008 759891586 760065384 759804077 759405899
2401.3 759405899 759533691 759545746 758784866 758153000 758206940 757946548 757839050 757420883 756938324 756578674
2410.9 756578674 756400452 756501770 756235275 756192322 755760727 755365372 755018387 754445114 753904800 753233185
2420.6 753233185 753037262 752944794 752873535 752326431 751983643 751812134 751554489 751657639 750956497 750589676
2430.2 750589676 750437164 750114517 749433517 748283386 748077087 748128128 747936478 747321243 747038803 746999741
2439.9 746999741 746664658 746362534 745841751 745620041 745242233 744738083 744094543 743599930 743474274 743317108
$$ packed form
2373.3G70267792o31333m01306j250152n31617k22702j80816j107102j113052m67301
2382G64362411l17230m58908q28094M0436q1025k91366l73383k13318J89057l52783
2391.7G61675797j31302n10102o94809n80673j61667L45764n1422J73798k61307l98178
2401.3G59405899J27792J2055p60880o31866N3940k60392j07498m18167m82559l59650
2410.9G56578674j78222J01318k66495m2953m31595l95355l46985n73273n40314o71615
2420.6G53233185j95923r2468p1259n47104l42788j71509k57645J03150p01142l66821
2430.2G50589676j52512l22647o81000j150131k06299N1041j91650o15235k82440l9062
2439.9G46999741l35083l02124n20783k21710l77808n04150o43540m94613j25656j57166
$$ plain form
2449.5 743317108 743179092 742419281 741746597 741301498 741011810 740734634 740669327 740768738 740192490 739907455
2459.2 739907455 739370499 738785782 738313065 737803192 737573013 736823349 736507492 736618652 736616287 735845108
2468.8 735845108 734889832 734928818 735022583 734733505 734306412 734169464 733393326 732623444 732524567 732259827
2478.5 732259827 732189407 732015991 731677704 731298676 731264191 730914688 730230637 729535294 728631134 728416672
2488.1 728416672 728349533 728642349 728729019 728556671 728539429 728040695 727541885 726932602 726954651 726722717
2497.7 726722717 726105652 725552826 724997101 725322723 725323639 725273819 724894104 724454651 724643402 724762726
2507.4 724762726 724699707 723547592 722444458 722036743 722102432 722087326 721815643 721851654 721633530 721713181
2517 721713181 721819687 721999207 721667480 720303116 719409866 719372864 719253159 718521347 718411179 718354568
$$ packed form
2449.5G43317108j38016p59811o72684m45099k89688k77176o5307R9411n76248k85035
2459.2G39907455n36956n84717m72717n09873k30179p49664l15857J11160k365p71179
2468.8G35845108r55276L8986R3765k89078m27093j36948p76138p69882r8877k64740
2478.5G32259827p0420j73416l38287l79028l4485l49503o84051o95343r04160k14462
2488.1G28416672o7139K92816Q6670j72348j7242m98734m98810o09283K2049k31934
2497.7G26722717o17065n52826n55725L25622R16m9820l79715m39453J88751J19324
2507.4G24762726o3019j152115j103134m07715O5689j5106k71683L6011k18124P9651
2517G21713181J06506J79520l31727j364364q93250l7002j19705p31812j10168n6611
$$ plain form
2526.7 718354568 718096161 718150253 717957153 717508698 717134323 717293243 716747055 715932846 715129089 714378433
2536.3 714378433 714546814 714603119 714326782 713800201 713952560 713924408 713253174 712774887 712164078 711813965
2546 711813965 710913010 710529175 710243378 709529495 709715729 709593353 709348679 709184952 708879089 708159637
2555.6 708159637 707510834 707373047 707035217 706560898 705907364 705698395 705449982 705341949 705389252 704874268
2565.2 704874268 704493332 704005280 703474655 702694550 702006531 701779785 701777725 701790237 701416550 701016617
2574.9 701016617 700362244 700014877 700146790 700145416 699630890 698979111 698720245 698400421 698162155 697409744
2584.5 697409744 696665192 696323700 696116104 696107330 695719223 695348358 694743271 694259186 693982925 693811493
2594.2 693811493 693527145 692871246 692834778 692777786 692706757 692395935 691761169 691091537 690483932 690317078
$$ packed form
2526.7G18354568k58407N4092j93100m48455l74375J58920n46188q14209q03757p50656
2536.3G14378433J68381N6305k76337n26581J52359k8152o71234m78287o10809l50113
2546G11813965r00955l83835k85797p13883J86234j22376k44674j63727l05863p19452
2555.6G08159637o48803j37787l37830m74319o53534k08969k48413j08033M7303n14984
2565.2G04874268l80936m88052n30625p80105o88019k26746k060J2512l73687l99933
2574.9G01016617o54373l47367J31913j374n14526o51779k58866l19824k38266p52411
2584.5F97409744p44552l41492k07596q774l88107l70865o05087m84085k76261j71432
2594.2F93811493k84348o55899l6468n6992p1029l10822o34766o69632o07605j66854
$$ plain form
2603.8 690317078 689689026 689364929 689188614 688981400 688893433 688559494 688446960 687799530 687044754 686386871
2613.5 686386871 685826263 685029449 684253311 684356461 684124222 683583908 683087234 682944946 682378464 681300507
2623.1 681300507 680881042 680587006 680105286 679001923 678296127 678023834 677339935 676788864 676351013
2631.8 676351013 675962524 675475769 675146713 674397049 673507004 672943268 672235107 671406174 670270767
2640.5 670270767 669496613 669043350 668878937 668808823 668462372 667852325 666878738 666288757 665696793 664572220
2650.1 664572220 663519440 663496094 663322525 662506180 662112122 661543579 661111526 660310135 659685974 659391861
2659.8 659391861 658254623 657429962 656837921 656041565 655513382 655671997 655276337 654562988 654704056
2668.4 654704056 654176178 653357925 653001022 652805099 651900635 650555038 650009232 649779282 649388351
$$ packed form
2603.8F90317078o28052l24097j76315k07214q7967l33939j12534o47430p54776o57883
2613.5F86386871n60608p96814p76138J03150k32239n40314m96674j42288n66482j077957
2623.1F81300507m19465k94036m81720j103363p05796k72293o83899n51071m37851
2631.8F76351013l88489m86755l29056p49664q90045n63736p08161q28933j135407
2640.5F70270767p74154m53263j64413p0114l46451o10047r73587n89981n91964j124573
2650.1F64572220j052780k3346j73569q16345l94058n68543m32053q01391o24161k94113
2659.8F59391861j137238q24661n92041p96356n28183J58615l95660p13349J41068
2668.4F54704056n27878q18253l56903j95923r04464j345597n45806k29950l90931
$$ plain form
2677.1 649388351 648711853 648352585 648119202 647949371 647606812 646897964 646454086 645830383 645482864 644803009
2686.8 644803009 643676758 643002701 642817001 642774048 642207718 641721573 641299591 641143188 640751419 639964523
2696.4 639964523 639536629 638919258 638307800 637719536 637520714 637222862 636632080 636131592 635371246 634702377
2706 634702377 633924980 633402443 632884102 632465591 632112312 631489677 630976143 630231819 629841309 629248848
2715.7 629248848 628519821 628026581 627583809 627330017 626835670 626377449 625485840 624988632 624792824 624472275
2725.3 624472275 624340401 623556671 622995529 622618980 622167816 621391716 620718803 620746803 620677872 620373421
2735 620373421 619658623 619501839 619389839 618929520 618342705 617445755 617114410 616893387 616769829 616018372
2744.6 616018372 615420990 615668221 615119247 614490204 614320526 614218445 613820992 613414459 612767601 612006836
$$ packed form
2677.1F49388351o76498l59268k33383j69831l42559p08848m43878o23703l47519o79855
2686.8F44803009j126251o74057j85700m2953n66330m86145m21982j56403l91769p86896
2696.4F39964523m27894o17371o11458n88264j98822k97852n90782n00488p60346o68869
2706F34702377p77397n22537n18341m18511l53279o22635n13534p44324l90510n92461
2715.7F29248848p29027m93240m42772k53792m94347m58221q91609m97208j95808l20549
2725.3F24472275j31874p83730n61142l76549m51164p76100o72913K8000o8931l04451
2735F20373421p14798j56784j12000m60319n86815q96950l31345k21023j23558p51457
2744.6F16018372n97382K47231n48974o29043j69678j02081l97453m06533o46858p60765
$$ plain form
2754.3 612006836 611830292 611714325 611663094 611263542 610798569 610446815 610175476 609820023 609050865 608383942
2763.9 608383942 607883606 607858772 607274055 606732483 606965637 606974564 606873741 606319847 605901299 605381622
2773.5 605381622 604678383 603918457 603109322 602599602 601773186 601365585 600845337 600379105 600455399 600216980
2783.2 600216980 599627151 598689308 598147774 597763062 597439613 596674843 595547600 594964027 594155540
2791.9 594155540 593297272 592744064 592629051 592073250 591112633 590404091 589151344 587925186 586926003
2800.5 586926003 586096268 585298462 584063530 582880783 582351685 582120590 581661453 580762825 579536209
2809.2 579536209 578758812 577532539 576052971 574779167 573447342 572658195 571524696 570649109 569776421
2817.9 569776421 568384552 567229347 565952568 564876976 563911438 562955093 561404533 559710503 558415108
$$ packed form
2754.3F12006836j76544j15967n1231l99552m64973l51754k71339l55453p69158o66923
2763.9F08383942n00336k4834n84717n41572K33154Q927j00823n53894m18548n19677
2773.5F05381622p03239p59926q09135n09720q26416m07601n20248m66232P6294k38419
2783.2F00216980n89829r37843n41534l84712l23449p64770j127243n83573q08487
2791.9E94155540q58268n53208j15013n55801r60617p08542j252747j226158r99183
2800.5E86926003q29735p97806j234932j182747n29098k31095m59137q98628j226616
2809.2E79536209p77397j226273j479568j273804j331825p89147j133499q75587q72688
2817.9E69776421j391869j155205j276779j075592r65538r56345j550560j694030j295395
$$ plain form
2826.6 558415108 557257729 556559334 555200653 553698997 552460403 551002655 549463501 547945442
2834.3 547945442 546462135 544491272 542819290 541137161 539232407 537239532 534827614 532730446
2842 532730446 530524864 528303375 526042671 523477211 521239700 518993835 516075592 513225937 511154785
2850.7 511154785 508943329 506903992 505313263 503908234 502900620 501928024 501059570 500382996 499859772
2859.4 499859772 498684959 497105713 496020851 494829788 493123322 490942078 489097176 487754898
2867.1 487754898 486128349 484143791 482105103 479933891 477775879 475755730 473505592 471333771
2874.8 471333771 469215508 467433319 465712051 463540688 461691208 459823837 458021393 456567879
2882.5 456567879 455442963 454401627 453098602 452207489 451324425 450622864 450182228 449212685 448336182
$$ packed form
2826.6E58415108j157379o98395j358681j501656j238594j457748j539154j518059
2834.3E47945442j483307j970863j671982j682129j904754j992875k411918k097168
2842E32730446k205582k221489k260704k565460k237511k245865k918243k849655k071152
2850.7E11154785k211456k039337j590729j405029j007614r72596q68454o76574n23224
2859.4D99859772j174813j579246j084862j191063j706466k181244j844902j342278
2867.1D87754898j626549j984558k038688k171212k158012k020149k250138k171821
2874.8D71333771k118263j782189j721268k171363j849480j867371j802444j453514
2882.5D56567879j124916j041336j303025q91113q83064p01561m40636r69543q76503
$$ plain form
2891.2 448336182 448040314 447879486 447509003 447221146 446824532 446307526 445689049 444975090 444763832 444315262
2900.8 444315262 443252831 442434998 441831627 440873451 439835281 438897514 437914009 437091522 436310043
2909.5 436310043 435242958 433531189 431717567 429902153 427579803 425106621 422558670 420151711
2917.2 420151711 417973366 415941124 414087143 412420311 410887032 409463654 408464890 407426262
2925 407426262 406177979 405103302 404770432 404981956 404985886 405351295 406033325 406626167 407226105 408507462
2934.6 408507462 410450401 411944122 413384285 415298805 417361412 419650688 422451515 425137596
2942.3 425137596 427836227 430837898 433619728 436307068 438529358 440967102 443779907 446354637
2950 446354637 448920708 451339378 453828163 455951424 457834740 459958382 462530937 465251465 467712402
$$ packed form
2891.2D48336182k95868j60828l70483k87857l96614n17006o18477p13959k11258m48570
2900.8D44315262j062431q17833o03371r58176j038170r37767r83505q22487p81479
2909.5D36310043j067085j711769j813622j815414k322350k473182k547951k406959
2917.2D20151711k178345k032242j853981j666832j533279j423378r98764j038628
2925D07426262j248283j074677l32870K11524L930L65409O82030N92842N99938J281357
2934.6D08507462J942939J493721J440163J914520K062607K289276K800827K686081
2942.3D25137596K698631L001671K781830K687340K222290K437744K812805K574730
2950D46354637K566071K418670K488785K123261J883316K123642K572555K720528K460937
$$ plain form
2958.7 467712402 470343552 472662125 474815750 476969948 479172897 481247635 483151855 485386925
2966.4 485386925 487369118 489474030 491756248 494037132 496239281 497986298 499625969 501462746
2974.1 501462746 503395691 504975319 507041626 509448776 511549339 513473053 515042648 516850548
2981.8 516850548 518385925 519520111 520939331 522414246 523410378 524366989 525662041 526637039 527770004
2990.5 527770004 528943787 529803391 530257149 530481720 531263161 531894836 532053413 532089577 532211914 532533379
3000.2 532533379 532778816 532940254 533181953 533176117 533057137 533149452 532889061 532496147 531923256 531443024
3009.8 531443024 531178551 530577698 529930267 529174042 528983421 528465652 527054939 526224136 525687828
3018.5 525687828 524968262 524131088 523234558 522119751 521301155 520584068 519414940 518154869 517168045
$$ packed form
2958.7D67712402K631150K318573K153625K154198K202949K074738J904220K235070
2966.4D85386925J982193K104912K282218K280884K202149J747017J639671J836777
2974.1E01462746J932945J579628K066307K407150K100563J923714J569595J807900
2981.8E16850548J535377J134186J419220J474915R96132R56611J295052R74998J132965
2990.5E27770004J173783Q59604M53758K24571P81441O31675J58577L6164J22337L21465
3000.2E32533379K45437J61438K41699n836j18980R2315k60391l92914n72891m80232
3009.8E31443024k64473o00853o47431p56225j90621n17769j410713q30803n36308
3018.5E25687828p19566q37174q96530j114807q18596p17087j169128j260071r86824
$$ plain form
3027.2 517168045 516853218 516157532 515178070 514001160 512497025 511319809 509977760 508807983 507490273
3035.9 507490273 506453972 505737801 504676476 503678741 502691841 501973076 500548744 498615952 497223091
3044.5 497223091 496339455 495194359 493281670 492047043 491278076 490147591 488816872 487739677 486635323
3053.2 486635323 485004578 483407822 481999664 481060829 479859962 478660355 477712097 476480751 475171051
3061.9 475171051 473589363 472452240 471277695 470229836 469221458 467320366 465702629 464447975
3069.6 464447975 463245239 461872673 460702515 459788666 458702278 457553024 456432190 455407867
3077.3 455407867 453816605 452426834 451303444 450382195 449338570 447488136 446350403 445308571
3085 445308571 444209595 443155899 441666527 440367813 438979378 437696381 436266251 434861183 433814697
$$ packed form
3027.2E17168045l14827o95686r79462j176910j504135j177216j342049j169777j317710
3035.9E07490273j036301p16171j061325r97735r86900p18765j424332j932792j392861
3044.5D97223091q83636j145096j912689j234627p68967j130485j330719j077195j104354
3053.2D86635323j630745j596756j408158r38835j200867j199607r48258j231346j309700
3061.9D75171051j581688j137123j174545j047859j008378j901092j617737j254654
3069.6D64447975j202736j372566j170158r13849j086388j149254j120834j024323
3077.3D55407867j591262j389771j123390r21249j043625j850434j137733j041832
3085D45308571j098976j053696j489372j298714j388435j282997j430130j405068j046486
$$ plain form
3093.7 433814697 433016243 432082634 430643730 429196205 427738724 426783371 425617256 424057961 422737732
3102.4 422737732 421366692 420461998 419335327 418308029 417894402 416789360 415110588 413634415 412128067
3111.1 412128067 410657272 409504814 408358116 407303810 406108513 404711914 403666382 402874069
3118.8 402874069 401328201 399483604 398515892 397529449 396562347 395295715 393662109 392397156 391154938
3127.5 391154938 390405502 389188309 387659492 386853905 386006241 384533005 383057175 382270966 381043854
3136.1 381043854 379686813 378144722 376545906 375968170 375172844 373627892 371934090 371001167 370064507
3144.8 370064507 368926544 368039627 366625443 365555840 364660072 363516998 362155876 360697517 359354820
3153.5 359354820 358119812 357293358 356429825 355808029 354609413 352963486 351744614 350556488 349787102
$$ packed form
3093.7D33814697p98454r33609j438904j447525j457481r55353j166115j559295j320229
3102.4D22737732j371040r04694j126671j027298m13627j105042j678772j476173j506348
3111.1D12128067j470795j152458j146698j054306j195297j396599j045532p92313
3118.8D02874069j545868j844597r67712r86443r67102j266632j633606j264953j242218
3127.5C91154938p49436j217193j528817q05587q47664j473236j475830p86209j227112
3136.1C81043854j357041j542091j598816n77736p95326j544952j693802r32923r36660
3144.8C70064507j137963q86917j414184j069603q95768j143074j361122j458359j342697
3153.5C59354820j235008q26454q63533o21796j198616j645927j218872j188126p69386
$$ plain form
3162.2 349787102 348786316 347673645 346616974 345665398 344987411 343922653 342693214 341487694 340374107
3170.9 340374107 338932228 337856369 337349014 336414833 335268745 334253464 333715973 332585945 330765266
3179.5 330765266 329748688 329580460 329212456 328213921 326878281 325207710 324010315 323307610 322942810
3188.2 322942810 322400818 321318626 320388947 318999958 317501869 316352768 315899734 315759277 315178719
3196.9 315178719 314667263 313401222 312060585 311458874 310885658 310065136 309275875 308598919 307656345
3205.6 307656345 306890812 306010017 305117760 304114285 302956257 302273331 301661148 301440659 300822430
3214.3 300822430 299776897 299057026 298044720 297121239 296338501 295467873 294937038 294609203 293811760
3222.9 293811760 293224316 292831974 291998005 291209335 290287266 289607239 289139729 288758793 288254776 287326508
$$ packed form
3162.2C49787102j000786j112671j056671r51576o77987j064758j229439j205520j113587
3170.9C40374107j441879j075859n07355r34181j146088j015281n37491j130028j820679
3179.5C30765266j016578j68228l68004r98535j335640j670571j197395p02705l64800
3188.2C22942810n41992j082192r29679j388989j498089j149101m53034j40457n80558
3196.9C15178719n11456j266041j340637o01711n73216q20522p89261o76956r42574
3205.6C07656345p65533q80795q92257j003475j158028o82926o12183k20489o18229
3214.3C00822430j045533p19871j012306r23481p82738q70628n30835l27835p97443
3222.9B93811760n87444l92342q33969p88670r22069o80027m67510l80936n04017r28268
$$ plain form
3232.6 287326508 286484489 285522804 284997559 284643116 283942909 283239765 282500668 281935596 281167850 280401306
3242.2 280401306 279820251 279425468 279207039 278656445 277983608 277316017 276517982 275564346 274842472 274322243
3251.9 274322243 273801060 273416443 272799702 271929111 271374893 271017494 270205288 269510098 269134254 268663311
3261.5 268663311 268502312 268671246 268410816 267246838 265932140 265268154 265336761 264952450 264047737
3270.2 264047737 263577061 262954693 262625275 262251358 261614399 261404781 260905495 260458755 260090904 259378738
3279.8 259378738 258840790 258600330 257995186 257441692 257510567 257317314 257071991 256929893 256631279 256042309
3289.5 256042309 254952831 254097366 253897057 253894310 253522739 253032112 252725945 252249241 251636086 251326427
3299.1 251326427 250937595 250438900 250121346 249629612 249527760 249242935 248607407 248152924 247798901 248031254
$$ packed form
3232.6B87326508q42019r61685n25245l54443p00207p03144p39097n65072p67746p66544
3242.2B80401306n81055l94783k18429n50594o72837o67591p98035r53636p21874n20229
3251.9B74322243n21183l84617o16741q70591n54218l57399q12206o95190l75844m70943
3261.5B68663311j60999J68934k60430j163978j314698o63986O8607l84311r04713
3270.2B64047737m70676o22368l29418l73917o36959k09618m99286m46740l67851p12166
3279.8B59378738n37948k40460o05144n53494O8875j93253k45323j42098k98614n88970
3289.5B56042309j089478q55465k00309k747l71571m90627l06167m76704o13155l09659
3299.1B51326427l88832m98695l17554m91734j01852k84825o35528m54483l54023K32353
$$ plain form
3308.8 248031254 247503185 246861992 246781006 246178150 245663204 245032864 244664917 244606667 244344826 244059658
3318.4 244059658 243541203 243026180 242737331 242393284 241832504 241814861 241727467 240908108 239999905 239291611
3328.1 239291611 239304733 239155807 238265057 237470036 237123489 236897659 236872768 237051201 236428547 235430183
3337.7 235430183 234758129 234546871 234403172 234052505 234059505 233369884 232283001 232055016 232002468 231711655
3347.3 231711655 231622562 231790218 231364346 230199623 229398117 229217625 229028912 228792458 228503094 228254089
3357 228254089 227731037 226969128 226806049 226352882 225578499 225382614 225520191 225605106 225157890 224427452
3366.6 224427452 224161091 224520779 224128304 223066578 222637901 222372799 222057438 221996078 222151413 221813030
3376.3 221813030 221111679 220767841 220869064 220937767 220385857 220072861 219983273 219765034 219478760 219023151
$$ packed form
3308.8B48031254n28069o41193q0986o02856n14946o30340l67947n8250k61841k85168
3318.4B44059658n18455n15023k88849l44047n60780j7643q7394q19359r08203p08294
3328.1B39291611J3122j48926q90750p95021l46547k25830k4891J78433o22654r98364
3337.7B35430183o72054k11258j43699l50667P000o89621j086883k27985n2548k90813
3347.3B31711655q9093J67656m25872j164723q01506j80492j88713k36454k89364k49005
3357B28254089n23052p61909j63079m53167p74383j95885J37577Q4915m47216p30438
3366.6B24427452k66361L59688l92475j061726m28677k65102l15361o1360J55335l38383
3376.3B21813030p01351l43838J01223O8703n51910l12996q9588k18239k86274m55609
$$ plain form
3385.9 219023151 218839054 219074287 219484177 219098930 218502426 218331642 218275604 218233528 217712955 217710857
3395.6 217710857 218146229 217955589 217540855 217341747 217183228 217168159 217155380 216794548 217003117 217376442
3405.2 217376442 217278500 217058239 216793060 216842155 217143059 217408981 217355995 217404480 217301083 217085438
3414.8 217085438 217038155 216630039 216651688 216986256 217280445 217564888 217633038 217266750 217028561 217585735
3424.5 217585735 217642918 217684269 218079128 218329544 218290253 217997894 218540974 219147091 219232693 219155750
3434.1 219155750 219514942 219886913 219670162 219789696 219976883 220275497 220874271 221631470 221965694 222140102
3443.8 222140102 222326984 222545757 223709488 223961277 224161072 224683571 224792767 225250893 225498905
3452.5 225498905 226448498 226649208 226515503 227559166 228378239 228805027 228787384 229368076 230181561 230930157
$$ packed form
3385.9B19023151j84097K35233M09890l85247n96504j70784n6038m2076n20573k098
3395.6B17710857M35372j90640m14734j99108j58519j5069j2779l60832K08569L73325
3405.2B17376442r7942k20261k65179M9095L00904K65922n2986M8485j03397k15645
3414.8B17085438m7283m08116K1649L34568K94189K84443O8150l66288k38189N57174
3424.5B17585735N7183M1351L94859K50416l9291k92359N43080O06117Q5602p6943
3434.1B19155750L59192L71971k16751J19534J87187K98614N98774P57199L34224J74408
3443.8B22140102J86882K18773J163731K51789J99795N22499J09196M58126K48012
3452.5B25498905R49593K00710j33705J043663Q19073M26788j7643N80692Q13485P48596
$$ plain form
3462.1 230930157 231400528 231421909 232153797 233112698 234203129 234571476 234665337 235104275 235585690 236335144
3471.7 236335144 236710510 237215195 237842484 238771992 239767456 240468044 241346436 242101555 242728195 243237247
3481.4 243237247 244066200 244661541 245404758 246310101 246587048 247486916 248457050 248644028 248901978 249771500
3491 249771500 250720158 251565723 252486362 253205299 254096088 254785213 255635109 256730804 258054638 259358959
3500.7 259358959 259633427 260220547 261599655 262433491 263082542 263961086 264419937 265333366 266567078
3509.4 266567078 267177963 268510818 269517174 270216923 270953922 271780109 273291588 274782944 276025562
3518 276025562 276350994 276895542 278318958 280171661 281760368 282486668 283596554 284476223 285751667
3526.7 285751667 287082806 287814465 288279591 289071159 290325699 291213417 292646942 293625412 295161114
$$ packed form
3462.1B30930157M70371K1381P31888R58901J090431L68347R3861M38938M81415P49454
3471.7B36335144L75366N04685O27289R29508R95464P00588Q78392P55119O26640N09052
3481.4B43237247Q28953N95341P43217R05343K76947Q99868R70134J86978K57950Q69522
3491B49771500R48658Q45565R20639P18937Q90789O89125Q49896J095695J323834J304321
3500.7B59358959K74468N87120J379108Q33836O49051Q78544M58851R13429J233712
3509.4B66567078O10885J332855J006356O99749P36999Q26187J511479J491356J242618
3518B76025562L25432N44548J423416J852703J588707P26300J109886Q79669J275444
3526.7B85751667J331139P31659M65126P91568J254540Q87718J433525R78470J535702
$$ plain form
3535.4 295161114 296736908 297011585 298124218 299173737 300912285 302452412 303855667 305279522
3543.1 305279522 306414337 308344002 309667892 311674843 312409573 313291092 314969349 316678181 319370785
3551.8 319370785 320178070 321360817 322177010 323406372 325704422 326853600 328955841 330814705 332390594
3560.5 332390594 334093056 337168579 339701080 340648918 344544067 346865387 347923813 348779068 348574448
3569.1 348574448 351352997 353380432 355255203 357628479 360169220 361963425 363364639 365401230
3576.9 365401230 367160912 370153580 372811356 374497604 376579323 379539223 382191353 383822861
3584.6 383822861 387811432 390956116 391679153 394061928 394555588 397152405 400738106 404359741 407117348
3593.2 407117348 409008522 412914543 413724289 415226822 418620605 420724335 424609795 426198120
$$ packed form
3535.4B95161114J575794K74677J112633J049519J738548J540127J403255J423855
3543.1C05279522J134815J929665J323890K006951P34730Q81519J678257J708832K692604
3551.8C19370785Q07285J182747Q16193J229362K298050J149178K102241J858864J575889
3560.5C32390594J702462L075523K532501R47838L895149K321320J058426Q55255k04620
3569.1C48574448K778549K027435J874771K373276K540741J794205J401214K036591
3576.9C65401230J759682K992668K657776J686248K081719K959900K652130J631508
3584.6C83822861L988571L144684P23037K382775M93660K596817L585701L621635K757607
3593.2D07117348J891174L906021Q09746J502533L393783K103730L885460J588325
$$ plain form
3601 426198120 426997757 430207329 432427025 434624481 438370285 442309151 443322601 446823807 448527069
3609.6 448527069 449256668 456126938 459135437 458541985 462500458 463645973 467256584 472188072 474782486
3618.3 474782486 476470566 476675568 478155060 480776291 482911682 484875870 488497849 492636719
3626 492636719 496090660 501965942 504683151 498601837 500799561 504200516 509171638 512020988 511106110
3634.7 511106110 512612457 515281715 517986412 519436951 521031113 523843117 527252541 529790497
3642.4 529790497 530845299 532832298 536358719 542654839 545629158 544593964 550105515 550706024
3650.1 550706024 547905502 547477951 550789909 554020615 558752251 564854431 558338127 558422699 563067551
3658.8 563067551 565257950 566738892 567531204 569935951 571395721 572828560 574284401 576092262
$$ packed form
3601D26198120P99637L209572K219696K197456L745804L938866J013450L501206J703262
3609.6D48527069P29599O870270L008499n93452L958473J145515L610611M931488K594414
3618.3D74782486J688080K05002J479492K621231K135391J964188L621979M138870
3626D92636719L453941N875282K717209o081314K197724L400955M971122K849350r14878
3634.7E11106110J506347K669258K704697J450539J594162K812004L409424K537956
3642.4E29790497J054802J986999L526421O296120K974319j035194N511551O00509
3650.1E50706024k800522m27551L311958L230706M731636O102180o516304Q4572M644852
3658.8E63067551K190399J480942P92312K404747J459770J432839J455841J807861
$$ plain form
3666.5 576092262 581482086 586030159 588447495 588588257 583069839 584723167 590964966 599455910
3674.3 599455910 604985390 591536484 589543839 594469414 597960167 596330376 596095657 598415527
3682 598415527 600605927 602314377 603310509 604190598 609044037 616428452 611265869 609589119 616682167
3690.6 616682167 611982460 609906464 613253937 613785133 615079575 616201477 616478119 617403984 617868729
3699.3 617868729 621140442 625298653 622185020 620408592 623244438 624588852 625464439 626261749 628722496
3708 628722496 632162094 629059868 633965378 639021454 626884766 627662659 630700569 632049980 633174553
3716.7 633174553 634494476 636051025 634787788 635810928 641100311 640467072 636483765 640001221
3724.4 640001221 641767731 642431107 641046982 639980202 642607574 644287338 649167252 648173904 643261871
$$ packed form
3666.5E76092262N389824M548073K417336J40762n518418J653328O241799Q490944
3674.3E99455910N529480j3448906j992645M925575L490753j629791k34719K319870
3682E98415527K190400J708450R96132Q80089M853439P384415n162583j676750P093048
3690.6F16682167m699707k075996L347473N31196J294442J121902K76642R25865M64745
3699.3F17868729L271713M158211l113633j776428K835846J344414Q75587P97310K460747
3708F28722496L439598l102226M905510N056076j2136688P77893L037910J349411J124573
3716.7F33174553J319923J556549j263237J023140N289383o33239l983307L517456
3724.4F40001221J766510O63376j384125j066780K627372J679764M879914r93348m912033
$$ plain form
3733.1 643261871 651389160 654821472 649254532 647854843 649285660 648918762 648903198 651978836 649670715
3741.8 649670715 651926498 662853241 656467438 642758408 649471741 653745346 659479599 657683411
3749.5 657683411 651751251 662491226 658702011 650359726 653246613 655892944 658325958 654833374
3757.2 654833374 657504272 662893295 656699066 654842300 657972870 658799210 658745728 662297668 661652908
3765.9 661652908 656560364 658783340 664054184 665523148 658402863 659122238 661334076 661114883 661905289
3774.5 661905289 662517776 663528290 664113541 666699829 667418137 661558838 662790375 664486313 665712662
3783.2 665712662 668306580 666924667 665655975 666059723 666432343 667267151 667550049 667544250 667300262
3791.9 667300262 667604675 668387451 670476151 673867493 672388916 669546967 670921326 674666748 681117706
$$ packed form
3733.1F43261871Q127289L432312n566940j399689J430817l66898j5564L075638k308121
3741.8F49670715K255783J0926743o385803j3709030O713333M273605N734253j796188
3749.5F57683411n932160J0739975l789215q342285K886887K646331K433014l492584
3757.2F54833374K670898N389023o194229j856766L130570Q26340n3482L551940o44760
3765.9F61652908n092544K222976N270844J468964p120285P19375K211838k19193P90406
3774.5F61905289O12487J010514N85251K586288P18308n859299J231537J695938J226349
3783.2F65712662K593918j381913j268692M03748L72620Q34808K82898n799k43988
3791.9F67300262L04413P82776K088700L391342j478577k841949J374359L745422O450958
$$ plain form
3800.6 681117706 679245529 670188980 669412918 669640121 673859177 679490814 674016647 670202484 673010254
3809.3 673010254 674223175 673945694 674227982 674371033 675908508 681739120 682681274 671710739 674809799
3817.9 674809799 679901199 684690933 688083115 675527115 674671249 676694183 677697678 680987625
3825.7 680987625 682014618 678863297 678002701 678398514 681330185 684368820 678288574 679328384 684982300
3834.3 684982300 681789780 682574844 689273453 683795090 681318436 686695938 681852798 680453186
3842.1 680453186 685521469 684413605 680932541 682811737 683693314 683587189 684895477 684779587 687771683
3850.7 687771683 694426651 694278717 694205017 678028564 678346634 687325439 687452927 684160843 683930511
3859.4 683930511 685188751 688560638 686304398 686742783 693287811 689664688 684561920 686320877
$$ packed form
3800.6F81117706j872177r056549p76062K27203M219056N631637n474167l814163K807770
3809.3F73010254J212921k77481K82288J43051J537475N830612R42154j0970535L099060
3817.9F74809799N091400M789734L392182j2556000q55866K022934J003495L289947
3825.7F80987625J026993l151321q60596L95813K931671L038635o080246J039810N653916
3834.3F84982300l192520P85064O698609n478363k476654N377502m843140j399612
3842.1F80453186N068283j107864l481064J879196Q81577j06125J308288j15890K992096
3850.7F87771683O654968j47934p3700j6176453L18070Q978805J27488l292084k30332
3859.4F83930511J258240L371887k256240M38385O545028l623123n102768J758957
$$ plain form
3867.1 686320877 689989319 696107025 691567612 685198212 686578598 690544128 694382095 685816345
3874.8 685816345 685089264 687478943 687243042 689016571 692725983 691111145 685759048 689278488 690568771
3883.5 690568771 692198181 695983124 685805740 685769958 688635406 689642792 693233643 693965836 689152451
3892.2 689152451 689302139 690363922 688905716 689919510 691077652 694112930 696318359 688303986
3899.9 688303986 691786804 694621658 691461945 694911652 693954773 692272186 690227585 688973007
3907.6 688973007 690132446 689994507 689986496 689884109 689762726 690256195 690583267 691822815 694560776
3916.3 694560776 693091431 690071716 693225555 693824615 690083542 690758896 692355728 693761826 693044281
3925 693044281 690416794 691029663 692406082 693884964 693676834 692757111 694250183 692817154 691476135
$$ packed form
3867.1F86320877L668442O117706m539413o369400J380386L965530L837967q565750
3874.8F85816345p27081K389679k35901J773529L709412j614838n352097L519440J290283
3883.5F90568771J629410L784943j0177384l5782K865448J007386L590851P32193m813385
3892.2F89152451J49688J061783j458206J013794J158142L035278K205429q014373
3899.9F88303986L482818K834854l159713L449707r56879j682587k044601j254578
3907.6F88973007J159439j37939q011j02387j21383M93469L27072J239548K737961
3916.3F94560776j469345l019715L153839N99060l741073O75354J596832J406098p17545
3925F93044281k627487O12869J376419J478882k08130r19723J493072j433029j341019
$$ plain form
3933.7 691476135 691856537 690754623 691048508 692294159 692835236 692767029 692460098 694024811 695478821
3942.3 695478821 692392349 691346436 692225494 692798386 693932877 692279892 692988586 694427948 693022156
3951 693022156 694023132 694095840 693482895 693179932 693406219 694001160 692962189 693001556 693165359 693862534
3960.7 693862534 693727722 692141037 692935181 693759613 693948288 693407593 692926865 693924942 694194794
3969.3 694194794 693581619 693842316 694182434 693853455 694333038 694952621 694634399 693909988 693546753 693467331
3979 693467331 693522720 694256592 694811325 694815369 694837494 694985657 694349670 694119492 694481659 693916702 694346313
3989.6 694346313 694730301 694296112 694116898 694312668 694975357 694591751 694563751 695002289 694711990 694947052
3999.2 694947052 695667114
$$ packed form
3933.7F91476135L80402j101914K93885J245651N41077o8207l06931J564713J454010
3942.3F95478821l086472j045913Q79058N72892J134491j652985P08694J439362j405792
3951F93022156J000976P2708o12945l02963K26287N94941j038971L9367J63803O97175
3960.7F93862534j34812j586685P94144Q24432J88675n40695m80728R98077K69852
3969.3F94194794o13175K60697L40118l28979M79583O19583l18222p24411l63235p9422
3979F93467331N5389P33872N54733M044K2125J48163o35987k30178L62167n64957M29611
3989.6F94346313L83988m34189j79214J95770O62689l83606k8000M38538k90299K35062
3999.2F94947052P20062
$$ plain form
4000.2 695667114
$$ packed form
4000.2F95667114
##END=$$ End of the data block
