##TITLE=$$ Begin of the data block
##JCAMP-DX=5.00 $$ ACD/SpecManager v 10.08
##SPECTROMETER/DATA SYSTEM=Varian
##DATE=20 Nov 2012 10:07:06
##DATA TYPE=INFRARED SPECTRUM
##DATA CLASS=XYDATA
##ORIGIN=
##OWNER=
##NPOINTS=3735
##FIRSTX=399.26403809
##LASTX=4000.35498047
##MAXX=4000.35498047
##MINX=399.26403809
##MAXY=76.55033112
##MINY=22.43289757
##XFACTOR=1.0000000000
##YFACTOR=0.000000100000000
##FIRSTY=52.20101166
##DELTAX=0.96440572
##XUNITS=1/CM
##YUNITS=TRANSMITTANCE
##XYDATA=(X++(Y..Y))
$$ plain form
399.3 522010117 505859909 510360413 525871773 521496735 513045158 510860634 513178673 516122742
407 516122742 516322212 518741837 525049667 527743149 524260674 521308174 520618591 521356125 515690269
415.7 515690269 506870461 498145866 482607918 501168365 520016747 521490288 519503517 517199173
423.4 517199173 521136551 522989655 519934883 515005913 509946098 507467880 506565666 504738350 502766876
432.1 502766876 507910881 510565376 503865356 498644638 495424194 497199020 497475624 496559830 502618752
440.7 502618752 502627754 500870247 504108620 507487946 512899895 512397194 511145248 516050301 520564117
449.4 520564117 520895653 517744102 515945930 520831757 526219368 522806358 516555099 511649094 506143227
458.1 506143227 508466568 516289825 523968697 520732002 519608078 519109993 512032585 506111984 501823769
$$ packed form
399.3E22010117j6150208M500504J5511360m375038q451577k184524K318039K944069
407E16122742J99470K419625O307830K693482l482475k952500o89583P37534n665856
415.7E15690269q819808q724595j5537948J8560447J8848382J473541j986771k304344
423.4E17199173L937378J853104l054772m928970n059815k478218r02214j827316j971474
432.1E02766876N144005K654495o700020n220718l220444J774826K76604r15794O058922
440.7E02618752R002j757507L238373L379326N411949n02701j251946M905053M513816
449.4E20564117L31536l151551j798172M885827N387611l413010o251259m906005n505867
458.1E06143227K323341P823257P678872l236695j123924m98085p077408n920601m288215
$$ plain form
466.8 501823769 504824982 507934494 507360649 505871544 500383606 498245163 496207733 495486794 496040916
475.5 496040916 496074448 494131088 489810524 491974182 494304771 491339531 490279541 493558197 494378052
484.1 494378052 492612495 494388123 492047348 486539116 485019951 485748558 485192719 484554443 486347313
492.8 486347313 489769440 489852905 487874832 489103928 489126511 487123947 484107323 482114105 481898499
501.5 481898499 480259781 479234581 476517754 475961075 477577095 475178413 470859871 470041847 471962509
510.2 471962509 468441963 464969368 463284645 460145226 459017105 456978836 452749100 451713524
517.9 451713524 453512383 450594406 448791351 449299393 447386475 447183723 446877403 443747559 440937805
526.6 440937805 442288132 442504578 441796646 442013893 441521339 442313919 442780571 443384552 443448868 444000816
$$ packed form
466.8E01823769L001213L109512n73845j489105n487938k138443k037430p20939N54122
475.5D96040916L3532j943360m320564K163658K330589k965240j059990L278656Q19855
484.1D94378052j765557J775628k340775n508232j519165P28607n55839o38276J792870
492.8D86347313L422127Q3465j978073J229096K2583k002564l016624j993218k15606
501.5D81898499j638718j025200k716827n56679J616020k398682m318542q18024J920662
510.2D71962509l520546l472595j684723l139419j128121k038269m229736j035576
517.9D51713524J798859k917977j803055N08042j912918k02752l06320l129844k809754
526.6D40937805J350327K16446p07932K17247m92554P92580M66652O03981O4316N51948
$$ plain form
536.2 444000816 447065048 450622101 452621803 454694176 458785133 460358849 461681900 463169136
543.9 463169136 463505096 464623947 464990692 466089478 466880226 467105331 466712074 465689964 464990540
552.6 464990540 463149605 460949402 459249573 460156822 460310211 457540092 455589600 455099602 453637352
561.3 453637352 450323448 449417534 447545586 444006386 440737419 436553116 432962036 428041191 425553894
570 425553894 422709732 419508667 418835297 418136063 419022980 420621262 421971741 421463890 422224808
578.6 422224808 423515701 426406441 430823135 433664703 437591438 439943199 443347359 446973610
586.4 446973610 450729675 454016495 454143333 454656219 454800148 457128639 458424492 457735405 458796883
595 458796883 458807030 458764420 459113770 459970551 459715157 458358574 458108253 457941895 458276329 458550262
$$ packed form
536.2D44000816L064232L557053J999702K072373M090957J573716J323051J487236
543.9D63169136L35960J118851L66745J098786P90748K25105l93257j022110o99424
552.6D64990540j840935k200203j699829R07249J53389k770119j950492m89998j462250
561.3D53637352l313904r05914j871948l539200l268967m184303l591080m920845k487297
570D25553894k844162l201065o73370o99234Q86917J598282J350479n07851P60918
578.6D22224808J290893K890740M416694K841568L926735K351761L404160L626251
586.4D46973610L756065L286820J26838N12886J43929K328491J295853o89087J061478
595D58796883J0147m2610L49350Q56781k55394j356583k50321j66358L34434K73933
$$ plain form
604.7 458550262 457666168 455695801 455840416 456759453 457347107 459381180 460139542 460781517 461760178
613.4 461760178 462653465 464110374 464849243 464701042 464450417 464734650 465983009 468185997 470659103
622 470659103 473761330 475820656 477576942 480089188 481372452 482344437 483811607 484881172 484660988
630.7 484660988 484764748 485686874 487720795 489668655 490037651 491622429 492672539 492800865 493161469
639.4 493161469 493308372 493241577 491939049 491814346 492670174 493052826 493819809 494742737 495282402 495886650
649 495886650 497184296 497546158 498016548 499021835 499018784 497793922 497122231 497965050 499024773 500655975
658.7 500655975 500683517 500853004 502737427 504013405 506313515 507477150 506907692 506693268 502105865
667.4 502105865 487497215 496190262 503215065 505902786 506792908 507583427 509729843 512494545 514028587
$$ packed form
604.7D58550262q84094j970367J44615R19037N87654K034073P58362O41975R78661
613.4D61760178Q93287J456909P38869j48201k50625K84233J248359K202988K473106
622D70659103L102227K059326J756286K512246J283264R71985J467170J069565k20184
630.7D84660988J03760R22126K033921J947860L68996J584778J050110J28326L60604
639.4D93161469J46903o6795j302528j24703Q55828L82652P66983R22928N39665O04248
649D95886650J297646L61862M70390J005287l051j224862o71691Q42819J059723J631202
658.7E00655975K7542J69487J884423J275978K300110J163635n69458k14424m587403
667.4E02105865j4608650Q693047P024803K687721Q90122P90519K146416K764702J534042
$$ plain form
676.1 514028587 514708138 514878159 514063606 513006821 514225960 515588303 514810448 514399261 514985390
684.7 514985390 515503960 517578888 520959549 521913338 521870842 521699371 521105804 520764046 519267464
693.4 519267464 518487473 517619896 515697098 515284462 515870285 516523781 517159157 517303085 515879974
702.1 515879974 513755531 511847649 509534683 507125015 505375328 504487228 504275780 505506783 506649742
710.8 506649742 507997665 510214653 512327652 515236855 516640053 516773872 517875519 519394608 520903358
719.5 520903358 523112793 526426392 529464569 532985497 536850700 540930214 545083046 546637230
727.2 546637230 546847801 548346062 550394325 551861763 552594376 553448563 554829330 556809387 559392929
735.8 559392929 562695847 566006355 567400932 567983894 568464165 567671700 565933952 564151115 563399048
$$ packed form
676.1E14028587O79551J70021q14553j056785J219139J362343p77855m11187N86129
684.7E14985390N18570K074928L380661R53789m2496j71471n93567l41758j496582
693.4E19267464p79991q67577j922798m12636N85823O53496O35376J43928j423111
702.1E15879974k124443j907882k312966k409668j749687q88100k11448J231003J142959
710.8E06649742J347923K216988K112999K909203J403198J33819J101647J519089J508750
719.5E20903358K209435L313599L038177L520928L865203M079514M152832J554184
727.2E46637230K10571J498261K048263J467438P32613Q54187J380767J980057K583542
735.8E59392929L302918L310508J394577N82962M80271p92465j737748j782837p52067
$$ plain form
744.5 563399048 562995987 562607040 562301407 561986656 561498985 560822601 560981903 560224991 557415695 554307899
754.2 554307899 551299210 547142906 543265724 542371559 542749748 542281418 541551285 541014214 540796585
762.8 540796585 540242920 538881912 538011856 538081856 537886353 538029251 539143982 540614891 543768578
771.5 543768578 548494453 553785439 559123726 563536987 568095512 572554741 576277962 579408684
779.2 579408684 581702042 582746353 583633919 585787392 589128952 592585373 595356712 598678246 602358589
787.9 602358589 605800591 608752518 609726486 608607407 608360443 609024391 608297615 608513184 609986115
796.6 609986115 612909431 616730423 620073318 624356384 627163544 628298492 629537697 630658722
804.3 630658722 630382843 629010162 628251724 628101387 628663902 629572830 631777382 634407310 637096748
$$ packed form
744.5E63399048m03061l88947l05633l14751m87671o76384J59302p56912k809296l107796
754.2E54307899l008689m156304l877182q94165L78189m68330p30133n37071k17629
762.8E40796585n53665j361008q70056P0000j95503J42898J114731J470909L153687
771.5E43768578M725875N290986N338287M413261M558525M459229L723221L130722
779.2E79408684K293358J044311Q87566K153473L341560L456421K771339L321534L680343
787.9F02358589L442002K951927R73968j119079k46964O63948p26776K15569J472931
796.6F09986115K923316L820992L342895M283066K807160J134948J239205J121025
804.3F30658722k75879j372681p58438j50337N62515R08928K204552K629928K689438
$$ plain form
813 637096748 639345856 639186020 637907982 636281891 635026093 632921753 630821037 629444466 629063911
821.7 629063911 629989586 629234238 628765106 629262276 629669609 628957634 626112938 622599792 618637581
830.4 618637581 615444603 612386360 609874878 608190193 606619644 606523781 606337242 605396461 604512825
839 604512825 602768707 600520401 598645325 595640297 591964188 589061127 586367874 585062790 584877472
847.7 584877472 584004440 583003006 582788391 582396393 581148872 579113693 575532990 571402779 567852936
856.4 567852936 564625549 561706543 559456863 557734566 557021484 558455887 562041206 566521683 570918274
865.1 570918274 574934998 578488655 581370277 584388542 587848663 591879272 597551994 603996162
872.8 603996162 609702797 614404030 618658066 622641830 625764618 626198883 625179863 624253349 622528534
$$ packed form
813F37096748K249108j59836j278038j626091j255798k104340k100716j376571l80555
821.7F29063911R25675p55348m69132M97170M07333p11975k844696l513146l962211
830.4F18637581l192978l058243k511482j684685j570549r5863j86539r40781q83636
839F04512825j744118k248306j875076l005028l676109k903061k693253j305084j85318
847.7E84877472q73032j001434k14615l91998j247521k035179l580703m130211l549843
856.4E67852936l227387k919006k249680j722297p13082J434403L585319M480477M396591
865.1E70918274M016724L553657K881622L018265L460121M030609N672722O444168
872.8F03996162N706635M701233M254036L983764L122788M34265j019020r26514j724815
$$ plain form
881.5 622528534 620243263 617717056 616107368 614898109 614624786 614870529 614116859 612717209 610188026
890.2 610188026 607091980 603572960 600295181 597391968 594544907 591685562 589324303 587700081
897.9 587700081 585891533 585036964 584387398 582659721 579893036 576742706 573711891 569746475 564632645
906.5 564632645 558799973 553731422 549550896 546203423 542574501 538248367 534166756 529133492
914.3 529133492 523870468 518656349 512628403 506380119 500863838 495582962 491241989 488131065
922 488131065 485885048 485358238 485047302 484843788 484686623 484757080 485299072 485606499 485673180 485118484
931.6 485118484 485187187 486303902 487999229 489923935 492606735 496522369 499918556 502547379 504913101
940.3 504913101 507030029 509721146 512637863 514471321 515152931 515741539 516114769 515398064 514743996
$$ packed form
881.5F22528534k285271k526207j609688j209259k73323K45743p53670j399650k529183
890.2F10188026l096046l519020l277779k903213k847061k859345k361259j624222
897.9E87700081j808548q54569o49566j727677k766685l150330l030815l965416n113830
906.5E64632645n832672n068551m180526l347473l628922m326134m081611n033264
914.3E29133492n263024n214119o027946o248284n516281n280876m340973l110924
922D88131065k246017n26810l10936k03514j57165P0457N41992L07427O6681n54696
931.6D85118484O8703J116715J695327J924706K682800L915634L396187K628823K365722
940.3E04913101K116928K691117K916717J833458O81610N88608L73230p16705o54068
$$ plain form
949 514743996 514272614 512486687 509868088 506286163 501139755 495848236 490111656 483434258 476357155
957.7 476357155 469126740 462065926 455523376 449265747 441901741 434593391 427061539 419111671
965.4 419111671 410092239 400146370 391541290 382362862 372513580 362086983 352909851 343663254
973.1 343663254 333990631 325846519 316174107 306854095 297566490 289359150 281422424 273446770
980.8 273446770 266516819 259186058 253698063 247652779 243226986 239721527 237196198 235716610
988.5 235716610 232777805 230853615 228742924 228019943 226527023 225853271 225758648 225032711 225404758
997.2 225404758 224456940 225275631 225551949 226608601 227632942 227919979 228659210 227909241 228848495
1005.9 228848495 228364277 228243637 227633438 227501907 228072968 226030388 225837059 225042362 224921913
$$ packed form
949E14743996m71382j785927k618599l581925n146408n291519n736580o677398p077103
957.7D76357155p230415p060814o542550o257629p364006p308350p531852p949868
965.4D19111671r019432r945869q605080r178428r849282j0426597r177132r246597
973.1C43663254r672623q144112r672412r320012r287605q207340p936726p975654
980.8B73446770o929951p330761n487995o045284m425793l505459k525329j479588
988.5B35716610k938805j924190k110691p22981j492920o73752r4623p25937L72047
997.2B25404758r47818Q18691K76318J056652J024341K87037P39231p49969R39254
1005.9B28848495m84218j20640o10199j31531N71061k042580j93329p94697j20449
$$ plain form
1014.6 224921913 224328976 224690437 225711861 225136433 226039085 225668449 227116680 227573643 228131599
1023.2 228131599 229862118 230995903 233255901 234345284 237169037 238626289 240123119 242207012
1031 242207012 244058895 246350441 247200680 249124393 249337196 250002136 250093727 250654755 251959591
1039.6 251959591 251271172 251670418 250580215 250990295 251126575 250930805 250991516 250425377 251201534 250686607
1049.3 250686607 252002258 252948990 254954929 257844162 260682049 264236183 266462097 270418758
1057 270418758 273409939 277554169 281656151 285255260 289523029 293619137 299001923 302911625 308499374
1065.7 308499374 313278561 316372375 318463936 318631077 316710663 310673676 304663029 298042679
1073.4 298042679 293347645 289399776 285654659 284050446 281666451 282205639 282165794 283206253 284951992
$$ packed form
1014.6B24921913n92937L61461J021424n75428R02652l70636J448231M56963N57956
1023.2B28131599J730519J133785K259998J089383K823753J457252J496830K083893
1031B42207012J851883K291546Q50239J923713K12803O64940R1591N61028J304836
1039.6B51959591o88419L99246j090203M10080J36280j95770O0711n66139P76157n14927
1049.3B50686607J315651R46732K005939K889233K837887L554134K225914L956661
1057B70418758K991181M144230M101982L599109M267769M096108N382786L909702N587749
1065.7C08499374M779187L093814K091561J67141j920414o036987o010647o620350
1073.4B98042679m695034l947869l745117j604213k383995N39188l9845J040459J745739
$$ plain form
1082.1 284951992 286623440 289170589 290711746 293449059 295465736 299584160 302939148 305574379
1089.8 305574379 308907814 312144775 316308937 319256630 323554344 326224136 328240013 329643326
1097.5 329643326 330770760 332304687 331296349 331385117 330814705 331283455 331942520 332064476 332559547
1106.2 332559547 333242950 336173477 336912155 338414307 339692917 340833397 342694283 343413086 345804329
1114.9 345804329 347768707 350568733 352644081 355052605 356740532 356577721 357619858 357591019 358550720
1123.5 358550720 358740540 359314957 360679512 361349602 362498627 363852806 367257156 369723167 372647324
1132.2 372647324 374872246 375634727 376710739 376605415 376583710 374692459 372365379 369826317 367546844
1140.9 367546844 365734825 362781944 360027351 356512070 353612518 349511299 345902519 343143501
$$ packed form
1082.1B84951992J671448K547149J541157K737313K016677M118424L354988K635231
1089.8C05574379L333435L236961M164162K947693M297714K669792K015877J403313
1097.5C29643326J127434J533927j008338Q8768n70412M68750O59065J21956M95071
1106.2C32559547O83403K930527P38678J502152J278610J140480J860886P18803K391243
1114.9C45804329J964378K800026K075348K408524J687927j62811J042137k8839R59701
1123.5C58550720J89820N74417J364555O70090J149025J354179L404350K466011K924157
1132.2C72647324K224922P62481J076012j05324k1705j891251k327080k539062k279473
1140.9C67546844j812019k952881k754593l515281k899552m101219l608780k759018
$$ plain form
1148.6 343143501 339975204 337596283 334950142 334143028 332044868 330916252 331040955 331307297 332535858
1157.3 332535858 332822685 334556122 335537415 337269821 339190407 341185074 344362907 347840767 352974968
1166 352974968 358025894 364174767 369878349 375634995 382048225 389384575 396890640 402806931 409776840
1174.6 409776840 415912399 422079010 428723373 435556602 442820244 449347649 456176949 462725182
1182.4 462725182 468927612 474662323 480174675 484616127 488006554 491321831 494489021 498160896
1190.1 498160896 500980568 502967033 505532990 508243904 509857445 510455055 511376648 512452774 512854538
1198.8 512854538 512736206 512585869 512522888 512641068 512972488 513765450 514876785 515905800 517642593
1207.4 517642593 519381332 521036186 523251801 524942818 526076279 527276306 529019318 531101074
$$ packed form
1148.6C43143501l168297k378921k646141q07114k098160j128616J24703K66342J228561
1157.3C32535858K86827J733437R81293J732406J920586J994667L177833L477860N134201
1166C52974968N050926O148873N703582N756646O413230P336350P506065N916291O969909
1174.6D09776840O135559O166611O644363O833229P263642O527405O829300O548233
1182.4D62725182O202430N734711N512352M441452L390427L315277L167190L671875
1190.1D98160896K819672J986465K565957K710914J613541N97610R21593J076126M01764
1198.8E12854538j18332j50337o2981J18180L31420P92962J111335J029015J736793
1207.4E17642593J738739J654854K215615J691017J133461J200027J743012K081756
$$ plain form
1215.1 531101074 533233147 535762596 538017120 539680824 541763840 543595123 544589615 545035973 544685478
1223.8 544685478 543856506 542915344 542156944 540991058 539820061 538897858 538140297 537740364 537156372
1232.5 537156372 536642151 535800476 534482574 533249626 532158203 530975571 529925232 529248543 528070564
1241.2 528070564 527077065 527130203 527505150 528338432 529426117 530076942 530552444 531049881 531460495 531671982
1250.8 531671982 531543732 531703720 532493782 533418808 533939362 534356155 535867271 537095642 537290154
1259.5 537290154 537583008 537500420 537333107 537176361 537091026 537070160 537360153 538148994 539001350 540244942
1269.2 540244942 541652451 543358116 544802818 545678825 546290054 546157494 545812569 545310516 544788437
1277.8 544788437 543841171 543198738 543295746 543389015 543206673 543069763 543788490 544182816 544285278 543542252
$$ packed form
1215.1E31101074K132073K529449K254524J663704K083016J831283R94492M46358l50495
1223.8E44685478q28972r41162p58400j165886j170997r22203p57561l99933n83992
1232.5E37156372n14221q41675j317902j232948j091423j182632j050339o76689j177979
1241.2E28070564r93499N3138L74947Q33282J087685O50825M75502M97437M10614K11487
1250.8E31671982j28250J59988P90062R25026N20554M16793J511116J228371J94512
1259.5E37290154K92854q2588j67313j56746q5335k0866K89993P88841Q52356J243592
1269.2E40244942J407509J705665J444702Q76007O11229j32560l44925n02053n22079
1277.8E44788437r47266o42433R7008R3269j82342j36910P18727L94326J02462p43026
$$ plain form
1287.5 543542252 542328796 541721687 540636597 539897003 539112091 538586273 537925949 537221184 537329521
1296.2 537329521 537065430 536770210 535983162 534794884 532887878 530997963 529723816 528285294 527614899
1304.8 527614899 526630287 525448761 524590874 523976707 523665848 523255692 522835121 521510582 520189629
1313.5 520189629 519171257 518200264 517220802 515950165 514917908 513738136 513236961 513013802 512918816
1322.2 512918816 512840004 511478462 509349327 507014008 504686470 501855545 498870697 496139374 493180885
1330.9 493180885 490901947 489100037 487493019 486360550 485127831 484306221 483096123 481594620
1338.6 481594620 480353775 479764404 480284309 480433769 480582733 480971985 481725693 482344780 483163834
1347.3 483163834 484332428 485035858 485313835 484957085 484769211 484009018 482886810 482177582 481769943
$$ packed form
1287.5E43542252j213456o07109j085090p39594p84912n25818o60324p04765J08337
1296.2E37329521k64091k95220p87048j188278j907006j889915j274147j438522o70395
1304.8E27614899r84612j181526q57887o14167l10859m10156m20571j324539j320953
1313.5E20189629j018372r70993r79462j270637j032257j179772n01175k23159r4986
1322.2E12918816p8812j361542k129135k335319k327538k830925k984848k731323k958489
1330.9D93180885k278938j801910j607018j132469j232719q21610j210098j501503
1338.6D81594620j240845n89371N19905J49460J48964L89252P53708O19087Q19054
1347.3D83163834J168594P03430K77977l56750j87874p60193j122208p09228m07639
$$ plain form
1355.9 481769943 481702652 481351242 481641541 481665688 481345940 481287193 480834122 480021477 479406204 479440765
1365.6 479440765 478730698 477850304 476937485 476464729 477032547 477372971 478113556 478403778 479029808 480033836
1375.2 480033836 480661430 480722046 479882202 480050888 480251961 480758133 481207771 481736145 482764549 484090614
1384.9 484090614 486288643 487679520 489826927 491981697 493740273 494780159 495141335 495309639 494582863
1393.6 494582863 493527679 492561989 493262482 493660622 493417320 491812096 490618477 490987320 489564819
1402.2 489564819 487833900 486374435 484803810 483975983 482875443 481932831 480573082 479858017 479250298
1410.9 479250298 478792839 478507538 477587776 476388512 474877090 474413071 473775864 473448105 471849213
1419.6 471849213 471967773 473674660 474012871 474778481 475128479 476314468 477140198 476955986 477745476
$$ packed form
1355.9D81769943o7291l51410K90299K4147l19748n8747m53071q12645o15273L4561
1365.6D79440765p10067q80394r12819m72756N67818L40424P40585K90222O26030J004028
1375.2D80033836O27594O0616q39844J68686K01073N06172M49638N28374J028404J326065
1384.9D84090614K198029J390877K147407K154770J758576J039886L61176J68304p26776
1393.6D94582863j055184r65690P00493L98140k43302j605224j193619L68843j422501
1402.2D89564819j730919j459465j570625q27827j100540r42612j359749p15065o07719
1410.9D79250298m57459k85301r19762j199264j511422m64019o37207l27759j598892
1419.6D71849213J18560J706887L38211P65610L49998J185989Q25730j84212P89490
$$ plain form
1428.3 477745476 477706680 478038979 478371620 479327278 480339546 481430054 482742882 482711143 483709259
1437 483709259 484852104 486850815 487933807 488444595 489019127 489096451 489850426 489762077 490449066 490261421
1446.6 490261421 489431610 488856812 489217682 490002289 488940125 488341713 487447624 487612572 486613808
1455.3 486613808 484153519 481201668 478633194 482557411 482840500 485158920 486285706 487083588 488924141
1464 488924141 488931198 492660065 494428787 497308426 499478073 502596207 505942650 507246246 512772102
1472.6 512772102 516166229 522493134 525989494 530828514 536248360 540246582 544232216 546370430
1480.3 546370430 549882355 552244568 555855675 558386650 560279655 563331718 564831810 568447952
1488.1 568447952 569902191 572761688 576008797 578834686 581643410 582680931 584361191 584431229 584902039
$$ packed form
1428.3D77745476l8796L32299L32641R55658J012268J090508J312828l1739R98116
1437D83709259J142845J998711J082992N10788N74532P7324P53975q8349O86989j87645
1446.6D90261421q29811n74798L60870P84607j062164n98412q94089J64948r98764
1455.3D86613808k460289k951851k568474L924217K83089K318420J126786P97882J840553
1464D88924141P057L728867J768722K879639K169647L118134L346443J303596N525856
1472.6E12772102L394127O326905L496360M839020N419846L998222L985634K138214
1480.3E46370430L511925K362213L611107K530975J893005L052063J500092L616142
1488.1E68447952J454239K859497L247109K825889K808724J037521J680260P0038M70810
$$ plain form
1496.7 584902039 586677933 588058586 589923935 592219124 594451294 595240479 597133560 597862778 598113708
1505.4 598113708 592099113 586430550 594073563 596930733 599793549 601362534 602699661 603275871
1513.1 603275871 604439392 605086746 604813499 605511398 604406700 607301788 608514175 605304832 602614670
1521.8 602614670 604525719 608410759 609264679 609763832 610826607 612089767 612560539 613267326 614314384
1530.5 614314384 613363571 613546410 612350388 609937401 611093788 611704178 612349434 612034378 607853088
1539.2 607853088 600236130 604798355 607458267 607995453 609849243 608550758 607970505 608995323 608966980
1547.9 608966980 608570862 607033691 605682220 605871964 606326828 605948067 602786179 602371521 603610535
1556.5 603610535 603142967 591882515 584464493 592869263 597081718 598526688 598735542 598509331 597467041
$$ packed form
1496.7E84902039J775894J380653J865349K295189K232170P89185J893081P29218K50930
1505.4E98113708o014595n668563P643013K857170K862816J568985J337127N76210
1513.1F03275871J163521O47354k73247O97899j104698K895088J212387l209343k690162
1521.8F02614670J911049L885040Q53920M99153J062775J263160M70772P06787J047058
1530.5F14314384r50813J82839j196022k412987J156387O10390O45256l15056m181290
1539.2F07853088p616958M562225K659912N37186J853790j298485n80253J024818k8343
1547.9F08966980l96118j537171j351471J89744M54864l78761l161888m14658J239014
1556.5F03610535m67568j1260452p418022Q404770M212455J444970K08854k26211j042290
$$ plain form
1565.2 597467041 597970009 598627014 598549194 597253723 593696785 595286789 596159706 596034088 595876083
1573.9 595876083 595736809 594577866 591394005 594231224 595984344 596290894 595891991 595135307 595101700
1582.6 595101700 594653206 594090843 593418350 592838478 592474251 591995773 591680412 590917091 590862808 590450020
1592.2 590450020 589862747 589044342 587473869 586527519 585420189 584877739 583797722 582834854 581818314
1600.9 581818314 580635986 580292053 579394112 578590508 577102432 575791817 574513550 573373604 571870689
1609.6 571870689 570012589 569234047 567382851 566289024 564852257 564083023 563050079 557454071 558530045
1618.2 558530045 558346672 557294731 555428238 554284058 552051353 548980370 549503365 548452492 547954712
1626.9 547954712 546375122 545647240 545320473 544319496 543670959 542503204 542436295 542234535 539521370
$$ packed form
1565.2E97467041N02968O57005p7820j295471l556938J590004Q72917j25618j58005
1573.9E95876083j39274j158943l183861K837219J753120L06550l98903p56684l3607
1582.6E95101700m48494n62363o72493n79872l64227m78478l15361p63321n4283m12788
1592.2E90450020n87273q18405j570473r46350j107330n42450j080017r62868j016540
1600.9E81818314j182328l43933q97941q03604j488076j310615j278267j139946j502915
1609.6E71870689j858100p78542j851196j093827j436767p69234j032944n596008J075974
1618.2E58530045j83373j051941j866493j144180k232705l070983N22995j050873m97780
1626.9E47954712j579590p27882l26767j000977o48537j167755o6909k01760k713165
$$ plain form
1635.6 539521370 536738358 537483902 538346558 538773384 539579964 539411964 540282364 539936790 540423622
1644.3 540423622 541528893 540958786 541517754 541202583 543595085 545188904 547277946 548902321 544572182
1653 544572182 544373016 550161057 554525986 556735764 559270172 561206589 562864456 564064980 565209503
1661.6 565209503 566618462 568423347 571762733 574160576 576677017 578867264 580338478 580617752
1669.4 580617752 583486252 587863503 590321198 593103294 595303421 596152611 598149643 601500626
1677.1 601500626 604547424 607135239 609889450 611571846 614573097 617392845 617636185 617836533 622109909
1685.8 622109909 626569862 629346161 631033821 633117599 635108299 637679520 640391769 642329559
1693.5 642329559 644527893 645127945 642763824 647346802 651051407 654606323 653698425 650976791 655218582
$$ packed form
1635.6E39521370k783012P45544Q62656M26826Q06580j68000Q70400l45574M86832
1644.3E40423622J105271n70107N58968l15171K392502J593819K089042J624375m330139
1653E44572182j99166N788041M364929K209778K534408J936417J657867J200524J144523
1661.6E65209503J408959J804885L339386K397843K516441K190247J471214K79274
1669.4E80617752K868500M377251K457695K782096K200127Q49190J997032L350983
1677.1F01500626L046798K587815K754211J682396L001251K819748K43340K00348M273376
1685.8F22109909M459953K776299J687660K083778J990700K571221K712249J937790
1693.5F42329559K198334O00052k364121M582978L704605L554916r07898k721634M241791
$$ plain form
1702.1 655218582 657849808 658913879 658903198 660369263 661329193 663011475 664967194 666226730 666939774
1710.8 666939774 667413635 668022995 668338165 667753067 667196884 669192657 670586243 668709488 671245728
1719.5 671245728 673301544 674605942 675074768 675112839 675492630 676601410 677507019 677731705 678087158
1728.2 678087158 678498611 678310928 678885727 681278610 682456741 678613663 679423065 683951263 686976166
1736.9 686976166 687514420 688312683 687781830 686456451 688744125 689998016 690183258 691329269 693907852
1745.5 693907852 695582809 696638260 697738495 697660980 700457687 701216125 701771469 704742508 706446609
1754.2 706446609 707924423 709499741 710132828 711473083 713817902 715576248 717152176 716405792 716803665
1762.9 716803665 719179077 719966660 720634613 721276321 721979218 721120071 722101364 724463425 724548492
$$ packed form
1702.1F55218582K631226J064071j0681J466065R59930J682282J955719J259536P13044
1710.8F66939774M73861O09360L15170n85098n56183J995773J393586j876755K536240
1719.5F71245728K055816J304398M68826L8071L79791J108780R05609K24686L55453
1728.2F78087158M11453j87683N74799K392883J178131l843078Q09402M528198L024903
1736.9F86976166N38254P98263n30853j325379K287674J253891J85242J146011K578583
1745.5F93907852J674957J055451J100235p7515K796707P58438N55344K971039J704101
1754.2G06446609J477814J575318O33087J340255K344819J758346J575928p46384L97873
1762.9G16803665K375412P87583O67953O41708P02897q59147R81293K362061Q5067
$$ plain form
1771.6 724548492 724080658 724722672 727608185 728538895 728135681 729257507 728785706 729025269 728915405
1780.3 728915405 729043121 730512238 731924362 733053360 732914658 733603058 734690857 735224838 734824066
1788.9 734824066 734617233 733668976 732778168 732632675 733143082 735349808 736048584 736919250 738492126
1797.6 738492126 739330750 739244156 738607559 739601822 738940201 739075165 739798965 739854736 740193481 740087814
1807.3 740087814 740531158 741286926 742454071 742552414 743127823 743831329 743919296 744303436 743472900 743423843
1816.9 743423843 743138809 743243637 743954239 744466400 745621872 745663605 746632156 747559280 745957184
1825.6 745957184 745530624 746376801 746964035 746004105 744193192 744907684 746532593 746812515 747283554
1834.3 747283554 748204880 748589020 748654709 748395996 749229813 749119949 748904495 748409195 748052979 747504501
$$ packed form
1771.6G24548492m67834O42014K885513R30710m03214J121826m71801K39563j09864
1780.3G28915405J27716J469117J412124J128998j38702O88400J087799N33981m00772
1788.9G34824066k06833r48257q90808j45493N10407K206726O98776Q70666J572876
1797.6G38492126Q38624q6594o36597R94263o61621J34964P23800N5771L38745j05667
1807.3G40087814M43344P55768J167145R8343N75409P03506Q7967L84140q30536m9057
1816.9G43423843k85034J04828P10602N12161J155472M1733R68551R27124j602096
1825.6G45957184m26560Q46177N87234r59930j810913P14492J624909K79922M71039
1834.3G47283554R21326L84140O5689k58713Q33817j09864k15454m95300l56216n48478
$$ plain form
1843.9 747504501 744509430 746594620 748365707 748986816 749463806 750221024 750939713 750661850 750857620
1852.6 750857620 750319519 749971848 749682922 749360352 749384613 749060287 749400024 749951935 751270828 751608887
1862.2 751608887 751856384 752196274 751443253 751094437 750154495 749732819 748594208 748288422 749436340
1870.9 749436340 750370636 751326065 751808624 752747421 752994308 753099976 752983170 752656784 752424469 751872940
1880.6 751872940 752160263 751792145 751707458 751710358 751905975 752881927 753547516 754519501 754408493 753914642
1890.2 753914642 754190369 754328308 753939209 753461227 753066864 752823563 753532715 753651428 754160919 754715576
1899.8 754715576 754978561 755624924 755857849 755848694 754756165 754312286 754196625 753641052 753212204 752772369
1909.5 752772369 753164978 753992538 755304642 755711594 756146164 756312103 755807877 756092453 754351578
$$ packed form
1843.9G47504501k995071K085190J771087O21109M76990P57218P18689k77863J95770
1852.6G50857620n38101l47671k88926l22570K4261l24326L39737N51911J318893L38059
1862.2G51608887K47497L39890p53021l48816r39942m21676j138611l05786J147918
1870.9G49436340R34296R55429M82559R38797K46887J05668j16806l26386k32315n51529
1880.6G51872940K87323l68118q4687K900J95617R75952O65589R71985j11008m93851
1890.2G53914642K75727J37939l89099m77982l94363k43301P09152J18713N09491N54657
1899.8G54715576K62985O46363K32925r155j092529m43879j15661n55573m28848m39835
1909.5G52772369L92609Q27560J312104M06952M34570J65939n04226K84576j740875
$$ plain form
1918.2 754351578 753431320 753709106 753770370 753814621 753320923 753939209 755147552 756217117 756528244 756702957
1927.8 756702957 756385727 756077499 755718307 754788666 754443970 753834991 753793488 754133682 754871216 755681000
1937.5 755681000 756111984 756981659 757221146 757463760 756313019 754670181 754810333 754570541 754256592
1946.1 754256592 754198380 754823151 755330658 755973511 756764526 757454834 757830048 757547989 757433472 756784973
1955.8 756784973 756416931 755986252 755481567 755475464 755416489 755905380 756435165 756956787 757307892 758014603
1965.4 758014603 757940903 756920319 756989670 757018433 756943893 756340790 755772324 755654907 755948334 756768265
1975.1 756768265 757561569 758268280 758363419 758677216 758234634 757569351 757286682 756651154 756509628 756286011
1984.7 756286011 756524658 756388855 756458969 757131271 757489700 758557892 758614502 757708359 757413330 757487488
$$ packed form
1918.2G54351578r20258K77786O1264M4251m93698O18286J208343J069565L11127J74713
1927.8G56702957l17230l08228l59192r29641l44696o08979m1503L40194P37534Q09784
1937.5G55681000M30984Q69675K39487K42614j150741j642838J40152k39792l13949
1946.1G54256592n8212O24771N07507O42853P91015O90308L75214k82059j14517o48499
1955.8G56784973l68042m30679n04685o103n8975M88891N29785N21622L51105P06711
1965.4G58014603p3700j020584O9351K8763p4540o03103n68466j17417K93427Q19931
1975.1G56768265P93304P06711R5139L13797m42582o65283k82669o35528j41526k23617
1984.7G56286011K38647j35803P0114O72302L58429J068192N6610r06143k95029P4158
$$ plain form
1994.3 757487488 757180939 756613998 756297226 755925827 756223297 756565933 756905060 757280350 757870789 758275528
2004 758275528 757994537 757899094 757218475 756639633 756360550 755988770 755384216 754995575 755450439 755863342
2013.6 755863342 756517487 756848907 756701431 755862808 755455475 755712280 755100555 754496002 753807068 753672943
2023.3 753672943 753722076 753744125 754054794 754171219 754629364 754624100 754753418 754652557 754088440 753225632
2032.9 753225632 752085648 751412354 750797501 751161423 751412125 751467972 752050018 752519913 752720947 752620163
2042.6 752620163 752752838 751810074 751067581 750710754 750272522 750382080 749813843 749579239 749707413 750210800
2052.2 750210800 750732040 751010895 751353073 751319122 751434326 750934753 750349045 749909821 749658356 749408493
2061.9 749408493 749093475 749702072 750332489 751029739 751444626 751801834 752064285 751854095 751481934 750774536
$$ packed form
1994.3G57487488l06549n66941l16772l71399K97470L42636L39127L75290N90439M04739
2004G58275528k80991r5443o80619n78842k79083l71780o04554l88641M54864M12903
2013.6G55863342O54145L31420j47476q38623m07333K56805o11725o04553o88934j34125
2023.3G53672943M9133K2049L10669J16425M58145n264J29318j00861n64117q62808
2032.9G53225632j139984o73294o14853L63922K50702N5847N82046M69895K01034j00784
2042.6G52620163J32675r42764p42493l56827m38232J09558n68237k34604J28174N03387
2052.2G50210800N21240K78855L42178l3951J15204m99573n85708m39224k51465k49863
2061.9G49408493l15018O08597O30417O97250M14887L57208K62451k10190l72161p07398
$$ plain form
2071.5 750774536 750361404 749501266 749088211 749256897 749383926 750085602 750653000 751340485 752193298 752726212
2081.1 752726212 752338715 751845856 750883102 749527283 749445190 749527740 749671173 749787979 750094147 750638046
2090.8 750638046 751388474 752333984 752510529 752570038 751857147 751240997 750981064 750352325 750027542 749942780
2100.4 749942780 750219421 750349808 751210556 752013397 752322388 752721558 752551498 752495728 752125092 751767502
2110.1 751767502 751263733 750750351 750583801 750551987 751056671 751623840 752619705 753196869 753489838 753602600
2119.7 753602600 753102951 752652283 752123032 751815948 751110458 750792084 750953751 751206894 751754990 752407227
2129.4 752407227 753591156 753873138 753780823 753661270 753080978 752489853 751688766 751142731 750750656 750686111
2139 750686111 750982819 751942291 752629776 753009949 753793335 753784409 753558884 752898026 751968918 751200027
$$ packed form
2071.5G50774536m13132q60138m13055J68686J27029P01676N67398O87485Q52813N32914
2081.1G52726212l87497m92859r62754j355819q2093Q2550J43433J16806L06168N43899
2090.8G50638046P50428R45510J76545N9509p12891o16150k59933o28739l24783q4762
2100.4G49942780K76641J30387Q60748Q02841L08991L99170j70060n5770l70636l57590
2110.1G51767502n03769n13382j66550l1814N04684N67169R95865N77164K92969J12762
2119.7G53602600m99649m50668n29251l07084p05490l18374J61667K53143N48096O52237
2129.4G52407227J183929K81982r2315j19553n80292n91125q01087n46035l92075o4545
2139G50686111K96708R59472O87485L80173P83386q926k25525o60858r29108p68891
$$ plain form
2148.6 751200027 750937805 751265106 751289139 751686249 752184525 752922592 753533936 753972626 754377518 754152756
2158.3 754152756 754142685 753737488 753099747 752486801 751918869 751999741 752688904 753369827 753645782 754376297
2167.9 754376297 755133133 755688705 755737457 755346451 754846039 754314423 754273682 753988419 754155273 754558716
2177.6 754558716 755029221 755823364 756514282 757176971 757288284 757591019 757449341 757038727 756743622 756269531
2187.2 756269531 756025238 755790863 756503372 757144928 757678680 758110657 758213501 758991547 759347000 759234695
2196.9 759234695 758805084 758750305 758784714 758301468 757758560 757514038 758024673 758525467 759531097 760338669
2206.5 760338669 760816345 761260757 761129303 760873566 760179520 760048904 759772415 759551849 759822617 759809341
2216.1 759809341 760391388 761047974 761703720 761913834 761921616 762258224 762767334 762803040 761779404 761045685
$$ packed form
2148.6G51200027k62222L27301K4033L97110M98276P38067O11344M38690M04892k24762
2158.3G54152756j0071m05197o37741o12946n67932Q0872O89163O80923K75955P30515
2167.9G54376297P56836N55572M8752l91006n00412n31616m0741k85263J66854M03443
2177.6G54558716M70505P94143O90918O62689J11313L02735j41678m10614k95105m74091
2187.2G56269531k44293k34375P12509O41556N33752M31977J02844P78046L55453j12305
2196.9G59234695m29611n4779L4409m83246n42908k44522N10635N00794J005630Q07572
2206.5G60338669M77676M44412j31454k55737o94046j30616k76489k20566K70768j3276
2216.1G59809341N82047O56586O55746K10114P782L36608N09110L5706j023636p33719
$$ plain form
2225.8 761045685 760574799 760693588 760891647 761126556 761893082 762429886 763112030 763602905 763988342 763544998
2235.4 763544998 762852936 762531586 761980896 761757889 761438370 761515884 761688766 762168503 763024063 763492279
2245.1 763492279 763622971 763497849 763902054 763978271 763545837 762610550 761929932 761762924 761271439 761458817
2254.7 761458817 761940079 762776871 763651123 764450684 764856033 764646530 764760971 764226913 763376312 762475357
2264.4 762475357 761925201 761464462 761328812 762047958 762686615 763688583 764325485 765065308 765249252
2273 765249252 764744797 764372406 763145599 762361679 761979370 762181244 762365189 762600174 763478699 764237061
2282.7 764237061 765211182 765503311 765477600 764923782 764200745 763318863 762174301 761852798 761062317 760676651
2292.3 760676651 760832977 761581421 762128754 762596512 763226471 762825394 762976685 761603317 760036697
$$ packed form
2225.8G61045685m70886J18789J98059K34909P66526N36804O82144M90875L85437m43344
2235.4G63544998o92062l21350n50690k23007l19519P7514J72882M79737Q55560M68216
2245.1G63492279J30692j25122M04205P6217m32434r35287o80618j67008m91485J87378
2254.7G61458817M81262Q36792Q74252P99561M05349k09503J14441n34058q50601r00955
2264.4G62475357n50156m60739j35650P19146O38657J001968O36902P39823J83944
2273G65249252n04455l72391j226807p83920l82309K01874J83945K34985Q78525P58362
2282.7G64237061R74121K92129k5711n53818p23037q81882j144562l21503p90481l85666
2292.3G60676651J56326P48444N47333M67758O29959m01077J51291j373368j566620
$$ plain form
2301 760036697 759189224 757801971 757568207 757198486 757236176 756975708 757152100 757345352 757052460 757286758
2310.7 757286758 756289673 755683517 754366302 753385696 752847137 751586838 750894318 749474106 749104156
2319.3 749104156 748250351 747191010 747205200 747507553 747597046 746774292 745838165 743629837 742134323
2328 742134323 740850983 740557404 740394592 740722046 743374023 743810349 744062271 742254257 739998703
2336.7 739998703 739536438 738847122 738320618 736587372 736970215 736425629 735866089 736671371 738214874
2345.4 738214874 741149216 744091873 748099213 748804626 745957947 742456055 739584045 736801682
2353.1 736801682 734152832 732620544 729886856 729375381 729599075 728171997 727396088 727691422 729336624
2361.8 729336624 728971252 729157715 728369675 728618164 730593796 731446991 733220215 734728394 737501526
$$ packed form
2301G60036697q47473j387253k33764l69721L7690k60468J76392J93252k92892K34298
2310.7G57286758r97085o06156j317215r80606n38559j260299o92520j420212l69950
2319.3G49104156q53805j059341J4190L02353Q9493q22754r36127k208328j495514
2328G42134323j283340k93579j62812L27454K651977M36326K51922j808014k255554
2336.7G39998703m62265o89316n26504j733246L82843n44586n59540Q05282J543503
2345.4G38214874K934342K942657M007340P05413k846679l501892k872010k782363
2353.1G36801682k648850j532288k733688n11475K23694j427078p75909K95334J645202
2361.8G29336624l65372J86463p88040K48489J975632Q53195J773224J508179K773132
$$ plain form
2370.4 737501526 740113983 742374878 744840240 745814743 746149902 746815262 747641830 748103561 748854294
2379.1 748854294 749491501 750668106 752651062 754545212 756004944 756706772 757325745 757493896 757268524
2387.8 757268524 756837158 756103439 755354004 754782410 754453583 754192963 754510498 754841919 755747375 756826096
2397.4 756826096 757002563 756887741 755999146 755276718 754761658 754023285 753288116 752709732 752675934 752682724
2407.1 752682724 752738342 752989807 754021835 754665833 754316635 753775482 753049316 752385635 751300964
2415.8 751300964 750454636 749991150 750122528 750304718 749985199 750335007 750650406 750803833 750520706 750116501
2425.4 750116501 749760056 749124222 748302155 747155609 746914597 746616058 746353378 746444626 746387634 746853485
2435.1 746853485 747240829 747454224 746888351 746319504 745799179 744571686 743480148 742580338 742228928
$$ packed form
2370.4G37501526K612457K260895K465362R74503L35159O65360Q26568M61731P50733
2379.1G48854294O37207J176605J982956J894150J459732P01828O18973J68151k25372
2387.8G57268524m31366p33719p49435n71594l28827k60620L17535L31421R05456J078721
2397.4G56826096J76467j14822q88595p22428n15060p38373p35169n78384l3798O790
2407.1G52682724N5618K51465J032028O43998l49198n41153p26166o63681j084671
2415.8G51300964q46328m63486J31378J82190l19519L49808L15399J53427k83127m04205
2425.4G50116501l56445o35834q22067j146546k41012k98539k62680R1248n6992M65851
2435.1G46853485L87344K13395n65873n68847n20325j227493j091538q99810l51410
$$ plain form
2443.7 742228928 742323456 742693329 742672806 742758255 743020554 742712250 742658997 742227173 741368408 740417099
2453.4 740417099 739857254 739306259 738661346 738833160 738649445 738384323 738574219 738952637 739122467 739092560
2463 739092560 738613052 737563248 737056503 736266632 735471115 734946594 734641495 734880371 734980698 735136032
2472.7 735136032 735046539 735093842 735090408 734718628 734234467 733460312 732539597 731722260 731550903 731273499
2482.3 731273499 730810852 730556564 731277771 732365646 732208633 731758804 731072388 730606003 730115967
2491 730115967 729439468 729002762 728288040 728103867 728209152 728585739 728865967 728864517 728847504 728675003
2500.6 728675003 728497391 727946472 727456589 726474075 725768661 725741959 725797882 725999451 725693665 725994034
2510.3 725994034 726399155 726528931 726542892 726119537 725722656 725130920 724558487 723622284 722993546 722690659
$$ packed form
2443.7G42228928R4528L69873k0523Q5449K62299l08304n3253m31824q58765r51309
2453.4G40417099n59845n50995o44913J71814j83715k65122J89896L78418J69830k9907
2463G39092560m79508j049804n06745p89871p95517n24521l05099K38876J00327J55334
2472.7G35136032q9493M7303l434l71780m84161p74155r20715q17337j71357k77404
2482.3G31273499m62647k54288P21207J087875j57013m49829o86416m66385m90036
2491G30115967o76499m36706p14722j84173J05285L76587K80228j450j7013j72501
2500.6G28675003j77612n50919m89883r82514p05414k6702N5923K01569l05786L00369
2510.3G25994034M05121J29776J3961m23355l96881n91736n72433r36203o28738l02887
$$ plain form
2519.9 722690659 722663498 723222046 723246918 722914810 722814789 723329010 723188095 722562561 721987381 720936813
2529.6 720936813 720208893 719690323 719595032 719326019 719171753 719130554 719050369 719633179 719325714 718805008
2539.2 718805008 718650970 718222733 717330017 716255798 715749664 715377274 715072250 715097046 715703430 715748367
2548.9 715748367 715536499 715321808 714754791 714915695 714335480 713517532 713008194 712101212 711464691 710901566
2558.5 710901566 710523605 710503311 711000366 711089172 710771484 710448227 709976730 709574585 709036942 708998032
2568.1 708998032 708686142 708080978 707486725 706932602 707149277 707158737 706795120 706563950 706577911 706115265
2577.8 706115265 705473862 705166245 704602509 704144897 703664474 703506241 703445053 703166733 702996521 703051758
2587.4 703051758 703205795 702833786 702505417 702291336 702022171 701277237 700324326 699892578 699568329 699266663
$$ packed form
2519.9G22690659k7161N58548K4872l32108j00021N14221j40915o25534n75180j050568
2529.6G20936813p27920n18570r5291k69013j54266m1199q0185N82810l07465n20706
2539.2G18805008j54038m28237q92716j074219n06134l72390l05024K4796O06384M4937
2548.9G15748367k11868k14691n67017J60904n80215q17948n09338r06982o36521n63125
2558.5G10901566l77961k0294M97055Q8806l17688l23257m71497m02145n37643l8910
2568.1G08998032l11890o05164n94253n54123K16675R460l63617k31170J3961m62646
2577.8G06115265o41403l07617n63736m57612m80423j58233o1188k78320j70212N5237
2587.4G03051758J54037l72009l28369k14081k69165p44934r52911m31748l24249l01666
$$ plain form
2597.1 699266663 698974762 699298172 699373856 699170074 699128189 698912506 699163055 698624954 697563248 696814270
2606.7 696814270 696654205 696797867 696371384 696274109 696161194 695934219 695544586 695108643 694938812 694476624
2616.4 694476624 693863373 692988892 692155228 691508560 691122971 690694275 690421677 690350113 689869919 689621964
2626 689621964 689238281 688857269 688205566 687285385 686907578 686359329 685706100 685059509 684524231 683832397
2635.6 683832397 683375168 683493805 683347397 682893066 682209549 681809387 681211243 680344086 679694977 679033279
2645.3 679033279 678437729 677815704 677523422 677248230 676741791 676182861 675720978 675158539 674434891 674040833
2654.9 674040833 673657608 673151932 672347946 671980667 671620102 670616989 670055389 669753113 669811783 669527206
2664.6 669527206 668661880 667840652 667451630 667304535 666384964 665994492 665869293 665396271 665151443 664495316
$$ packed form
2597.1F99266663k91901L23410P5684k03782m1885k15683K50549n38101j061706p48978
2606.7F96814270j60065J43662m26483r7275j12915k26975l89633m35943j69831m62188
2616.4F94476624o13251q74481q33664o46668l85589m28696k72598p1564m80194k47955
2626F89621964l83683l81012o51703r20181l77807n48249o53229o46591n35278o91834
2635.6F83832397m57229J18637j46408m54331o83517m00162n98144q67157o49109o61698
2645.3F79033279n95550o22025k92282k75192n06439n58930m61883n62439p23648l94058
2654.9F74040833l83225n05676q03986l67279l60565j003113n61600l02276N8670k84577
2664.6F69527206q65326q21228l89022j47095r19571l90472j25199m73022k44828o56127
$$ plain form
2674.2 664495316 663749390 663420105 663358383 662850571 662360687 662330704 661900482 660804672 659675598 659225769
2683.9 659225769 659270325 659327240 658861160 658558807 658457718 657754440 656870956 656356049 656447906 656250381
2693.5 656250381 655661087 654957504 654373856 654005356 653488312 653087311 652468338 652166138 651827927 650995483
2703.1 650995483 650290298 649652023 649224319 648674622 648165207 647681808 647424698 647006302 646163483 645667877
2712.8 645667877 645149002 644995422 644598465 643858566 643437805 643093414 642645111 642071915 642336426 642129440
2722.4 642129440 641274185 640752106 640142593 639750137 639110489 638491249 638100929 637915688 637717743 637135773
2732.1 637135773 636845207 637072601 637174187 636531296 636037407 635367661 634331093 633984070 634138145
2740.8 634138145 634146957 633579750 633214302 632846222 632540588 632463112 631969719 631542816 630992851 630418587
$$ packed form
2674.2F64495316p45926l29285o1722n07812m89884k9983m30222j095810j129074m49829
2683.9F59225769M4556N6915m66080l02353j01089p03278q83484n14907R1857j97525
2693.5F56250381n89294p03583n83648l68500n17044m01001o18973l02200l38211q32444
2703.1F50995483p05185o38275m27704n49697n09415m83399k57110m18396q42819m95606
2712.8F45667877n18875j53580l96957p39899m20761l44391m48303n73196K64511k06986
2722.4F42129440q55255n22079o09513l92456o39648o19240l90320j85241j97945n81970
2732.1F37135773k90566K27394J01586o42891m93889o69746j036568l47023J54075
2740.8F34138145Q812n67207l65448l68080l05634p7476m93393m26903n49965n74264
$$ plain form
2750.4 630418587 629917336 629791374 629893799 629638176 629289169 628623047 628307419 628472824 628398476 627602615
2760 627602615 626775398 626823387 626736412 626366005 625990105 625565262 625256271 624874763 624442444 624246597
2769.7 624246597 624071236 623921585 623813591 623128090 622658844 622350388 621909485 621380920 620230331
2778.4 620230331 619838600 619870529 619242630 618896332 618909531 618373833 617611427 617197456 616771774 616371460
2788 616371460 615677567 615248528 614871712 613834686 612999878 612355652 611853600 611303940 610960884 610680962
2797.7 610680962 610138550 609400368 608247948 607512321 606519585 605184898 604358597 603885651 603317375
2806.3 603317375 602385216 601671638 600995941 600592194 600005608 598933182 597715645 596491737 595674171
2815 595674171 594333649 593184814 592313843 591547165 591116562 590028725 589296417 588648605 587572746
$$ packed form
2750.4F30418587n01251j25962J02425k55623l49007o66122l15628J65405p4348p95861
2760F27602615q27217M7989q6975l70407l75900m24843l08991l81508m32319j95847
2769.7F24246597j75361j49651j07994o85501m69246l08456m40903n28565j150589
2778.4F20230331l91731L1929o27899l46298J3199n35698p62406m13971m25682m00314
2788F16371460o93893m29039l76816j037026q34808o44226n02052n49660l43056k79922
2797.7F10680962n42412p38182j152420p35627r92736j334687q26301m72946n68276
2806.3F03317375r32159p13578o75697m03747n86586j072426j217537j223908q17566
2815E95674171j340522j148835q70971p66678m30603j087837p32308o47812j075859
$$ plain form
2823.7 587572746 586172943 584608459 583765869 582921753 581609154 580055313 578880424 578056450 577260704
2832.4 577260704 576362953 574961014 573816757 572959023 571772346 570149574 568468742 566895332 564964218
2841.1 564964218 563099709 561522102 559749260 558189697 556737862 554886360 553108177 550764961
2848.8 550764961 548360443 546691055 545170822 544039001 542407837 541051636 540582390 539968491 539450798
2857.4 539450798 538612595 537672386 536765137 535663223 534203911 532773895 531398506 529713058 528601837
2866.1 528601837 526902809 524770775 523159866 521503296 519818954 517843895 516132584 513994102
2873.8 513994102 511419029 509335823 507187805 504768600 502396126 500829887 499321327 497622948
2881.6 497622948 496168709 494603310 493235893 492248077 491647911 490615463 489487381 488861084 488215370
$$ packed form
2823.7E87572746j399803j564484q42590q44116j312599j553841j174889q23974p95746
2832.4E77260704q97751j401939j144257q57734j186677j622772j680832j573410j931114
2841.1E64964218j864509j577607j772842j559563j451835j851502j778183k343216
2848.8E50764961k404518j669388j520233j131821j631164j356201m69246o13899n17693
2857.4E39450798q38203r40209r07249j101914j459312j430016j375389j685448j111221
2866.1E28601837j699028k132034j610909j656570j684342j975059j711311k138482
2873.8E13994102k575073k083206k148018k419205k372474j566239j508560j698379
2881.6D97622948j454239j565399j367417r87816o00166j032448j128082o26297o45714
$$ plain form
2890.2 488215370 487587090 486780281 486154099 486006050 486195869 486104851 485631752 485283127 484901543 484653969
2899.9 484653969 484175339 483473282 482801590 482100563 481199837 480151062 479701424 479126091 478287697
2908.6 478287697 477779465 476967125 475571251 474024239 472479019 470677795 469031792 467469559 465454788
2917.2 465454788 463260117 461531715 459858322 457863541 456647224 455753403 454901276 454086914 452826996
2925.9 452826996 451948433 451200447 450476532 450005913 449961395 450388222 451063194 452221985 452947083 453779449
2935.6 453779449 455609474 457678413 459790192 461807938 464096107 466578026 468726845 470867462
2943.3 470867462 472993050 475357704 477966881 480241165 482519302 484953804 487240372 489623146
2951 489623146 492295036 494772568 496960068 499108086 501232262 503628769 505874748 507696152 509574356
$$ packed form
2890.2D88215370o28280q06809o26182j48049J89819r1018m73099l48625l81584k47574
2899.9D84653969m78630p02057o71692p01027r00726j048775m49638n75333q38394
2908.6D78287697n08232q12340j395874j547012j545220j801224j646003j562233k014771
2917.2D65454788k194671j728402j673393j994781j216317q93821q52127q14362j259918
2925.9D52826996q78563p47986p23915m70619m4518M26827O74972J158791P25098Q32366
2935.6D53779449J830025K068939K111779K017746K288169K481919K148819K140617
2943.3D70867462K125588K364654K609177K274284K278137K434502K286568K382774
2951D89623146K671890K477532K187500K148018K124176K396507K245979J821404J878204
$$ plain form
2959.7 509574356 511816063 513968925 515823631 517842293 519534798 521174545 522565346 523470650
2967.4 523470650 524501419 525575447 527115822 528654823 530410156 532122307 533202972 534520226
2975.1 534520226 535823593 537451210 539417229 541240883 542458839 543278503 544202461 545099220 546525307
2983.8 546525307 547539062 548572159 550151024 551452484 552482605 553090706 554241791 555164070 555353584
2992.5 555353584 555855827 556610832 557417259 557931404 558325081 558654442 558940315 559112396 559272995 559194298
3002.1 559194298 558988380 559033279 558697624 558487701 558246231 558102417 558238411 558331490 558499184 557953110
3011.7 557953110 557376900 556696625 555727310 555209427 554676743 553564682 552292557 551610298 550723076
3020.4 550723076 550026398 549532051 548682976 548255424 547912674 547312698 546156998 545072899 544257202
$$ packed form
2959.7E09574356K241707K152862J854706K018662J692505J639747J390801R05304
2967.4E23470650J030769J074028J540375J539001J755333J712151J080665J317254
2975.1E34520226J303367J627617J966019J823654J217956Q19664R23958Q96759J426087
2983.8E46525307J013755J033097J578865J301460J030121O08101J151085R22279J89514
2992.5E55353584N02243P55005Q06427N14145L93677L29361K85873J72081J60599p8697
3002.1E59194298k05918M4899l35655k09923k41470j43814J35994R3079J67694n46074
3011.7E57953110n76210o80275r69315n17883n32684j112061j272125o82259q87222
3020.4E50723076o96678m94347q49075m27552l42750n99976j155700j084099q15697
$$ plain form
3029.1 544257202 543302078 542121811 540675392 539919472 539118385 538263435 537600632 536416740 535505180
3037.8 535505180 534768486 533604622 532372475 531394691 530224838 528947449 528018608 527192345 526158714
3046.5 526158714 524868126 523625946 522712326 522285843 521382103 519869652 518534737 517307091 516450386
3055.1 516450386 515335541 513828964 512714081 511798973 510756073 509665756 508697014 507793350 506818962
3063.8 506818962 505513802 504464073 503357201 501599083 500269775 499605370 498977127 497791290 496318359
3072.5 496318359 495251656 494657021 493855438 492634659 491531105 490385513 489227371 487996559 486997528
3081.2 486997528 486185341 485033760 483686295 482236595 481305656 480712395 480227394 479389076 477859383
3089.9 477859383 476521378 475387573 474351234 473111267 472103195 471236954 469802284 468641243
$$ packed form
3029.1E44257202r55124j180267j446419p55920q01087q54950o62803j183892r11560
3037.8E35505180p36694j163864j232147r77784j169853j277389r28841q26263j033631
3046.5E26158714j290588j242180r13620m26483r03740j512451j334915j227646q56705
3055.1E16450386j114845j506577j114883r15108j042900j090317r68742r03664r74388
3063.8E06818962j305160j049729j106872j758118j329308o64405o28243j185837j472931
3072.5D96318359j066703n94635q01583j220779j103554j145592j158142j230812r99031
3081.2D86997528q12187j151581j347465j449700r30939n93261m85001q38318j529693
3089.9D77859383j338005j133805j036339j239967j008072q66241j434670j161041
$$ plain form
3097.6 468641243 467928734 467237396 466090050 464970131 463990211 462777443 461496964 460197220 459272575
3106.2 459272575 458288689 457452049 456318665 454714699 453607788 452400055 451625404 451119232 450139351
3114.9 450139351 449047699 448021088 447271881 445921669 444122353 442860107 441838837 441090088 440454903
3123.6 440454903 439348259 438131599 436796608 435543938 434802246 433887444 433066826 432155037 430858650
3132.3 430858650 429418640 427946434 427423744 427128029 426153412 424988632 423948441 422821465 421849632
3141 421849632 421091690 419643860 418508911 417899513 416929970 415720596 414153137 412883339 412363510
3149.6 412363510 411939468 410918579 409804039 408526230 407255630 406653900 405539017 404237480 403406639
3158.3 403406639 402651443 401806145 400897942 400025101 398878670 397976761 397246017 396437607 395558853
$$ packed form
3097.6D68641243p12509o91338j147346j119919r79920j212768j280479j299744r24645
3106.2D59272575r83886q36640j133384j603966j106911j207733p74651n06172r79881
3114.9D50139351j091652j026611p49207j350212j799316j262246j021270p48749o35185
3123.6D40454903j106644j216660j334991j252670p41692r14802q20618r11789j296387
3132.3D30858650j440010j472206n22690k95715r74617j164780j040191j126976r71833
3141D21849632p57942j447830j134949o09398r69543j209374j567459j269798n19829
3149.6D12363510m24042j020889j114540j277809j270600o01730j114883j301537q30841
3158.3D03406639p55196q45298r08203q72841j146431r01909p30744q08410q78754
$$ plain form
3167 395558853 394504433 393449554 392288895 391428680 390415039 389276466 388842392 388284416 387157402
3175.7 387157402 386338425 385411110 384045486 383412628 382778130 381858673 381042862 379981194 379239426
3184.4 379239426 378488617 377328491 376333084 375999718 375678253 374885445 373985023 373103600 372437439
3193 372437439 371530685 370636520 369622002 368453598 367741623 366934776 366226883 365565681 364918137 364196129
3202.7 364196129 363330307 362695427 361902924 361166611 360652351 360209770 359442177 358710022 358242569 357275772
3212.3 357275772 356429939 355827026 355173035 354536781 353867989 353185425 352101059 351103401 350859909
3221 350859909 350662270 350129128 349429131 348507690 348128052 347684555 346795921 346598701 346360817 345761642
3230.7 345761642 345228195 344814682 343797913 342623367 342405739 341895714 341066780 340623779 340359306
$$ packed form
3167C95558853j054420j054879j160659q60215j013641j138573m34074n57976j127014
3175.7C87157402q18977r27315j365624o32858o34498r19457q15811j061668p41768
3184.4C79239426p50809j160126r95407l33366l21465p92808r00422q81423o66161
3193C72437439r06754q94165j014518j168404p11975q06847p07893o61202o47544p22008
3202.7C64196129q65822o34880p92503p36313n14260m42581p67593p32155m67453r66797
3212.3C57275772q45833o02913o53991o36254o68792o82564j084366r97658k43492
3221C50859909j97639n33142o99997r21441l79638m43497q88634j97220k37884n99175
3230.7C45761642n33447m13513j016769j174546k17628n10025q28934m43001k64473
$$ plain form
3239.3 340359306 339437447 338430252 338330040 338022041 337719307 337165909 336546135 336243134 335858498
3248 335858498 335584564 334519272 333741150 333591461 333056259 332547722 332125511 331522789 330651703 330276375
3257.7 330276375 330184288 329886360 329402733 328808212 328275070 327581635 326991920 326577072 326369171 325995407
3267.3 325995407 325426636 324921494 324762650 324431953 323350143 323378410 323615761 323237267 323123055 322461128
3276.9 322461128 321812592 321188850 320511894 319923019 319803371 319940491 319191971 318555489 318541031 318512897
3286.6 318512897 317950211 317567368 317332249 316688824 316723747 316773739 316343765 315776196 315370216 315090408
3296.2 315090408 314341106 313799019 313316078 312712212 312560406 312683372 312522621 312124443 311892872 311354637
3305.9 311354637 310796452 310715466 310354080 309751472 309440994 309198437 309138374 308714809 307826290 307521381
$$ packed form
3239.3C40359306r21859j007195j00212l07999l02734n53398o19774l03001l84636
3248C35858498k73934j065292p78122j49689n35202n08537m22211o02722q71086l75328
3257.7C30276375r2087k97928m83627n94521n33142o93435n89715m14848k07901l73764
3267.3C25995407n68771n05142j58844l30697j081810K8267K37351l78494j14212o61927
3276.9C22461128o48536o23742o76956n88875j19648J37120p48520o36482j4458k8134
3286.6C18512897n62686l82843k35119o43425L4923M9992m29974n67569m05980k79808
3296.2C15090408p49302n42087m82941o03866j51806J22966j60751l98178k31571n38235
3305.9C11354637n58185q0986l61386o02608l10478k42557o0063m23565q88519l04909
$$ plain form
3315.5 307521381 307305584 306859550 306339722 305802612 305295620 304699345 304513779 304350471 303941917 303473644
3325.2 303473644 302871284 302506218 302403584 301970329 301275196 301081257 300707932 300043087 300020237 300083885
3334.8 300083885 299588490 298708649 297953892 297827873 298059368 297701721 296882668 296283607 296055508 296022720
3344.4 296022720 295555859 294851418 294565086 294768581 294774361 294359531 293893337 293379879 292792568 291967583
3354.1 291967583 291055450 290339966 290297031 290139256 289714375 289897442 289704742 289461937 289068279 288387356
3363.7 288387356 288061733 287461414 287003212 286674881 286430950 286115398 285359993 284548435 284166489 284290295
3373.4 284290295 284318466 284430733 284148903 283668175 283362427 282916546 282552700 282007904 281881657 281714668
3383 281714668 281436787 281513119 281289768 280897846 280526428 280535526 280327396 280057945 280076714 279703140 279199238
$$ packed form
3315.5C07521381k15797m46034n19828n37110n06992n96275j85566j63308m08554m68273
3325.2C03473644o02360l65066j02634m33255o95133j93939l73325o64845k2850O3648
3334.8C00083885m95395q79841p54757j26019K31495l57647q19053n99061k28099l2788
3344.4B96022720m66861p04441k86332K03495N780m14830m66194n13458n87311q24985
3354.1B91967583r12133p15484m2935j57775m24881J83067j92700k42805l93658o80923
3363.7B88387356l25623o00319m58202l28331k43931l15552p55405q11558l81946J23806
3373.4B84290295K8171J12267k81830m80728l05748m45881l63846n44796j26247j66989
3383B81714668k77881P6332k23351l91922l71418R098k08130k69451J8769l73574n03902
$$ plain form
3393.6 279199238 279054241 279247608 279083691 278988304 279089050 279197254 279156933 278851967 278918476 278773651
3403.3 278773651 278872719 278900852 278587246 278207932 277570286 277700348 277921124 278137341 278147964 278015614
3412.9 278015614 278351994 278164921 278209858 278369503 277959251 277405834 277236137 277399426 277558689 278366985
3422.6 278366985 279000778 278876839 278708172 278977089 278890209 278061600 277889729 278195171 278394203 278741245
3432.2 278741245 279151592 279340134 279431515 279675274 279697170 279557419 279991913 280287724 280018368 280351601
3441.8 280351601 280248547 280265293 281415253 282224102 282873363 282986164 282817879 283014812 283640633 284007721
3451.5 284007721 283547096 283931599 284558601 285184059 285960159 286232452 286353836 286330242 286779327 287438965
3461.1 287438965 288011818 288521347 289420033 290291595 290404549 290871010 291101398 290954113 291049786 291400700
$$ packed form
3393.6B79199238j44997J93367j63917r5387J00746J08204m0321l04966O6509j44825
3403.3B78773651R9068K8133l13606l79314o37646J30062K20776K16217J0623j32350
3412.9B78015614L36380j87073M4937J59645m10252n53417j69697J63289J59263Q08296
3422.6B78366985O33793j23939j68667K68917q6880q28609j71871L05442J99032L47042
3432.2B78741245M10347J88542R1381K43759K1896j39751M34494K95811k69356L33233
3441.8B80351601j03054J6746J149960Q08849O49261J12801j68285J96933O25821L67088
3451.5B84007721m60625L84503O27002O25458P76100K72293J21384k3594M49085O59638
3461.1B87438965N72853N09529Q98686Q71562J12954M66461K30388j47285R5673L50914
$$ plain form
3470.8 291400700 292072163 292786789 293458748 294025116 294760284 295309505 295659657 296101494 296867599 297258034
3480.4 297258034 297387619 298055115 298390408 299653015 300645943 300628891 301410942 301947327 302278061 303312664
3490.1 303312664 304528236 304737225 305113926 305941925 306470242 307065716 306951084 307573566 308528652
3498.7 308528652 309618492 310850964 311371727 312110977 312000999 312373505 313170223 313691025 314666901
3507.4 314666901 315694771 316488075 316601143 317566776 318444500 318860912 319648342 320651360 321850700
3516.1 321850700 322482948 322878036 322768326 323078575 323981552 325494156 327001801 326765366 327793007
3524.8 327793007 329353714 330474243 331059685 330858421 331158714 331962166 333160210 334013901 335137329
3533.5 335137329 336027145 337301903 338397713 338186913 339288445 340201035 340974236 342137032 343357239
$$ packed form
3470.8B91400700O71463P14626O71959N66368P35168N49221L50152M41837P66105L90435
3480.4B97258034J29585O67496L35293J262607R92928j7052P82051N36385L30734J034603
3490.1C03312664J215572K08989L76701Q27999N28317N95474j14632O22482R55086
3498.7C08528652J089840J232472N20763P39250j09978L72506P96718N20802R75876
3507.4C14666901J027870P93304J13068R65633Q77724M16412P87430J003018J199340
3516.1C21850700O32248L95088j09710L10249R02977J512604J507645k36435J027641
3524.8C27793007J560707J120529N85442k01264L00293Q03452J198044Q53691J123428
3533.5C35137329Q89816J274758J095810k10800J101532R12590P73201J162796J220207
$$ plain form
3542.1 343357239 344395256 345577774 346910095 346881294 348179016 349076691 350211678 351835442 353111000
3550.8 353111000 354637146 353923492 355151711 356995468 358457756 359852257 360100327 362192497 363939667
3559.5 363939667 364860077 365512810 367237244 368559952 369373627 373151474 373423996 373413239 374475479
3568.2 374475479 375165482 378498802 379953880 381530342 383550377 385312347 386084404 387512283 390184364
3576.9 390184364 391383553 394113655 395932922 397022820 399103661 400796852 402244797 403533554
3584.6 403533554 407869759 409150581 407403450 410359879 411066628 413814926 416929474 419785461
3592.3 419785461 421154213 422465782 426048584 425629158 428077164 431646080 432631989 435119820 435784340
3601 435784340 437669487 441092453 442970009 444688110 447390785 449870110 450381927 453952522 453460274
$$ packed form
3542.1C43357239J038017J182518J332321k8801J297722Q97675J134987J623764J275558
3550.8C53111000J526146p13654J228219J843757J462288J394501K48070K092170J747170
3559.5C63939667R20410O52733J724434J322708Q13675L777847K72522j0757J062240
3568.2C74475479O90003L333320J455078J576462K020035J761970P72057J427879K672081
3576.9C90184364J199189K730102J819267J089898K080841J693191J447945J288757
3584.6D03533554M336205J280822j747131K956429P06749K748298L114548K855987
3592.3D19785461J368752J311569L582802m19426K448006L568916R85909K487831O64520
3601D35784340J885147L422966J877556J718101K702675K479325N11817L570595m92248
$$ plain form
3609.6 453460274 454264297 461494064 461821060 460784264 465161324 465396500 469456329 472998009 473073807
3618.3 473073807 475234756 475024872 476567955 480027161 482881927 485097923 487593727 489348679
3626 489348679 491127968 497805176 498930511 490166245 494529266 499663467 505315170 506611252 504737473
3634.7 504737473 507772980 511524086 513334618 513960304 516302757 519017067 521352234 522366638
3642.4 522366638 523044434 525796471 529577026 534633713 531955795 528198433 533581085 533752098 532297974
3651.1 532297974 533415222 539433517 543879433 547584152 551706467 544040298 546300697 551966705
3658.8 551966705 553759232 555620346 556450539 558551331 559997559 561525726 563219604 564102516 568114891
3667.5 568114891 569781799 568456268 568247452 563167229 566949463 575107880 583076706 580752678
$$ packed form
3609.6D53460274Q04023P229767L26996j036796M377060K35176M059829L541680P5798
3618.3D73073807K160949k09884J543083L459206K854766K215996K495804J754952
3626D89348679J779289O677208J125335q764266M363021N134201N651703J296082j873779
3634.7E04737473L035507L751106J810532O25686K342453K714310K335167J014404
3642.4E22366638O77796K752037L780555N056687k677918l757362N382652J71013j454124
3651.1E32297974J117248O018295M445916L704719M122315p666169K260399N666008
3658.8E51966705J792527J861114Q30193K100792J446228J528167J693878Q82912M012375
3667.5E68114891J666908j325531k08816n080223L782234Q158417P968826k324028
$$ plain form
3675.2 580752678 563662224 568716240 576909294 581181145 579974823 581350746 584071541 585574722
3682.9 585574722 587014732 587492371 588052101 591945915 597592125 588264465 585262032 593027039 588277550
3691.6 588277550 589706764 595514526 597014008 598677444 598594131 598596840 600079842 600988579 603725929
3700.3 603725929 605854759 600402603 599224930 604783020 606469460 606182442 607188263 609981766
3708 609981766 612353745 605025902 610370522 615569534 602562866 607486572 612403984 612879944 614434891
3716.7 614434891 617318535 617933655 614121857 615835571 620714302 616176529 613039551 618396530
3724.4 618396530 619693069 618438606 615928612 617174644 620806503 622290115 627749252 624841766
3732.1 624841766 618473091 626404305 625827408 617567749 618865700 620862160 621917191 625606194
$$ packed form
3675.2E80752678j7090454N054016Q193054M271851j206322J375923K720795J503181
3682.9E85574722J440010M77639N59730L893814N646210r327660l002433P765007m749489
3691.6E88277550J429214N807762J499482J663436q3313K709J483002R08737K737350
3700.3F03725929K128830n452156j177673N558090J686440k87018J005821K793503
3708F09981766K371979p327843N344620N199012j3006668M923706M917412M75960J554947
3716.7F14434891K883644O15120l811798J713714M878731m537773l136978N356979
3724.4F18396530J296539j254463k509994J246032L631859J483612N459137k907486
3732.1F24841766o368675P931214n76897q259659J297951J996460J055031L689003
$$ plain form
3739.8 625606194 629094124 626288452 630453911 641564560 627898560 614159927 624653549 630418358
3747.5 630418358 635083466 628885193 622972984 634720039 628796806 624062233 630565071 635843582
3755.3 635843582 639058647 634378586 636933517 640892792 631917305 631357193 636384850 638236580
3763 638236580 639354782 642899246 639534988 635636864 639652901 644129181 643772430 635614319 637921715
3771.7 637921715 641657486 642642365 643505859 642531204 643731842 644542847 645828018 645025940 639282074
3780.3 639282074 642855911 645427017 646557083 648615189 645478516 644794998 646137009 646968307 647896957
3789 647896957 648051910 648549271 648297272 648602295 648586807 649866104 652873535 649424744 646865692
3797.7 646865692 649297104 652754364 657182007 649868622 641582718 646080017 650288544 655585632
$$ packed form
3739.8F25606194L487930k805672M165459J1110649j3666000j3738633J0493622N764809
3747.5F30418358M665108o198273n912209J1747055n923233m734573O502838N278511
3755.3F35843582L215065m680061K554931L959275q975487n60112N027657J851730
3763F38236580J118202L544464l364258l898124M016037M476280l56751q158111K307396
3771.7F37921715L735771R84879Q63494r74655J200638Q11005J285171q02078n743866
3780.3F39282074L573837K571106J130066K058106l136673o83518J342011Q31298R28650
3789F47896957J54953M97361k51999L05023j5488J279297L007431l448791k559052
3797.7F46865692K431412L457260M427643p313385q285904M497299M208527N297088
$$ plain form
3805.4 655585632 659167633 648509521 646681366 652284851 654243011 654553070 654917374 654903793 656271362
3814.1 656271362 660754776 656209259 644729538 652274704 658297501 661759491 661388779 645843277
3821.8 645843277 649612122 654867783 656608734 659124603 658507004 654001541 654958191 658022537 661719818
3830.5 661719818 662136917 653828735 657573471 664676514 659015656 658036118 664140625 655594635 653072281
3839.2 653072281 659527969 654311371 656468430 663377228 660484848 657719574 660565872 661828461
3846.9 661828461 662144318 663918839 662795258 664386826 669220428 662973785 662626419 647317047
3854.6 647317047 651434784 662703552 662506866 660949173 662770691 665531158 667757797 661478271
3862.3 661478271 662142868 668969727 663650208 658709335 662581024 667501297 672952194 666160278
$$ packed form
3805.4F55585632L582001j0658112j828155N603485J958160L10059L64304j3581J367569
3814.1F56271362M483414m545517j1479721P545166O022797L461990l70712j5545502
3821.8F45843277L768845N255661J740951K515869o17599m505463R56650L064346L697281
3830.5F61719818M17099q308182L744736P103043n660858r79538O104507q545990k522354
3839.2F53072281O455688n216598K157059O908798k892380k765274K846298J262589
3846.9F61828461L15857J774521j123581J591568M833602o246643l47366j5309372
3854.6F47317047M117737J1268768j96686j557693J821518K760467K226639o279526
3862.3F61478271O64597O826859n319519m940873L871689M920273N450897o791916
$$ plain form
3870 666160278 656890793 660756836 667732544 671096191 662227325 663449554 667282486 667442551 669691772
3878.7 669691772 672650146 664292526 659668427 667534485 668869476 670578003 674843597 661689453
3886.4 661689453 662826004 667169724 668804703 672771606 671066208 663598404 665677261 668955536
3894.1 668955536 667447357 668559952 669918289 672527237 674467545 665537033 669752502 670856934
3901.8 670856934 666005630 670471115 668127289 667963409 668148422 668228683 670595551 670906830 671291885
3910.5 671291885 671009216 670678406 670460281 670436172 672779388 675310211 671989136 668711777 672268448
3919.2 672268448 671735840 668725586 671435699 672916260 673242340 671257095 669234848 671451569 672761078
3927.9 672761078 673080597 671767578 670968323 672937546 671034546 669878922 671706085 671622162 672104721
$$ packed form
3870F66160278r269485L866043O975708L363647q868866J222229L832932J60065K249221
3878.7F69691772K958374q357620m624099P866058J334991J708527M265594j3154144
3886.4F61689453J136551M343720J634979L966903j705398p467804K078857L278275
3894.1F68955536j508179J112595J358337K608948J940308q930512M215469J104432
3901.8F70856934m851304M465485k343826j63880J85013Q0261K366868L11279L85055
3910.5F71291885k82669l30810k18125k4109K343216K530823l321075l277359L556671
3919.2F72268448n32608l010254K710113J480561L26080j985245k022247K216721J309509
3927.9F72761078L19519j313019p99255J969223j903000j155624J827163q3923M82559
$$ plain form
3936.6 672104721 673145676 673272781 673434372 673394394 674936371 675197449 670698700 670607758 672488480
3945.2 672488480 673646317 674785843 673062286 673758850 673828659 672130051 674480209 674931335 673811874
3953.9 673811874 674274216 674822769 674252625 673080978 673487396 673568115 674307098 674764404 673646011
3962.6 673646011 674285126 674921417 674547729 674419632 675024948 675794144 675473709 674848328 675596085 675970001
3972.2 675970001 674489288 674486771 675974350 676378632 675667114 675174561 675268784 675342636 675707092 675878601
3981.9 675878601 675302734 674893036 675215302 675365601 675648346 675872345 675593414 675982056 675716782 675501404
3991.5 675501404 676113358 676268921 675905609 675001907 675243149 676196136 676677551 676477509 676106949
4000.2 676106949
$$ packed form
3936.6F72104721J040955J27105J61591l9978J541977K61078m498749r0942J880722
3945.2F72488480J157837J139526j723557O96564O9809j698608K350158M51126j119461
3953.9F73811874M62342N48553n70144j171647M06418Q0719P38983M57306j118393
3962.6F73646011O39115O36291l73688j28097O05316P69196l20435o25381P47757L73916
3972.2F75970001j480713k517J487579M04282p11518m92553R4223P3852L64456J71509
3981.9F75878601n75867m09698L22266J50299K82745K23999k78931L88642k65274k15378
3991.5F75501404O11954J55563l63312r03702K41242R52987M81415k00042l70560
4000.2F76106949
##END=$$ End of the data block
