##TITLE=$$ Begin of the data block
##JCAMP-DX=5.00 $$ ACD/SpecManager v 10.08
##SPECTROMETER/DATA SYSTEM=Varian
##DATE=20 Nov 2012 10:06:58
##DATA TYPE=INFRARED SPECTRUM
##DATA CLASS=XYDATA
##ORIGIN=
##OWNER=
##NPOINTS=3735
##FIRSTX=399.26403809
##LASTX=4000.35498047
##MAXX=4000.35498047
##MINX=399.26403809
##MAXY=76.66390228
##MINY=22.38345146
##XFACTOR=1.0000000000
##YFACTOR=0.000000100000000
##FIRSTY=55.57159424
##DELTAX=0.96440572
##XUNITS=1/CM
##YUNITS=TRANSMITTANCE
##XYDATA=(X++(Y..Y))
399.3E55715942k1814956j1727829K133789K069969L360100j1734085j4130898L618393
$$ 555715942 533900986 522173157 524306946 526376915 529737015 518002930 503872032 507490425
407E07490425R016113K685814k953529J139412K628555q37784N605774L454933r120941
$$ 507490425 516506538 519192352 516238823 517378235 520006790 519169006 524774780 528229713 519108772
415.7E19108772p366104Q47817K169838K276420R793739n75904j4824028j1252633
$$ 519108772 511742668 512590485 514760323 517036743 526830482 526254578 511430550 500177917
423.4E00177917J1021424J3938713p3052q372955p199860n329971L254051O247368
$$ 500177917 511199341 525138054 525065002 516692047 509492187 504162216 507416267 513663635
431.1E13663635q91494l395272k121315l035736o242790m23546M898148l9101m25797
$$ 513663635 512772141 509376869 507255554 504219818 497977028 497553482 502451630 502412529 501986732
439.8E01986732M087868J22299l528595K537613L795548M562378M167061j433678K27547
$$ 501986732 506074600 506196899 502668304 505205917 509001465 513563843 517730904 516297226 516524773
448.4E16524773L614845K36511m631348m392662K072831N473442J654129J166725l317413
$$ 516524773 520139618 520376129 515744781 511352119 513424950 518898392 520552521 521719246 518401833
457.1E18401833j0945740Q032303O954765l725586m901428k046242j54610K018776
$$ 518401833 507456093 515488396 522443161 518717575 513816147 511769905 511615295 513634071
464.8E13634071J97029j789436P55158j581841l619804j783181l014411k930527o03485
$$ 513634071 513831100 512041664 512796822 511214981 507595177 505811996 502797585 499867058 499263573
473.5D99263573J934433K502212K19460m999504o155548j320305o15273m28848j141281
$$ 499263573 501198006 503700218 503919678 498920174 492764626 491444321 490829048 490400200 489258919
482.2D89258919j978493J343994K009316l193360j587333K305564l70826K727279j92833
$$ 489258919 487280426 488624420 490633736 487440376 485853043 488158607 487787781 490515060 490322227
490.9D90322227n110931K462311K153053p51686J450729o89697l606834J9874J385498
$$ 490322227 485211296 487673607 489826660 489074974 490525703 489836006 486229172 486249046 487634544
499.6D87634544j888656k812462k005844j295738k853127k63443J322823m151955l924866
$$ 487634544 485745888 482933426 480927582 479631844 476778717 476515274 477838097 473686142 469761276
508.2D69761276K153778J104470m515229k717018k040367j073379n50881k971611j039810
$$ 469761276 471915054 473019524 468504295 465787277 463746910 462673531 462122650 459151039 458111229
516.9D58111229j623116k858848o87218P06673j539879k996140l353691j986808l50266
$$ 458111229 456488113 453629265 452942047 453648720 452108841 449112701 445759010 443772202 443421936
525.6D43421936p16934J659012o13785o90384j778183k098923K574311o63109l97034
$$ 443421936 442705002 444364014 443750229 443059845 441281662 439182739 441757050 441093941 440696907
534.3D40696907J200981L043633L470001L08418K748146M291764M144554N65452J82266
$$ 440696907 441897888 444941521 448411522 448719940 451468086 455759850 459904404 460469856 460652122
543D60652122K949944K950935K324830n97458k15874J05324P63511l7460k276077m92745
$$ 460652122 463602066 466553001 468877831 468280373 468064499 468169823 468933334 468895874 466619797 466127052
552.6D66127052r27772q75130k103920k322388j439247k363853m98772K48070j013146
$$ 466127052 465199280 464324150 462220230 459897842 458458595 456094742 455595970 455844040 454830894
561.3D54830894l635482k184029o39458k378730l034630m100762m076728m527359k586480
$$ 454830894 451195412 449011383 448371925 445993195 442958565 438857803 434781075 430253716 427667236
570D27667236k819671k199631l79982q48236j39504j696319L3226J457405K486954
$$ 427667236 424847565 422647934 422267952 421419716 421280212 419583893 419617119 421074524 423561478
578.6D23561478J399498R85794M238090K849655L249207L531761M148331L937874K740669
$$ 423561478 424960976 425946770 430184860 433034515 436283722 439815483 443963814 447901688 450642357
587.3D50642357K470817J437302J675453l3302q60176N70793J504746J494598k670
$$ 450642357 453113174 454550476 456225929 456192627 455332451 455903244 457407990 458902588 458899918
596D58899918K61955J165085J562805n10635j334687j1101n47218q45108p93800Q5602
$$ 458899918 459161873 460326958 461889763 461379128 460044441 460033340 459486122 458641014 457847214 457932816
605.6D57932816k74773m83627O22329N36728N99327J201630Q02460J18065J152229
$$ 457932816 457658043 457174416 457796745 458333473 458932800 460134430 460936890 461054955 462207184
614.3D62207184J175270O30531N77698K35405N5084J081391K472648J420517K003441
$$ 462207184 463382454 464012985 464590683 464826088 464881172 465962563 468435211 469855728 471859169
623D71859169K993965K901650L143844K217598P52258L33863R75227l54004K76070
$$ 471859169 474853134 477754784 480898628 483116226 483868484 484202347 485177574 484823570 485099640
631.7D85099640K188835J801643J447106J046638J104203P07817J50184j57242N85022
$$ 485099640 487288475 489090118 490537224 491583862 492688065 493395882 493546066 493388824 493973846
640.4D93973846R76105l87001j109352q40683R32274L91502K15073J837578J134300
$$ 493973846 494949951 494562950 493453598 492612915 493545189 493936691 494151764 495989342 497123642
649D97123642J358032M38004o9886O43273n6801m06761j96457N3749J946N26542P26738
$$ 497123642 498481674 498919678 498849792 499493065 499436264 499029503 498833046 498886795 498888741 499415283 500142021
659.7E00142021J802597K190666J465989J644249L73420l68194n10559l504334j2419052
$$ 500142021 501944618 504135284 505601273 507245522 507618942 507250748 506740189 503235855 490816803
668.3D90816803O223564P138748L193245J650582J231193J004181R12247R97390J866303
$$ 490816803 497040367 504179115 507372360 509022942 510254135 511258316 512170563 513167953 515034256
677E15034256Q20084j9455q10891K80076Q53347r51957L84140R07669J524925K668457
$$ 515034256 515854340 515834885 515023994 515304070 516157417 515205460 515589600 516497269 518022194 520690651
686.7E20690651J121292M40598O78634M77143q49686k015228j091423O8016m40407
$$ 520690651 521811943 522252541 522931175 523408318 522558632 520543404 519451981 519519997 519079590
695.3E19079590j207009l68270J60713J69182J50833q12111j396370j173363j390610
$$ 519079590 517872581 517504311 517665024 517834206 517985039 517172928 515776558 514603195 513212585
704E13212585k312660k341537j540451j473198j59493J807137J328697J460037K290535
$$ 513212585 510899925 508558388 507017937 505544739 505385246 507192383 508521080 509981117 512271652
712.7E12271652K310906K019615N44472M14009J433448J291047L29132J215095M005776
$$ 512271652 514582558 516602173 517146645 517560654 518994102 520285149 520614281 521829376 525835152
721.4E25835152M162979M026146M690475L861351L521233K394676N87540J763611J823883
$$ 525835152 529998131 534024277 538714752 542576103 546097336 548492012 549079552 550843163 552667046
730.1E52667046P92732P17392O75316J579513J778565J818657K495880L009262K447586
$$ 552667046 553459778 554177170 554852486 556431999 558210564 560029221 562525101 565534363 567981949
738.7E67981949J593132O15997j237907j474266j576309j734887p07550m40788r98268
$$ 567981949 569575081 570191078 568953171 567478905 565902596 564167709 563460159 563019371 562021103
747.4E62021103j55411J181870N50651o16302j551476k439995l165130l313294l588180
$$ 562021103 561865692 563047562 563598213 562981911 561430435 558990440 555825310 552512016 548923836
756.1E48923836l952561k455482n80292j52779o70280l55644K81601n25513p51724
$$ 548923836 544971275 542515793 541935501 541782722 541112442 540756798 541038399 540512886 539761162
764.8E39761162l50266o2980K85301N86891J195869J180916K307206L936233M489784
$$ 539761162 539410896 539347916 539633217 540220108 541415977 542596893 544904099 548840332 553330116
773.5E53330116N393639N579643N091133M696503L458061K324028K524681O85349M94041
$$ 553330116 558723755 564303398 569394531 574091034 577549095 579873123 582397804 583083153 583577194
782.1E83577194K705727L034897L637275L760987L640556L156967L009529L052636
$$ 583577194 586282921 589317818 592955093 596716080 600356636 603513603 606523132 609575768
789.9F09575768P64617j276435k42997J134034J96571N55839J241456K250671L606605
$$ 609575768 610340385 609063950 608820953 609954987 610151558 610707397 611948853 614199524 617806129
798.5F17806129L828583L901100J748276J398659J983032N73273r34372j439057n30548
$$ 617806129 621634712 625535812 627284088 628682747 630665779 631239052 630304680 628865623 628335075
807.2F28335075j76353P89452K226333K839546K253495K200546K016525m1122j584778
$$ 628335075 628158722 628948174 631174507 634014053 636267548 638468094 640484619 640443497 638858719
815.9F38858719j466370n96351k393074l036080j983604k99187J061096j54114O41175
$$ 638858719 637392349 636795998 634402924 631366844 629383240 629084053 630145149 629991035 630632210
824.6F30632210O48460l95164j430970k703971l713761m692268l035393k970238k803077
$$ 630632210 631280670 630885506 629454536 626750565 623036804 618344536 615309143 612338905 609535828
833.3F09535828j631508r35097J92795m75578m36097k46467j526261l040695k697754
$$ 609535828 607904320 606969223 607162018 606686440 606250343 606003876 604477615 601436920 598739166
841.9E98739166k506370l751068l054543k262993j546173j159248q60596J27068j31379
$$ 598739166 596232796 592481728 589427185 587164192 585618019 584458771 583598175 583725243 583593864
850.6E83593864l54919j155815k264481l236351l890075l473549l952103l493805j964340
$$ 583593864 583238945 582083130 579818649 576582298 572692223 569218674 565266571 561772766 559808426
859.3E59808426j473427J76849J800347K875099M094429M418030L841820L447837L347817
$$ 559808426 558334999 558511848 560312195 563187294 567281723 571699753 575541573 578989410 582337227
868E82337227L114853L139496L555030M864502O452942O256409N120964M996872M063492
$$ 582337227 585452080 588591576 592146606 597011108 603464050 609720459 614841423 619838295 623901787
876.7F23901787K433204P57905j16196q30422k409820l355026k492142m98963j406402
$$ 623901787 626334991 627092896 626976700 626146278 623736458 620381432 617889290 617390327 615983925
885.3F15983925j464157j50070o83823j542091j863366k081070l713111l809967l184243
$$ 615983925 614519768 614369698 613685875 612143784 610280418 608199348 604486237 600676270 597492027
894E97492027k681732k621345k574006j731491k153663p74918k19841j133995k400589
$$ 597492027 594810295 592188950 589614944 587883453 585729790 584954872 584735031 583601036 581200447
902.7E81200447m879646m719467l738480m155922n335159n022278m060631l494339
$$ 581200447 576320801 571601334 567862854 563706932 558371773 553349495 549288864 545794525
910.4E45794525l139000l751411l932381m638748n516968n781097o116448o049957
$$ 545794525 542655525 538904114 534971733 530332985 524816017 519034920 512918472 506868515
918.1E06868515n570221n621071m935989l160706j788254j127319o92940L02620N80826
$$ 506868515 501298294 495677223 490741234 487580528 485792274 484664955 483972015 484274635 484855461
926.8D84855461J99432l11012K56500M17557l68232K96592Q90351J517906K499695
$$ 484855461 485054893 484743881 485000381 485417938 485049706 485346298 486236649 487754555 490254250
935.5D90254250L460006L967018L307839K112045J911621K596665K577972K099648
$$ 490254250 493714256 497681274 500989113 503101158 505012779 507609444 510187416 512287064
943.2E12287064J640930J231117O14014K26021k77291n47714p21092k102127k508316
$$ 512287064 513927994 515159111 515773125 515999146 515721855 515174141 514453049 512350922 509842606
951.9E09842606l114815m852524n425606o397400o810684o581001o618538o772270
$$ 509842606 506727791 501875267 496449661 490052261 483241577 476660576 470042038 463269768
959.6D63269768p109108o777497p364006p304344p774505q124619q329506r606056
$$ 463269768 456160660 449383163 442019157 434714813 426940308 418815689 410486183 400880127
967.3D00880127r892082r919930q822975r782524r771767r129257r353332q762513
$$ 400880127 390988045 381068115 372245140 362462616 352690849 343561592 334208260 325445747
975C25445747r076500q441238r613438q090686q026486q826141o919537o854973n562477
$$ 325445747 316369247 307928009 298314571 290223885 282197399 273371258 266451721 259596748 254034271
983.7B54034271n552788m050388m207649l198261k058125k669163q37383j924038j065502
$$ 254034271 248481483 244431095 240223446 237025185 234967060 232297897 231460514 229536476 228470974
992.4B28470974j314793o46019o88953j116962N06515l39413R98402l63636R14726
$$ 228470974 227156181 226510162 225821209 224704247 225210762 224871349 225869751 225506115 226420841
1001.1B26420841J336594M01077J033287m83475N66731q34732J54705r4814k25888
$$ 226420841 227757435 228158512 229191799 228708324 229275055 228440323 228595028 228500214 228274326
1009.7B28274326K64435j863670q67424j801701j20544n0907N64231J101590K3880
$$ 228274326 228538761 226675091 225807667 224005966 223885422 223834515 224398746 225500336 225524216
1018.4B25524216J140022l45535J319561O40773R10111J268978Q22620K138615J637516
$$ 225524216 226664238 226318703 227638264 228279037 229189148 230458126 231280746 233419361 235056877
1027.1B35056877L273392J564064J622810J863213J998520J423225R00765K574749
$$ 235056877 238330269 239894333 241517143 243380356 245378876 246802101 247702866 250277615
1034.8B50277615q00896L99380M48265M07409M42238n76114R57050r07154O06193r19151
$$ 250277615 249476719 249876099 250324364 250731773 251174011 250597897 251554947 250647793 251253986 250334835
1044.5B50334835m3335M45938o15616J585427m85230J133957R83486K603588K902470
$$ 250334835 250291500 250737438 250121822 251707249 251222019 252355976 253339462 255943050 258845520
1053.1B58845520K145500L388386K547131M273700K449436L864441L878823L929672
$$ 258845520 260991020 264379406 266926537 271200237 273649673 277514114 281392937 285322609
1060.9B85322609M550266L647328N901527M212704N483665M404869L095398J960850
$$ 285322609 289872875 293520203 299421730 303634434 309118099 313522968 316618366 318579216
1068.6C18579216r30786k041836n097313m743194o810570n366078l956451m197788
$$ 318579216 317648430 315606594 310509281 305766087 298955517 293589439 289632988 285435200
1076.3B85435200j227131j564369P47547j93005Q74043J050682J329441L018780J544933
$$ 285435200 284208069 282643700 283391247 283198242 284072285 285122967 286452408 289471188 291016121
1085B91016121L138676J610622K831173L291473L556233M045086L362789M608402L029194
$$ 291016121 294154797 295765419 298596592 301888065 305444298 309489384 312852173 317460575 320489769
1093.6C20489769L633270J938019K065392J711692Q17795K024307l57475P48062k37846
$$ 320489769 324123039 326061058 328126450 329838142 330655937 332680244 332322769 333070831 332832985
1102.3C32832985m87022k70615r1934J364059M55361K072334J650047J580887P03583
$$ 332832985 332345963 332075348 331983414 333347473 333802834 335875168 337525215 339106102 339809685
1111C39809685J544380K429733J325073K640000J434669K091370J853867J582222R86557
$$ 339809685 341354065 343783798 345108871 347748871 349183540 351274910 353128777 354710999 355697556
1119.7C55697556R07821J931572l80249L59383K28462Q38928R36356Q05435K095718
$$ 355697556 356605377 358536949 358156700 358516083 358744545 359583473 360519829 361325264 363420982
1128.4C63420982J903992L116570J961517K731819J964493N17235N05447n37033L04146
$$ 363420982 365324974 368441544 370403061 373134880 375099373 375616608 376122055 375585022 375889168
1137C75889168j395455j786041k392349k497406k276268l020783k393074l697471k867699
$$ 375889168 374493713 372707672 370315323 367817917 365541649 362520866 360127792 356430321 353562622
1145.7C53562622l869438l397141k644577l263397k110939l059158j469078j363678
$$ 353562622 349693184 346296043 343651466 340388069 338277130 335217972 333748894 332385216
1153.4C32385216j70594q8806n14564R17358M75846J783676Q69522J519012J799774
$$ 332385216 332214622 332125816 331611252 332528610 333004456 334788132 335657654 337176666 338976440
1162.1C38976440K666092L306771K870598N416297N031739N924453O270371N991898
$$ 338976440 341642532 344949303 347819901 353236198 358267937 364192390 370462761 376454659
1169.8C76454659O077575O710358P476425O495132O872597O296883O937179O868515
$$ 376454659 382532234 389242592 396719017 403214149 410086746 416383629 423320808 430189323
1177.5D30189323O504784O764793O265755O523934O299552O558838N797921M953384
$$ 430189323 436694107 443458900 449724655 456248589 462548141 469106979 474904900 479858284
1185.3D79858284M106331L781395M190636L133697K597237K987747K721672J905250
$$ 479858284 483964615 487746010 491936646 495070343 497667580 500655327 503376999 505282249
1193E05282249K296296K147674J230240Q46558N34286N23110k13166m73251K2125M70429
$$ 505282249 507578545 509726219 510956459 511803017 512337303 512860413 512647247 512173996 512196121 512666550
1202.6E12666550N76133M63639R87205J331330K039871J909904J685143J781425J373253
$$ 512666550 513242683 513706322 514693527 516024857 518064728 519974632 521659775 523441200 524814453
1211.3E24814453J579628J347122J831703K401391K250785K210312J843949J695366
$$ 524814453 526394081 527741203 529572906 531974297 534225082 536435394 538279343 539974709
1219E39974709J756744J930427J707650L75595o78978n84030q22487j312065j218262
$$ 539974709 541731453 543661880 545369530 545745125 545066147 544482117 543659630 542347565 541129303
1227.7E41129303q39920j090584q23288r6016m34341o70662o91033q98590j303062
$$ 541129303 540289383 539198799 538375511 538279495 537845154 537174492 536483459 535584869 534281807
1236.4E34281807j812973j455841q95653r83238r60961m10156j5983J37062O62727
$$ 534281807 532468834 531012993 530117340 529134102 528173141 527762985 527747002 527884064 528546791
1245E28546791P99980Q24089Q27790L81736M05846J88980q9378L35464P53136O43883
$$ 528546791 529346771 530170860 530998650 531380386 531786232 531975212 531885834 532221298 532974434 533618317
1254.7E33618317M10270P28302J151505J071586O10238M10423R9258l32260j33095
$$ 533618317 534028587 534756889 535908394 536979980 537590218 538000641 538099899 537767639 537634544
1263.4E37634544K59972K01263J72959L60718P77702J213341J414413J585579J257019
$$ 537634544 537894516 538095779 538268738 538629456 539407158 540620499 542034912 543620491 544877510
1272E44877510J021843O52504l26309k62184m80843r57603k96479L2616m71115p7591
$$ 544877510 545899353 546551857 546225548 545963364 545482521 544524918 544228439 544261055 543789940 543712349
1281.7E43712349L18527K48032L02658j50032p6218o09588r50051n55420r38034j012382
$$ 543712349 544030876 544278908 544581566 544431534 544355316 543745728 542795677 542240257 541302223 540289841
1291.3E40289841r57794n09644o24695n24979k61154m08516j97334q48656j046905
$$ 540289841 539332047 538822403 538197708 537672729 537411575 537003059 536805725 535957069 534910164
1300E34910164j728172k225380j644898j225929n69573p44667r33342p38411o30302
$$ 534910164 533181992 530956612 529311714 528085785 527516212 526771545 525838203 525099792 524469490
1308.7E24469490o27670n83992n84831j175385j341591j173477q24165q33054j025085
$$ 524469490 523841820 523257828 522672997 521497612 520156021 518982544 518158379 517325325 516300240
1317.4E16300240j063881j131211k56996k9945l73078n21659j268235k003517k203407
$$ 516300240 515236359 514105148 513848152 513818207 513445129 512923470 511655235 509651718 507448311
1326E07448311k684326l079262k948647k849731k378616j997109k053642j634789r80453
$$ 507448311 504763985 501684723 498736076 495886345 493507729 491510620 489456978 487822189 486841736
1334.7D86841736j544571j819229j284104o98928m40636n26543m3793R3079K80342
$$ 486841736 485297165 483477936 482193832 481494904 481054268 480527725 480483932 480577011 480857353
1343.4D80857353K76871R76791R20716O66656R18274L46565L44925n5580l68500p56073
$$ 480857353 481134224 482111015 483031731 483698387 484616661 484963226 485308151 485252571 484884071 484127998
1353.1D84127998r54780q50640n52444L02544j25657P9537K80838l52860q57811o55593
$$ 484127998 483173218 482322578 481770134 482072678 481947021 482026558 482307396 481954536 481096725 480441132
1362.7D80441132j2055j81160l11966j439094j059571n20897j5869P67746m0512M46739
$$ 480441132 480429077 480247917 479935951 478496857 477437286 476916389 476900520 477668266 477627754 478074493
1372.3D78074493M44451Q33587Q68569K34833L06434l31535K34604j61934R4108M87404
$$ 478074493 478518944 479352531 480221100 480455933 480762367 480430832 480665436 480503502 480597610 481085014
1382D81085014P70951J546402J637687J911354R50318J823730K314224J908837J051597
$$ 481085014 481855965 483402367 485040054 486951408 487901726 489725456 492039680 493948517 495000114
1390.7D95000114N48745O05125o30341j513214j380577Q45261N31120o27441j577950
$$ 495000114 495548859 496153984 495523643 494010429 492629852 493475113 494006233 493378792 491800842
1399.3D91800842r18083L41415j442413j611938j024857k113762j725235j156997p58172
$$ 491800842 490882759 491224174 489781761 488169823 487144966 485031204 483305969 482148972 481390800
1408D81390800p37915k20298q80013p68967j15509r01680j063423j211624o16798o15578
$$ 481390800 480652885 480432587 479552574 478783607 478668098 477766418 476702995 475491371 474874573 474258995
1417.7D74258995j6327j612816j32065J518746K70767O39000r4032J240806J179810
$$ 474258995 474242668 472629852 472497787 474016533 474287300 474926300 474832268 476073074 477252884
1426.3D77252884p210R36241M7570L73458L48053Q70819J022950R10606J191940l99208
$$ 477252884 477245674 478181915 478229485 478602943 478950996 479821815 480844765 481755371 482947311 482548103
1436D82548103j82457K022667K754708J280479O29540P38906p2746L12653k95334P75184
$$ 482548103 482365646 484388313 487143021 488423500 489053040 489791946 489719200 490031853 489736519 490511703
1445.6D90511703l6849l73612p43065k61993P57599r73359l92837q26187K5711r82323
$$ 490511703 490474854 490101242 489358177 489096184 489853783 488880424 488487587 487661400 487687111 486704788
1455.3D86704788j719513j240577m436722L446312N58929K105599J242866Q28858K067642
$$ 486704788 484985275 483744698 479307976 482754288 483313217 485418816 486661682 487490540 489558182
1464D89558182L6354K929611J863327L197212K206002L151817L697853J283989M680633
$$ 489558182 489594536 492524147 494387474 497584686 499790688 502942505 506640358 507924347 512604980
1472.6E12604980L424416O555443L442840M831925N817909M051438M112968K084045
$$ 512604980 516029396 522584839 526027679 530859604 536677513 540728951 544841919 546925964
1480.3E46925964L372956K363510L081131K734184K594452L101883R32770L547744
$$ 546925964 550298920 552662430 555743561 558477745 561072197 564174080 565106850 568654594
1488.1E68654594K019921J547012K649536L844185L073197J097869J633034K90718
$$ 568654594 570674515 572221527 574871063 578715248 581788445 582886314 584519348 584810066
1495.8E84810066Q76427J659775J631660K106323J960831K032356O14777J421814Q92982
$$ 584810066 585686493 587346268 588977928 591084251 593045082 595077438 595692215 597114029 598007011
1504.5E98007011N42450o429252l600388O692658K163276K413864J545296J556931
$$ 598007011 598549461 592120209 588519821 595212479 597375755 599789619 601334915 602891846
1512.2F02891846L55034J323967J123046k51045l79143j469535L823242J902237k905541
$$ 602891846 603246880 604570847 605693893 605442848 605063705 603594170 607417412 609319649 606414108
1520.8F06414108k078209J168976L026428R78508Q72002O62651J125984O61469Q21838
$$ 606414108 604335899 605504875 608531303 609509811 610381813 611044464 612170448 612831917 613653755
1529.5F13653755J405144q74939p42683k119370j603737J744156Q20007Q17604J18523
$$ 613653755 615058899 614183960 613441277 611321907 609718170 611462326 612282333 613099937 613218460
1538.2F13218460k857971p059784M385300K646560q87642J170350p39213q79287M41246
$$ 613218460 610360489 603300705 607686005 610332565 609444923 610615273 609876060 608996773 609438019
1546.9F09438019l50647o79627j483802q83942M55666K63214p95327k780914m32053
$$ 609438019 609087372 608407745 606923943 606040001 606495667 606758881 605963554 603182640 602750587
1555.6F02750587J204987M37927q726387o882629M568405L982506J827087M54521k45018
$$ 602750587 603955574 604393501 595667114 588784485 593352890 597335396 599162483 599617004 599371986
1564.2E99371986j478576L22418M60701m7760l84445l184395Q17413M26750k46658
$$ 599371986 597893410 598215828 598676529 598628769 598244324 595059929 595877342 596304092 596057434
1572.9E96057434j50566j12305k22740k770271K121200J598397J92566k48642p44744
$$ 596057434 595906868 595794563 595571823 592801552 594922752 596521149 596713715 596465073 595720329
1581.6E95720329l80401n59044n74417p05452n38788n55916o84280k60735n48172J34621
$$ 595720329 595339928 594780884 594206467 593501015 592962227 592406311 591722031 591461296 590913124 591047745
1591.2E91047745l81546n84297q76046j606826o23513q13408o09283j361809j445427
$$ 591047745 590666199 590081902 589205856 587599030 586975517 586162109 585552826 584191017 582745590
1599.9E82745590r76791p71256n13153r34067m25567j092415j200943j424446j137886
$$ 582745590 581768799 580997543 580484390 579550323 579124756 578032341 576831398 575406952 574269066
1608.6E74269066j848221k135467n54352j474610j040916k028847j182899j386261
$$ 574269066 572420845 570285378 569731026 568256416 567215500 565186653 564003754 562617493
1616.3E62617493n650368J767158M5014r15909j692467r65385k270546l593903J008034
$$ 562617493 556967125 558734283 558779297 557863388 556170921 555205536 552934990 549341087 550349121
1625E50349121q02765j027908k006073r21173j69564m74815p12852j478348j01776
$$ 550349121 549546356 548518448 546512375 545591202 545421638 544946823 544233971 542755623 542653847
1633.7E42653847n97649l806229k083396R93270R86710P37495J027947r5367Q32939
$$ 542653847 542056198 538249969 536166573 537159843 538146553 538884048 539911995 539816628 540649567
1642.4E40649567r9373Q74901J046295n91431k03247j132774L452720K118531J980857
$$ 540649567 540550194 541425095 542471390 541879959 541676712 540543938 543996658 546115189 548096046
1651E48096046J283837m795761J963997M679718L827514K549057K498246J505889J837120
$$ 548096046 549379883 544584122 546548119 551227837 555055351 557604408 560102654 561608543 563445663
1659.7E63445663J304551J163482K200394J938553K831955K273178K403984J967583
$$ 563445663 564750214 565913696 568114090 570052643 572884598 575157776 577561760 579529343
1667.4E79529343J568756R38644L342552L828774J262131K967300K990990J850280
$$ 579529343 581098099 582036743 585379295 589208069 590470200 593437500 596428490 598278770
1675.1E98278770J795998K878151K830467K128754K269554K285004L443031K250671
$$ 598278770 600074768 602952919 605783386 607912140 610181694 612466698 615909729 618160400
1682.9F18160400j466446R12323N672150M746819K564354J342849K141762K011795
$$ 618160400 616693954 617606277 623278427 628025246 630589600 631932449 634074211 636086006
1690.6F36086006K417793K783890J885452J751633K86865k279892M451218L594284
$$ 636086006 638503799 641287689 643173141 644924774 645211639 642931747 647382965 650977249
1698.3F50977249L513947n86472l017502M714127L058014R42001k60010J564179J111832
$$ 650977249 654491196 653904724 650887222 655601349 658659363 659601364 659341354 660905533 662017365
1707F62017365J631851J566543Q46024J163711J234894R75495Q6364j249923k49863
$$ 662017365 663649216 665215759 666061783 667225494 668460388 669435883 669522247 668272324 668022461
1715.6F68022461K251892L26004k611160L426819K520675J192551L76511N23757L74604
$$ 668022461 670274353 670600357 667989197 671416016 673936691 675129242 675505753 676029510 676404114
1724.3F76404114Q02612P89108J94550M68979K75726k76108P67975K551193J817475
$$ 676404114 677206726 677995834 678190384 678659363 678935089 678658981 679426956 681978149 683795624
1733F83795624l346329n23148M096985L047638Q85315R62296j044998j197205L191910
$$ 683795624 680449295 679926147 684023132 687070770 687956085 688918381 687873383 686676178 689868088
1741.7F89868088J604385j70746O71768J980134J797637J301423Q70361N76248L156204
$$ 689868088 691472473 691301727 691973495 693953629 695751266 697052689 697923050 698499298 701655502
1750.4G01655502M29993J0376K940674J889953J375885J338120O70776J453171K383576
$$ 701655502 702085495 702095871 705036545 706926498 708302383 709640503 710311279 711764450 714148026
1759G14148026J915435J862488q25958K441K449646Q30612P36618Q26264N36652p13044
$$ 714148026 716063461 717925949 717099991 717102432 719552078 720382690 721119308 721945572 722482224 721769180
1768.7G21769180J320267K303619j56402r61304M41361L010406J220932j28708J242295
$$ 721769180 723089447 725393066 725236664 724275360 724716721 727727127 728948059 728819351 730061646
1777.4G30061646j82801M3564n88608K93045J545258J235809J012116k0905R95712
$$ 730061646 729878845 729922409 729333801 729626846 731172104 732407913 733420029 733399124 734394836
1786G34394836J316224N47638o84433k73972p46918p69729n48859j04599K189407R05381
$$ 734394836 735711060 736258698 735574265 735300293 734553375 733783646 733234787 733130188 735319595 736224976
1795.7G36224976R90142J500702R29184j09482j289978J225586L03879M12903N18799
$$ 736224976 737215118 738715820 739645004 739535522 738245544 739471130 739775009 740187912 740706711
1804.4G40706711l75061L00445L29056L85971M68369J165542k975P64313R99374j21231
$$ 740706711 740331650 740632095 740961151 741347122 741815491 742981033 742978058 743742371 744741745 744620514
1814G44620514K64206p31812j61667l79715L84751P57522L6469R09119Q1710J015702
$$ 744620514 744884720 744152908 743991241 743611526 743996277 744753799 744790268 745699387 745781097 746796799
1823.7G46796799P16247j387787K99454R19266L78723j254578j667022P15942J090851
$$ 746796799 747513046 746125259 746424713 747343979 747722702 746468124 744801102 745517044 746607895
1832.3G46607895J99509Q40148J090851J52130j08566J80054R13544m54941k07138
$$ 746607895 746807404 747647552 748738403 748890533 748781967 748962021 749875565 749420624 749213486
1841G49213486l42636m96903p11975k900238K270126K099381R66263L99322L99323
$$ 749213486 748870850 748373947 747661972 744761734 747031860 749131241 750097504 750496826 750896149
1849.7G50896149O02417j67694L01971n73654l44010k61001p02286j91955j47553P30743
$$ 750896149 751498566 751330872 751632843 751059189 750715179 750454178 749751892 749559937 749412384 750143127
1859.3G50143127P25785R10949K76032K37198P0801n40543q163p38297k98386j540145
$$ 750143127 750868912 751779861 752055893 752293091 752363892 751823349 751815186 751076889 750778503 749238358
1869G49238358n36118J537247J028900R99832N77393O80008J20162J55106q5220m10385
$$ 749238358 748702240 750239487 751268387 752268219 752845612 753525620 753645782 753800888 753715668 753305283
1878.6G53305283k98005o01043K9678k09045J95846K5635K86560J092377Q41675Q25805
$$ 753305283 753007278 752406235 752435913 752226868 752422714 752448349 752734909 753827286 754668961 755494766
1888.3G55494766l68576n48935J17111K35901k36053n25208n73959m39224R22088K35215
$$ 755494766 755126190 754577255 754694366 754930267 754694214 754169006 753595047 753155823 754077911 754313126
1897.9G54313126M07104P75528L73459M59366J07345l9444j020126l36380l7613o57501
$$ 754313126 754720230 755495758 755869217 756328583 756435928 756396484 755376358 755039978 755002365 754344864
1907.6G54344864m42124n8364K77786L72009J355362M96292N11933J98516n82046N26504
$$ 754344864 753902740 753844376 754122162 754494171 755849533 756345825 756857758 757056274 756474228 757000732
1917.2G57000732j763076j198960L76969R9640K2430o24390N03540J207734J063232
$$ 757000732 755237656 754038696 754415665 754515305 754537735 753913345 754416885 755624619 756687851
1925.9G56687851L95279K68097q1558q3466l47748j011886n35736m55857L49884J61209
$$ 756687851 757083130 757351227 757269669 757186203 756838455 755826569 755290833 754834976 755184860 755346069
1935.5G55346069K88010N63354K65656R24454M22821L87115j107712j867446J16348
$$ 755346069 755634079 756197433 756463089 757387543 757810364 758197479 757089767 755222321 755338669
1944.2G55338669j96610l75671j1063P52487P54929P67975P18918O27365O5842n92423
$$ 755338669 755142059 754766388 754755325 755507812 756262741 757030716 757749634 758376999 758442841 757850418
1953.8G57850418k54593p90787l38516k99454j44195K84729r2697O53839O32706O54296
$$ 757850418 757595825 756805038 756466522 756167068 756022873 756307602 756214905 756868744 757501450 758155746
1963.5G58155746K67640k2736k25449m85382J41144k88544k77481n13763k12708J24741
$$ 758155746 758423386 758400650 758175201 757689819 757830963 757542419 757264938 756751175 756538467 756663208
1973.1G56663208K31171J065673O17981J450Q7357O04553k22244o90613m03824n32913
$$ 756663208 756894379 757960052 758578033 758579483 758666840 759271393 759049149 758358536 757954712 757421799
1982.8G57421799j36338l78723o9198J39465N28107L63998R6436Q71124o9809n26657
$$ 757421799 757285461 756906738 756837540 756977005 757505112 757869110 757965546 758836670 758766861 758240204
1992.4G58240204o1798J51367l89099r23081m74166j63346N79071M65927M33731N17884
$$ 758240204 758178406 758329773 757940674 757017593 756543427 756380081 756959152 757425079 757858810 758376694
2002.1G58376694M70504J45875l54386j55334o24771m89808p20520n98449K5863k2964
$$ 758376694 758847198 758993073 758638687 758483353 757858582 757368774 756648254 756049805 756075668 756052704
2011.7G56052704K13470J97373O62155L45993l99170q07877j7852K46582p38907l68881
$$ 756052704 756266174 756463547 757125702 757471695 757072525 756264648 756246796 756493378 755754471 755385590
2021.3G55385590q25501o36749J49307L18451N33218K26822K55356M7379P3318l21731
$$ 755385590 754560089 753923340 754072647 754391098 754924316 755151138 755406494 755453873 755527191 755205460
2031G55205460m25644r04007j123200j45416m78745j16653J06278K49176M90112K96936
$$ 755205460 754779816 753875809 752752609 752607193 752128448 752011795 752118073 752367249 752857361 753154297
2040.6G53154297L10364m5319R8114o46210n23300n02090p36924j83715l68347J73721
$$ 753154297 753464661 753419342 753517456 752871246 752347946 751845856 751108932 750925217 750556870 750730591
2050.3G50730591L5019K94800O12335M71267L69492l82156k24686l89404l97950n61294
$$ 750730591 750765610 751060410 751672745 752144012 752513504 752131348 751906662 751517258 751119308 750558014
2059.9G50558014l49503l5858j72424N34134L15552M20990O24237N05447K18811j23215
$$ 750558014 750208511 750172653 750000229 750534363 750849915 751270905 751895142 752400589 752619400 752496185
2069.6G52496185j14288n19562m58679p58133n30395j21537M34800J158599M95835
$$ 752496185 752381897 751862335 751403656 750645523 750115128 749993591 750428391 751586990 752082825
2078.2G52082825J27334L81470N27115k93732m07562p15561j313858j97754J42212
$$ 752082825 752210159 752591629 753118744 752825012 752417450 751701889 750388031 750190277 750332489
2086.9G50332489K04468J25809K73666O85272Q01849N64118p8812J43433m07639m35257
$$ 750332489 750536957 750662766 750936432 751621704 752423553 752987671 752908859 753052292 752644653 752209396
2096.6G52209396m54559o56128m3335j91345J93863L90472L85819N53283Q82874O09436
$$ 752209396 751754837 751098709 751055374 750864029 751057892 751448364 751834183 752387466 753270340 753879776
2106.2G53879776j27869q0948n17807o58264o84738j32675J62811R003K30255K74277
$$ 753879776 753751907 753670959 753153152 752494888 751810150 751677475 751840286 751849289 752079544 752353821
2115.9G52353821J045990O35147K63519J65177l17765m84237p83692l51944n52521
$$ 752353821 753399811 754034958 754298477 754463654 754145889 753661652 752877960 752526016 751973495
2124.5G51973495k64205M1351K8000O11725Q19473R74579N14450R6435l96652m41589
$$ 751973495 751709290 751750641 751778641 752390366 753209839 754184418 754698868 754795303 754398651 753957062
2134.2G53957062m12827o75506o47965l68347L31345J51290O94199O17447K51617O00281
$$ 753957062 753544235 752868729 752220764 751852417 752183762 752335052 753029251 753646698 753898315 754498596
2143.8G54498596P1869m6005n86701l96576l83224l87421j35421m23584L06472L37601
$$ 754498596 754570465 754524460 753937759 753541183 753157959 752770538 752635117 752211533 752518005 752855606
2153.5G52855606P88040P51038L97339M19464k31476k89764o92368n56869n00031j25046
$$ 752855606 753643646 754394684 754792023 755211487 754980011 754690247 753997879 753441010 752940979 752815933
2163.1G52815933K09122J79748P12357N38864Q59528P69653O52008K03781n10635m92172
$$ 752815933 753025055 753204803 753917160 754456024 755315552 756085205 756737213 756940994 756430359 755938187
2172.8G55938187n63965j62049l34854J0987L50036Q00247Q63495K14386O34156L01284
$$ 755938187 755374222 755212173 754877319 754888306 755238342 756038589 756902084 757116470 757750626 758051910
2182.4G58051910L99018r079m27017k77024o49795j47553r079L24860M20151N74569
$$ 758051910 758450928 758441849 758014832 757737808 757088013 756940460 756931381 757256241 757676392 758250961
2192G58250961N20554N40924J018066L01819o7673n41076j74332r1171o28510l20892
$$ 758250961 758771515 759312439 760330505 760632324 760564651 760023575 759849243 759758072 759129562 758808670
2201.7G58808670k65045L49731N91050Q82797P84683L96042J86157K23160L35922p96509
$$ 758808670 758543625 758893356 759484406 760367203 761151886 761547928 761734085 761957245 762293167 761496658
2211.3G61496658m72412R842j36719k26898j94855M34571P68738J073684K97623R7198
$$ 761496658 761024246 761034088 760897369 760670471 760475616 760910187 761678925 762752609 763050232 763147430
2221G63147430P7134K56042q850j124420k49176k56882j67618j36108J76163J093521
$$ 763147430 763224564 763480606 763471756 762347336 762098160 761841278 761673660 761537552 761713715 762807236
2230.6G62807236L72619P50504O19736J93786p0572n65567n58242o82831l89633k87171
$$ 762807236 763179855 763930359 764550095 764743881 764673309 764107742 763549500 762866669 762477036 762189865
2240.3G62189865N3482K7161P08923J073609N31539M81873j53503k3804j10550j25656
$$ 762189865 762243347 762270508 762979431 764053040 764584579 765066452 764912949 764889145 764778595 764652939
2249.9G64652939l57056q92410o67801k57950L91159K60773P45850O47201M50668K95182
$$ 764652939 764295883 763403473 762735672 762477722 762868881 763129654 763875504 764522705 764973373 765268555
2259.5G65268555m13285M1581m43192m99802n94101q10852m10766K34909R17206K87323
$$ 765268555 764855270 764896851 764453659 763953857 763359756 762548904 762138138 762373047 763290253 763577576
2269.2G63577576P54623J064301M63485k88620m86908j85852o75964n56717o14777
$$ 763577576 764332199 765396500 765859985 765571365 765084457 764898605 764222641 763665924 763051147
2277.9G63051147k5482K18811M73404P66297M68826R90524L62320L33176k20719j208419
$$ 763051147 763025665 763244476 763717880 764484177 764953003 765943527 766305847 766639023 766418304 765209885
2287.5G65209885q62427q59375r60465j091919m7912L42865O93817N44052M00009N02167
$$ 765209885 764347458 763488083 762527618 761435699 761387787 761730652 762424469 762968521 763368530 763870697
2297.2G63870697m15802k52991j679382j319199l15551q87452m90417p86743K20794
$$ 763870697 763454895 763201904 761522522 760203323 759887772 759000320 758509903 757723160 757943954
2305.8G57943954L6698K94800K39944p32727m93927q22983j11847j471634j392059
$$ 757943954 757980652 758275452 758515396 757782669 757288742 756465759 756353912 754882278 753490219
2314.5G53490219p59582q41294m35333j670990o2561j25198n45807k81525n94101l35617
$$ 753490219 752730637 751889343 751454010 749783020 749720459 749595261 749049454 748767929 748173828 747838211
2324.2G47838211p73086j292038k509385l90701o29654j157837k05002N88150J753083
$$ 747838211 747065125 745773087 743263702 742873001 742243347 741085510 740880508 741468658 743221741
2332.8G43221741j40000O85120j700592j817703M51736p83386j243210k286529P89108
$$ 743221741 743081741 743766861 742066269 740248566 740700302 739916916 738673706 736387177 737176285
2341.5G37176285L9978m47464N48324J042099L682404L500366L672714M29459l025284
$$ 737176285 737216263 736768799 737317123 738359222 742041626 745541992 749214706 749644165 746618881
2350.2G46618881l561554l946228l211212j527786k073059k583313P25021k89535p87125
$$ 746618881 743057327 739111099 735899887 734372101 732299042 729715729 730440750 730151215 729364090
2358.9G29364090J5335j229935Q98667l06092J37864j55564n035J536026J207809J928482
$$ 729364090 729379425 728149490 729048157 728742065 728879929 728724365 728719330 730255356 731463165 733391647
2368.5G33391647J771851K292023K210617L015670K412873J114731P83157j1978P15484
$$ 733391647 735163498 737455521 739666138 742681808 745094681 746209412 746992569 746980591 747696075
2377.2G47696075Q41370P46231R59702J442566J442031J463089J957856J154174O66886
$$ 747696075 748537445 749283676 750243378 751685944 753127975 754591064 756548920 757703094 758369980
2385.9G58369980p6l18985j66169p43713q19168n17578l25546j52817M07943K76871
$$ 758369980 758369904 758050919 757884750 757141037 756321869 755804291 755478745 755325928 755733871 756010742
2395.5G56010742L25394P07016O55594L33175p95593q25882n51300p28531j095581
$$ 756010742 756336136 757043152 757698746 758031921 757236328 756410446 755859146 755130615 754035034
2404.2G54035034q68072j0147J71127O25915L89557N03617O45370j17416m97818n99365
$$ 754035034 753166962 753156815 753327942 753953857 754343414 754847031 755492401 755374985 754877167 754277802
2413.8G54277802o59028j292419j030045o10046k06146K81219M22669N63431k68250
$$ 754277802 753618774 752326355 751296310 750686264 750480118 750761337 751184006 751747437 751479187
2422.5G51479187k81982k32239l05100m45404m98962l60184j348724o59180P2937m3030
$$ 751479187 751197205 750964966 750659866 750214462 749715500 749355316 748006592 747347412 747420349 747377319
2432.2G47377319r0103q2626N72738L49808R995l46222k18659o42624j304016p42569
$$ 747377319 747287216 747204590 747777328 748127136 748137131 747790909 747572250 746929626 745625610 744883041
2441.8G44883041n83877o05240n05981J10626P5226K33612M01382j49918p5378o33392
$$ 744883041 744299164 743693924 743187943 743298569 743373795 743607407 744008789 743858871 743783493 743150101
2451.5G43150101o57425j026383j005325k79617m38996j72577k62527J55334K03248
$$ 743150101 742492676 741466293 740460968 740181351 739742355 739569778 739307251 739462585 739665833
2460.1G39665833m9744K34146K28958k17972j154480q40301q27027r31930m66232p8354
$$ 739665833 739616089 739850235 740079193 739861221 738706741 737866440 737039413 736107483 735641251 735562897
2469.8G35562897K39944J06888O29120M25644N7220k67563q15506o76727q17108p49664
$$ 735562897 735802841 735909729 736538849 736964493 737021713 736754150 735938644 735261917 734444809 733695145
2479.4G33695145o94733n19867k71072l3341J30234J72577M19617J74636k03094o22788
$$ 733695145 733000412 732480545 732209473 732176132 732306366 732478943 732898560 733073196 732870102 732247314
2489.1G32247314l61785l55835q65632p37304o79169l09677q5449m0970L90091P30438
$$ 732247314 731885529 731529694 730664062 729926758 729247589 728937912 728852463 728811493 729201584 729932022
2498.7G29932022Q3542m11835j69525m54788n83649p52182n07126l36151l20282Q2932
$$ 729932022 730015564 729603729 729434204 728979416 728395767 727643585 727136459 726800308 726480026 726562958
2508.3G26562958J03454K30484R1858J84403J7471j68610m99267q98514l64532n73807
$$ 726562958 726666412 726896896 726988754 727173157 727190628 727022018 726522751 725624237 725259705 724685898
2518G24685898m07944m27627m36326J99891J99966J12228n0354L67890K1667m18319
$$ 724685898 724277954 723850327 723414001 723613892 723813858 723926086 723875732 724243622 724265289 723846970
2527.6G23846970q80509j283111n61829m77219j07574j69602K20414M98275k76870
$$ 723846970 722966461 721683350 721121521 720644302 720536728 720367126 720587540 721085815 720808945
2536.3G20808945k18659m47998q4152k35901p72476p18536p08390m41818n30853k68708
$$ 720808945 720590286 720142288 720058136 719822235 719049759 718331223 717622833 717181015 716650162 716381454
2546G16381454j51672J43967J34582k47039k81830k74201L281p33948q35800l29514
$$ 716381454 716229782 716373749 716508331 716261292 715979462 715705261 715708542 714974594 714138794 713809280
2555.6G13809280n11016o42930m47464o0119l4180K44980l7994l43476m88891m67530
$$ 713809280 713298264 712655334 712207870 712147751 712113571 712358551 712320557 711977081 711488190 711020660
2565.2G11020660l01742p74002k23694k04086q25425o97631q4916K55051n0278P4540
$$ 711020660 710718918 709944916 709721222 709517136 708691711 707994080 707909164 708164215 708113937 708188477
2574.9G08188477k68479l47519k97775n48019o03562o16150k61001l73307m69360n95703
$$ 708188477 707919998 707572479 707274704 706726685 706123123 705506973 705245972 704872665 704403305 703807602
2584.5G03807602l4027N93262J94549r8877n61218n74722l21503L0212k61688r16519
$$ 703807602 703773575 704366837 704561386 704462509 703901291 703326569 703005066 703035278 702773590 701857071
2594.2G01857071p20749l17154o6605m88739j95465L02582K75269p5074n37109j97296
$$ 701857071 701136322 700819168 700752563 700263824 700068359 700370941 700646210 700571136 700034027 699836731
2603.8F99836731l45001m87519o75277o15998k06298j77460k18430n30700j59989k9754
$$ 699836731 699491730 699004211 698328934 697712936 697506638 697329178 697110748 696580048 696420059 696390305
2613.5F96390305M2572j78833p53937o93588q24051l48893k82135m64248m95987n09110
$$ 696390305 696432877 696254044 695500107 694806519 693982468 693633575 693351440 692887192 692391205 691882095
2623.1F91882095k89077n58777n31922n53589n188k6474r34371q15812l43170l64151
$$ 691882095 691593018 691034241 690502319 689948730 689943542 689917068 688982697 688166885 687823715 687459564
2632.8F87459564r10797p76215q03833n06820J91269j87302n42602n14222l47137r72824
$$ 687459564 686548767 685772552 684968719 684461899 684653168 684465866 683923264 683409042 683061905 682089081
2642.4F82089081r70078n74112p63244m61350p32574o16837j6937j25198q25425n52063
$$ 682089081 681119003 680544891 679781647 679320297 678587723 677970886 677953949 677828751 677003326 676451263
2652F76451263K12326l79028q18100r09729o91910p16400o35910k69165o18896m52423
$$ 676451263 676663589 676284561 675466461 674556732 673864822 673148422 672512512 672243347 671624451 671172028
2661.7F71172028l29056j95923k46048o80084p59354n67169j45798l61404m62723n26352
$$ 671172028 670842972 670647049 670401001 669720917 668961563 668394394 668248596 667887192 667424469 666898117
2671.3F66898117m23202j76163q18787q06427j52130j26572m17556l17002k86941n85327
$$ 666898117 666474915 666298752 665479965 664673538 664521408 664394836 663977280 663660278 663373337 662788010
2681F62788010q31528r11331o27747k69317m8523L1967K0828m08249n53284n81588
$$ 662788010 661956482 661045151 660417404 660148087 660099564 660131531 660152359 659744110 659190826 658609238
2690.6F58609238p38831k95334l68118m93546m82254q16726j104737o65588O8893m2877
$$ 658609238 657870407 657575073 657206955 656713409 656231155 655414429 654309692 653644104 653712997 653670120
2700.3F53670120k08130o36139n40542o95801p92847J92414m00925p59888n27191n19638
$$ 653670120 653461990 652825851 652285309 651589508 650796661 650989075 650588150 649828262 649301071 648781433
2709.9F48781433n53360j013489n85327l24859k98691l46527m00009m80195o70318
$$ 648781433 648228073 647214584 646629257 646304398 646005707 645659180 645259171 644778976 644108658
2718.6F44108658l97721l41873j71051m34570n10254l97339n66177k92893o56204o49566
$$ 644108658 643710937 643369064 643198013 642763443 642253189 641855850 641289673 640996780 640340576 639691010
2728.2F39691010j41411l46833m51126k02675n42717m28771J16806k47193k05383o68678
$$ 639691010 639549599 639202766 638751640 638548965 638006248 637577477 637694283 637447090 637241707 636573029
2737.9F36573029j004563j32637J00365k56500n70145n13649k97432K04239k5902m70009
$$ 636573029 635568466 635435829 635536194 635279694 634709549 634195900 633898468 634102707 634076805 633606796
2747.5F33606796k70004n12161n04113o35108m93660l90435n58090k47764k44828k27585
$$ 633606796 633336792 632824631 632320518 631685410 631191750 630801315 630243225 629995461 629750633 629523048
2757.2F29523048l40957j48850k97279m94576k0332l12233m67300k15912j97716m87709
$$ 629523048 629182091 629033241 628735962 628241386 628221054 627908821 627441521 627225609 627027893 626540184
2766.8F26540184m62570m44069n63278J06849K49787k17171n54199m56162m59022p76749
$$ 626540184 626077614 625633545 625070267 625177116 625426903 625209732 624655533 624199371 623740349 622963600
2776.4F22963600o56738n39208l53431m05083n06477l14827k33918m15153n73731m48608
$$ 622963600 622306862 621767654 621414223 621009140 620502663 620187836 619953918 619538765 618965034 618516426
2786.1F18516426m05121l11546n82848q36715p04995n97305o54640p70607p17087r18159
$$ 618516426 618111305 617799759 617216911 616380196 615675201 615077896 614423256 613652649 612935562 612017403
2795.7F12017403m46778Q278m16336o84700p23953q60062j349106j349487q95042l91846
$$ 612017403 611570625 611578903 611162567 610477867 609753914 608893852 607544746 606195259 605300217 604908371
2805.4F04908371m90646q81806m70505k93006o58913j138649r42803j047706j331215
$$ 604908371 604417725 603535919 603065414 602772408 602113495 600974846 600032043 598984337 597653122
2814E97653122q58231r45587p95708o81915q59680q99506r96399j092643j188889j006584
$$ 597653122 596794891 595849304 595053596 594371681 593512001 592612495 591616096 590523453 589334564 588327980
2823.7E88327980j179695r03816r49898j511269j183242j006241j115303j206055j170197
$$ 588327980 587148285 586244469 585294571 583783302 582600060 581593819 580478516 579272461 578102264
2832.4E78102264j269569j097794r06257r44329r39254j629906j627502j329461j685791
$$ 578102264 576832695 575734901 574828644 573884315 572945061 571315155 569687653 568358192 566672401
2841.1E66672401j991958k017555j916771j616936j236534j673050j870995k313156
$$ 566672401 564680443 562662888 560746117 559129181 557892647 556219597 554348602 552035446
2848.8E52035446k499695j913070j665459j222839j516724j011581m30680q27217o14281
$$ 552035446 549535751 547622681 545957222 544734383 543217659 542206078 541775398 540948181 540333900
2857.4E40333900p03659q72306j058464q58269j099892j324425j178436j818619j769561
$$ 540333900 539630241 538757935 537699471 536841202 535741310 534416885 533238449 531419830 529650269
2866.1E29650269k057534k012634j375618j693001k024421k083741j861152j842804
$$ 529650269 527592735 525580101 524204483 522511482 520487061 518403320 516542168 514699364
2873.8E14699364j830025k124519k455178k371978k260323j741600j519814j491394
$$ 514699364 512869339 510744820 508289642 505917664 503657341 501915741 500395927 498904533
2881.6D98904533j480064j419144j352195j176300p32804p55729q51288j112023j067466
$$ 498904533 497424469 496005325 494653130 493476830 492744026 491988297 491137009 490024986 488957520
2890.2D88957520o85997l26348j90544m79660k35291j69258j10931k38953n45768m31023
$$ 488957520 488271523 487945175 487754631 487274971 487039680 486870422 486759491 486520538 485974770 485543747
2899.9D85543747p61032q97560o69518l59115p78199j028099l83720o19850j175881
$$ 485543747 484782715 483885155 483215637 482856522 482078323 481050224 480666504 480046654 478870773
2908.6D78870773j305046p68776m28199j109467j833916j894455j699447j814690j746292
$$ 478870773 477565727 476796951 476368752 475259285 473425369 471530914 469831467 468016777 466270485
2917.2D66270485j927681k022133j548691j390686j562996j341629j241531j315003
$$ 466270485 464342804 462320671 460771980 459381294 457818298 456476669 455235138 453920135
2925D53920135n09338q16002r88998n5390k74543j34087L21770M41971M04090Q70591
$$ 453920135 453410797 452594795 451605797 451550407 451275864 451141777 451463547 451905518 452309608 453180199
2934.6D53180199J614647J856689K146874J655693J728096K361755K598953K621041
$$ 453180199 454794846 456651535 458798409 460454102 462182198 464543953 467142906 469763947
2942.3D69763947K092971J878205K121925K961235K985001K180824K023506K266388
$$ 469763947 471856918 473735123 475857048 478818283 481803284 483984108 486007614 488274002
2950D88274002K621422K644882K599487K134819J843911K119522K217598K099800J945305
$$ 488274002 490895424 493540306 496139793 498274612 500118523 502238045 504455643 506555443 508500748
2958.7E08500748J924286J878891K168579K299423J988640J475334J584206J589088
$$ 508500748 510425034 512303925 514472504 516771927 518760567 520235901 521820107 523409195
2966.4E23409195P94411J221084J724053J416359J175689J470185J837654J588440
$$ 523409195 524203606 525424690 527148743 528565102 529740791 531210976 533048630 534637070
2974.1E34637070J247749J222992J884003J641349J296387J425514J094017J077652
$$ 534637070 535884819 537107811 538991814 540633163 541929550 543355064 544449081 545526733
2981.8E45526733Q71392J285209J485443J234742J194534R86481J042938Q55102R82285
$$ 545526733 546398125 547683334 549168777 550403519 551598053 552584534 553627472 554482574 555464859
2990.5E55464859P57713N00527N74875M97779O77910L51334N00679P41615K91405K38342
$$ 555464859 556222572 556723099 557297974 557795753 558473663 558824997 559325676 560067291 560358696 560597038
3000.2E60597038M44603K9602j11427o4507o81076k92244j1749p4005J02272k2087
$$ 560597038 561041641 561071243 560959816 560895309 560214233 559921989 559910240 559836235 559938507 559916420
3009.8E59916420r6397o12488m95949l10974n37262p37610q61969q47359j138687o95877
$$ 559916420 559820023 559207535 558711586 558400612 557863350 557125740 556263771 555416412 554277725 553581848
3019.5E53581848l88908p48558j200066j058617m82444m61464m43230q59222j056824
$$ 553581848 553192940 552444382 551244316 550185699 549703255 549241791 548798561 547939339 546882515
3028.1E46882515r92470j062927j081047j392098j354827q95005m04777q74367j246224
$$ 546882515 545890045 544827118 543746071 542353973 540999146 540104141 539699364 538824997 537578773
3036.8E37578773q67156o16875p24449j087571r45129r22165j112480j677246j752510
$$ 537578773 536711617 536094742 535370293 534282722 533337593 532415428 531302948 529625702 527873192
3045.5E27873192j044350n82657o17599j289215p31240n83953j195374j493072j699906
$$ 527873192 526828842 526246185 525628586 524339371 523608131 523024178 521828804 520335732 518635826
3054.2E18635826q76808j072350j314582j412125j437340o77337q96454p39594r45396
$$ 518635826 517759018 516686668 515372086 513959961 512522621 511845284 510948830 510209236 509263840
3062.9E09263840j387940j055679p43141n79605j219445j567535j243706j127815j333733
$$ 509263840 507875900 506820221 506077080 505497475 504278030 502710495 501466789 500338974 499005241
3071.5D99005241r28840o66733r26399q78334j187859j375923j365624q09211p64389
$$ 499005241 498076401 497409668 496483269 495604935 494417076 493041153 491675529 490866318 490101929
3080.2D90101929j364518j321372j221657q05741j146049j072312p15065j228485j087265
$$ 490101929 488737411 487416039 486194382 485388641 484242592 483170280 482455215 481226730 480139465
3088.9D80139465j150131r30939j090927j645813r84344o56548j034736j304932j120873
$$ 480139465 478989334 478058395 476967468 475321655 474337311 473680763 472646027 471341095 470220222
3097.6D70220222q93020q79097q12454r83277j205597j015510j079025j233140j095352
$$ 470220222 469327202 468448105 467635651 466652374 465446777 464431267 463352242 462119102 461023750
3106.2D61023750j257438j047478r97772j241188j264992j208267j015740j047020
$$ 461023750 459766312 458718834 457721062 456479874 455214882 454006615 452990875 451943855
3114D51943855l27720n59082j524048j048508j338730j688537j031647p95479j105118
$$ 451943855 451616135 451057053 449533005 448484497 447145767 445457230 444425583 443630104 442524986
3122.6D42524986j263847r35364n15709j008262j709366p51076k80495j134185j377411
$$ 442524986 441261139 440325775 439810066 438801804 437092438 436341362 436060867 434926682 433549271
3131.3D33549271j149674j217613r48715p18460j380501j200600r16748j008835p68203
$$ 433549271 432399597 431181984 430233269 429514809 428134308 426933708 426016960 425008125 424239922
3140D24239922j213875j451340j155128o03905q02994j309700j137505j046371p47643
$$ 424239922 423026047 421574707 420419579 419815674 419012680 417702980 416565475 415519104 414771461
3148.7D14771461p38067p21588q45986j222801j405144j504211r84726p01256o70471
$$ 414771461 414033394 413311806 412465820 411243019 409837875 408333664 407348938 406647682 405977211
3157.4D05977211q91190r56764p26394j084404j210938j046410p99980q40683q15620
$$ 405977211 405086021 404129257 403402863 402318459 401107521 400061111 399261131 398420448 397604828
3166C97604828p92542j178588r79119q71887r87244j116790j136170n85441n02320
$$ 397604828 396812286 395633698 394654579 393782692 392795448 391678658 390542488 389957047 389454727
3174.7C89454727q29010q29506j200905j463737p83424m80805p41310j117668r69429
$$ 389454727 388625717 387796211 386595306 385131569 384348145 383867340 383126030 382008362 381038933
3183.4C81038933n18418p29522o71578o88324j061668r55429o47965r79194j251679
$$ 381038933 380520515 379790993 379119415 378431091 377369423 376413994 375766029 374786835 373535156
3192.1C73535156p65228p92770q82683m86756m33654j009407r01795m20418p95517
$$ 373535156 372769928 371977158 371094475 370607719 370174065 369164658 368262863 367842445 367046928
3200.8C67046928p37342p99485q25653r39827j051597k17553l92074p25212r42764
$$ 367046928 366309586 365510101 364684448 363744621 362693024 362475471 362083397 361358185 360415421
3209.4C60415421j323662o08101j13831m87060p76749p90329r57794p97730o38160
$$ 360415421 359091759 358483658 358369827 357882767 357106018 356315689 355357895 354560165 353922005
3218.1C53922005m84848p15371q08258l24821q73833o78291l02162n11971m94308o05240
$$ 353922005 353437157 352721786 351913528 351588707 350714874 350036583 349734421 349222450 348728142 348122902
3227.8C48122902k74315o29654p81670n87005m93736n76439j068344p04041n86395
$$ 348122902 347848587 347218933 346437263 345850258 345356522 344780083 343711739 343007698 342421303
3236.4C42421303n21546l50799k29607m47006q25920k32353l99590q52280r88616q44651
$$ 342421303 341899757 341548958 341319351 340872345 340046425 339814072 339414482 338562202 337573586 336728935
3246.1C36728935l70102k49557n18646q12035m48265o09284n04226k54402m19808l27797
$$ 336728935 336358833 336109276 335590630 334778595 334330330 333721046 333216820 332962418 332542610 332214813
3255.7C32214813o19468k97928l33939m57077k77977o49033l71475o3858n06401j073150
$$ 332214813 331595345 331297417 330963478 330506401 330228424 329579391 329207916 329144058 328637657 327564507
3265.4C27564507p99103l88870k61536l27721m14772j37787k51121m14658q14247n07660
$$ 327564507 326765404 326376534 326114998 325787277 325372505 325234718 324983597 324568939 323754692 323247032
3275C23247032Q0185k04811m14200n91125m37813m15154l46641o87828p30019L10993
$$ 323247032 323327217 323122406 322708206 322117081 321679268 321264114 320917473 320229645 319499626 319810619
3284.7C19810619k27432q62522l10020k25468m78764r9258k00577n63145n7m13551
$$ 319810619 319583187 318720665 318410645 318185177 317706413 317607155 317406578 316843433 316843376 316429825
3294.3C16429825m37546Q0051m88548p75490o68220n28069m9762J78432m07734k60677
$$ 316429825 315992279 316072330 315583782 314808292 314140072 313612003 313562241 313740673 313332939 313072262
3303.9C13072262k76890q73680l48759k16045o15845m90055j62773l42484m29954n65529
$$ 313072262 312795372 311921692 311572933 311356888 310741043 310250988 310088215 309745731 309315777 308750248
3313.6C08750248p57198j24035l9883j11198k90451n19543m81052l05176k15626j004868
$$ 308750248 307993050 307869015 307829132 307717934 307427483 306907940 306426888 306121712 305906086 304901218
3323.2C04901218k58693M16927m07047p48482r72786o12926j24054j69297n66539j84708
$$ 304901218 304642525 305059452 304652405 303903923 302931137 302318211 302194157 302024860 301458321 301273613
3332.9C01273613j09901q80051o34995m80632k50893j15776l08075n82428o98624k52037
$$ 301273613 301163712 300283661 299648666 299168034 298917141 298801365 298493290 297910862 297212238 296960201
3342.5B96960201m91466l48740n1937m64878n51834k76241r3136r4166m55017r06315
$$ 296960201 296468735 296119995 296068058 295603180 295051346 294775105 294681969 294587803 294132786 293226471
3352.2B93226471n00832m21924m70600n48344n67055L3283n32226m34208O0291l44829
$$ 293226471 292725639 292303715 291833115 291284771 290717716 290750999 290218773 289784565 289844856 289500027
3361.8B89500027l68061n50270m82445l70255m16622k63462o1932l47194p17449l50285
$$ 289500027 289131966 288581696 288099251 287728996 287312374 287048912 286986980 286639786 285922337 285572052
3371.4B85572052k63729m26197j00079J90831m64478p89890l81146k00100j64108n14641
$$ 285572052 285308323 284882126 284782047 284972878 284508400 283718510 283337364 283137264 282973156 282458515
3381.1B82458515k86903j29833l70751m8599K14844j08872n34801k60945k74677k44904
$$ 282458515 282171612 282041779 281671028 281622429 281837273 281728401 281193600 280932655 280657978 280413074
3390.7B80413074l13167o31924j4286J72844l2883n8555J62868j57871n26142K08244
$$ 280413074 280099907 279467983 279453697 279626541 279593658 279535103 279697971 279540100 279013958 279222202
3400.4B79222202K56558k95792j73740q9417o70204m71821k4833k69719J43509K00177
$$ 279222202 279478760 279182968 279009228 278919811 278249607 277777786 277752953 277483234 277626743 277826920
3410B77826920j09807K47937L25470l84598k32372N06725l8986m00009M5509M39358
$$ 277826920 277717113 277965050 278290520 277905922 277673550 278180275 278141289 277741280 277786789 278226147
3419.7B78226147j51215p08370K94781Q90770M32357J1502K38380K78511j49231n09701
$$ 278226147 278074932 277366562 277661343 278552113 278984470 278995972 279234352 279512863 279363632 278853931
3429.3B78853931n04875j13640J93730L50857K04639L16010K53562J21747J56784J00689
$$ 278853931 278349056 278235416 278429146 278780003 278984642 279300652 279554214 279675961 279832745 279933434
3439B79933434M26902K05078J93673J45282J84784M37241L98788J039639L052n76325
$$ 279933434 280360336 280565414 280759087 280904369 281089153 281526394 281925182 282964821 282967873 282391548
3448.6B82391548O28414N71118J54285K09618M25396N10788M58469P4825J37482O81591
$$ 282391548 283019962 283591080 283745365 283954983 284380379 284891167 285349636 285424461 285561943 286243534
3458.2B86243534Q74806M57401J05362K75974J30253Q78296R70344L75042J94397J32809
$$ 286243534 287118340 287575741 287681103 287957077 288087330 288965626 289935970 290311012 290505409 290638218
3467.9B90638218J003227N01270L59059O96964J65844M78630K66762L10841Q01086
$$ 290638218 291641445 292142715 292501774 293198738 293364582 293843212 294109974 294420815 295221901
3476.6B95221901Q09059N36614M07676P37076J057320L89499j48754O75354J61343
$$ 295221901 296030960 296567574 296975250 297712326 298769646 299159145 299010391 299685745 299847088
3485.2B99847088O44951J253719l8662K71359R78431J235142P23229N02243N14488
$$ 299847088 300492039 301745758 301707096 301978455 302956886 304192028 304915257 305417500 305931988
3493.9C05931988K38456M22688M40521J188164P79648O05640Q04596N92804Q06255
$$ 305931988 306170444 306593132 307033653 308221817 309001465 309607105 310411701 311004505 311810760
3502.6C11810760K652O02169J030884Q90426R53579Q99620M78363n8899J074238J125431
$$ 311810760 311813412 312415581 313446465 314336891 315290470 316190090 316668453 316609554 317683792 318809223
3512.2C18809223J015644Q17948N06858N23873K93464Q01240O06460Q91762R22432
$$ 318809223 319824867 320642815 321149673 321673546 321967010 322768250 323374710 324266472 325188904
3520.9C25188904J136589Q82454m8409J544304J187096L69072K65655Q53653J316338
$$ 325188904 326325493 327207947 327159538 328703842 329890938 330260010 330525665 331379318 332695656
3529.6C32695656N74074O46972O83632J359482J222000J441498J005974j95427J040230
$$ 332695656 333269730 333916702 334600334 335959816 337181816 338623314 339629288 339433861 340474091
3538.3C40474091Q01963Q09975J358872J590080J165848M51545q9073j41640J158753
$$ 340474091 341276054 342086029 343444901 345034981 346200829 346652374 346563301 346421661 347580414
3547C47580414N46608K028007J767807J446381K024269o36749J655960K069206J324081
$$ 347580414 348127022 350155029 351922836 353369217 355393486 354756737 356412697 358481903 359805984
3555.6C59805984J483422J59454J109467J308212J283607Q82988K304268K070504J496124
$$ 359805984 361289406 361448860 362558327 363866539 365150146 366033134 368337402 370407906 371904030
3564.3C71904030L255958o72264O36978L53547k73514L774795K272301K174759K260056
$$ 371904030 375159988 374487724 375124702 375478249 375204735 378979530 381251831 383426590 385686646
3573C85686646J374359O72912J340714K151375J035041K237664J462745Q64601K366639
$$ 385686646 387061005 387733917 389074631 391226006 392261047 394498711 395961456 396826057 399192696
3581.7C99192696K932930J979675J120453L608436R73549j153755K621536Q38814L215637
$$ 399192696 402125626 404105301 405225754 408834190 409807739 408653984 411275520 412114334 415329971
3590.4D15329971L596917K844276R69047P58782L369369J68648K580033L264656N64804
$$ 415329971 418926888 421771164 422740211 423498993 426868362 427037010 429617043 432881699 433446503
3599D33446503L243599J483802J046944L081780K042694J663055K647133K352409K01989
$$ 433446503 436690102 438173904 439220848 442302628 444345322 446008377 448655510 451007919 451209908
3607.7D51209908L804855R7046O64978P399254J246147j171837L339729Q7548M395866
$$ 451209908 455014763 455111809 455776787 463176041 464422188 463250351 466590080 466677628 471073494
3616.4D71073494L665237J94054K033119l78761J062622L444252L512268K405815K160683
$$ 471073494 474738731 474932785 476965904 476587143 477649765 481094017 484606285 487012100 489172783
3625.1D89172783J975708K397804O260681q07495r023895N617790N931587N371132
$$ 489172783 491148491 493546295 499806976 498999481 489975586 495593376 501524963 506896095
3632.8E06896095O19202j328201L482360L788949K566413O87447J499634K472648K152100
$$ 506896095 507515297 506187096 509669456 513458405 516024818 516712265 518211899 520684547 522836647
3641.5E22836647J199722J260949K870063L082238M382209j072120k489357M911613
$$ 522836647 524036369 525297318 528167381 531249619 535631828 534559708 532070351 536981964
3649.2E36981964j2779j377831M02832M870148M231377M410400M559631o729660K698288
$$ 536981964 536969185 535591354 535994186 540864334 545095711 549506111 554065742 547336082 550034370
3657.9E50034370M892617O40564R34906O95266K643280J778641J779900J596527O71539
$$ 550034370 554926987 555567551 556502457 557197723 559841003 561619644 563399544 564996071 565667610
3666.5E65667610M074745J536064j893653j57662l749962L953934P777062O885452
$$ 565667610 569742355 571278419 569384766 569227104 565477142 569431076 577208138 584093590
3674.3E84093590m249802j5214615O246491Q268509L891945j539078J232948K478294
$$ 584093590 579843788 564629173 570875664 579144173 583036118 581497040 582729988 585208282
3682E85208282J356812J513367M33235N59158M157028N419808q647118k837295P371406
$$ 585208282 586565094 588078461 588511696 589070854 593227882 598647690 590000572 587163277 594534683
3690.6E94534683l297577J332474N227738J201057J661072j2131m19731J668472J160736
$$ 594534683 591237106 592569580 597797318 598998375 600659447 600647316 600227585 601896057 603056793
3699.3F03056793K298699J951179m543419r10911M720306J234169L45802J257630K538223
$$ 603056793 605355492 607306671 602763252 601852341 606572647 607806816 608152618 609410248 611948471
3708F11948471K689819p286872M457740L590126j2355346O305999N049248K92130Q94394
$$ 611948471 614638290 607351418 611809158 615399284 603043938 609349937 614399185 614691315 615585709
3716.7F15585709K621688J027375l458367J943970M706726m347839l079071N494041
$$ 615585709 618207397 619234772 615776405 617720375 622427101 618079262 615000191 620494232
3724.4F20494232J651306k178535k994232K222328M358635R56039M260865l938027
$$ 620494232 622145538 619967003 616972771 619195099 623553734 624509773 628770638 624832611
3732.1F24832611n201073R254113r16176r347382J349755L845710K037888K349853
$$ 624832611 619631538 628885651 627969475 618622093 619971848 623817558 625855446 628205299
3739.8F28205299K783204l018914K976265R550591j4371300j1760178J1841660O704826
$$ 628205299 630988503 627969589 630945854 640496445 626125145 614364967 626206627 632911453
3747.5F32911453N494957l777046q333855J0251847n157090n366630O053276M562416
$$ 632911453 638406410 634629364 626295509 636547356 631390266 626023636 632076912 636639328
3755.3F36639328L233032m977188J931572N316200o879921j100807M088860J966820
$$ 636639328 639872360 634895172 636826744 642142944 635263023 634162216 638251076 640217896
3763F40217896J315078K744141l671036l914375M013862N003128n22384r060593K600937
$$ 640217896 641532974 644277115 640606079 636691704 640705566 645708694 645186310 636125717 638726654
3771.7F38726654M511185J068573N03311o82221R83735O63986K174148o02951o393051
$$ 638726654 643237839 644306412 644809723 644127502 645111237 645775223 647949371 647346420 640953369
3780.3F40953369L034439K669068J977996K068787l622131r05228J209106P91855O81763
$$ 640953369 643987808 646656876 648634872 650703659 647081528 646176300 647385406 648177261 648859024
3789F48859024L42102J074371k48565L02582Q73794J888504L056183l668823l806992
$$ 648859024 649201126 650275497 650026932 650329514 651203308 653091812 656147995 652479172 648672180
3797.7F48672180K015457M006119M742813p974014r051132M816894M601059N443115
$$ 648672180 650687637 654693756 659436569 651462555 642411423 647228317 651829376 657272491
3805.4F57272491M033585j0216980k597580N037079K035904P34024L02505j55487J643830
$$ 657272491 661306076 651089096 648491516 653528595 655564499 656298523 656601028 656445541 658089371
3814.1F58089371M927444l963699j2679672O418838N918045M294129J402969j6139145
$$ 658089371 663016815 659053116 646373444 652792282 658710327 663004456 664407425 648268280
3821.8F48268280K407227N602798K125549K603150m83170m881439P78046K940368L793106
$$ 648268280 650675507 656278305 658403854 661007004 660523834 655642395 656420441 659360809 663153915
3830.5F63153915P94449q601379L673706O701660o399841j36872P469025r129028l514023
$$ 663153915 663948364 655346985 659020691 665722351 659322510 659185638 666654663 657525635 654011612
3839.2F54011612Q297501m859009Q73565O817856l245697l124237L171845J904373
$$ 654011612 662309113 657450104 658323669 665141525 661895828 658771591 661943436 663847809
3846.9F63847809L09601J259613j110230J411667L917542p320862P3852j1988830M301223
$$ 663847809 664157410 665417023 664306793 665718460 669636002 662315140 662388992 650400162 654701385
3855.6F54701385J0434876p51419j617127K157288K566299J421967n718460J303711
$$ 654701385 665136261 664384842 662767715 664925003 667491302 668913269 663194809 664498520
3863.3F64498520O248245o470337l915100N028076M981766N136337q608169q429566
$$ 664498520 670746765 664276428 660361328 665389404 670371170 675507507 666899338 658469772
3871F58469772N362397O952056K615586j0791321J500702M573517N4092K184982L635560
$$ 658469772 663832169 670784225 673399811 662608490 664109192 668682709 668736801 670921783 674557343
3879.7F74557343o670151n674134P172623J878891J273346K819748j3152084K479477
$$ 674557343 667887192 662213058 669385681 671264572 672537918 675357666 662205582 664685059
3887.4F64685059M888687J509475L348237j930695o987457J935806L318863j322174
$$ 664685059 669573746 671083221 674431458 672500763 665513306 667449112 670767975 669445801
3895.1F69445801J427383J320648J889191R57718q784027N390320J494827n143356
$$ 669445801 670873184 672193832 674083023 675040741 666256714 671647034 673141861 667998505
3902.8F67998505M158096l572159o86111J405029J023788J738892l29208L77426o8665
$$ 667998505 672156601 668584442 667898331 669303360 670327148 672066040 671736832 672114258 672045593
3911.5F72045593R7733L4256k27967J599503K255478l290863l167114M554672L55606
$$ 672045593 672143326 672177582 671949615 673549118 675804596 672513733 669346619 673901291 674256897
3920.2F74256897l200836J877365Q52508L51258k063294j496429K539978J171493O53229
$$ 674256897 671056061 672933426 673785934 674137192 672073898 670577469 673117447 674288940 674942169
3928.8F74942169q85086o08826J427155k389450q73795J833115M87595O16302M8904
$$ 674942169 674057083 673448257 674875412 672485962 671612167 673445282 673932877 674549179 674598083
3937.5F74598083m74472N35126N66025J636505P10526l960419o57883J445999J559067
$$ 674598083 674123611 674658737 675224762 676861267 677571793 673611374 672953491 674399490 675958557
3946.2F75958557J303253k615890R29260J106644j583405J738663m01611j059266Q78678
$$ 675958557 677261810 674645920 675575180 676681824 675098419 676837082 676435471 675376205 676254883
3954.9F76254883N80673m33426q96149O49415Q1863L29971J19629j056061L06626M13818
$$ 676254883 676835556 676402130 675505981 676155396 676237259 676567230 676686859 675630798 675937424 676351242
3964.5F76351242J9226Q8043L62397L70025k82821k31247O16836k04315q33054L71094
$$ 676351242 676370468 676458511 676820908 677190933 676908112 676676865 677293701 677089386 676256332 676627426
3974.2F76627426K16065M90036J37024o74973L27682Q35114k27661r36356l9138K07595
$$ 676627426 676843491 677333527 677470551 676795578 677123260 677958374 677730713 676794357 676755219 676962814
3983.8F76962814L12577J19552N73426Q13293n66788l4485Q774J38092p324n31006
$$ 676962814 677275391 677394943 677968369 678781662 678214874 678180389 678189163 678327255 678319931 677788925
3993.5F77788925K24152p62253k68250R53598M21601o80084l99628
$$ 677788925 678013077 677250824 676982574 677936172 678357773 677677689 677278061
4000.2F77278061
$$ 677278061
##END=$$ End of the data block
