##TITLE=$$ Begin of the data block
##JCAMP-DX=5.00 $$ ACD/SpecManager v 10.08
##SPECTROMETER/DATA SYSTEM=Varian
##DATE=20 Nov 2012 10:06:54
##DATA TYPE=INFRARED SPECTRUM
##DATA CLASS=XYDATA
##ORIGIN=
##OWNER=
##NPOINTS=3735
##FIRSTX=399.26403809
##LASTX=4000.35498047
##MAXX=4000.35498047
##MINX=399.26403809
##MAXY=76.74919128
##MINY=22.41597557
##XFACTOR=1.0000000000
##YFACTOR=0.000000100000000
##FIRSTY=54.13588715
##DELTAX=0.96440572
##XUNITS=1/CM
##YUNITS=TRANSMITTANCE
##XYDATA=(X++(Y..Y))
399.3E41358871M048653r686203l460998p015801j0234146l527412K608451M28925
407E14520340k489853M619179M582519j364441M001275K63900j401443J554565n352440
415.7E18933601k495308l051452j3951950P341842J6518097N131378l654022o701622
423.4E18070564q77876K812805M161186k542152n341568k823296j882133l436623k689323
432.1E05451584K328453O101456m6349p308083n352096q88062M59443p41349K184563
440.7E02189560J951752J207809N104408K154503J420899M69207J038742K547875P47490
449.4E18832245J252746J617356J883735n4321J370316P31811m814377m682731j152001
458.1E14984779L957711J422386l553353l908615J33553j755791l123360L369446n91316
$$ plain form
399.3 541358871 545407524 535721321 532260323 525244522 515010376 511482964 514091415 514520340
407 514520340 512030487 516649666 521232185 519867744 523869019 524132919 522731476 524286041 518933601
415.7 518933601 516438293 513386841 499434891 506776733 523294830 528426208 524772186 518070564
423.4 518070564 517192688 520005493 524166679 521624527 516282959 513459663 511577530 508140907 505451584
432.1 505451584 507780037 513881493 513835144 506527061 501174965 500286903 500746346 500004997 502189560
440.7 502189560 504141312 505349121 510453529 512608032 514028931 514498138 515536880 518084755 518832245
449.4 518832245 520084991 521702347 523586082 523531761 524902077 525633888 520819511 516136780 514984779
458.1 514984779 518942490 520364876 516811523 512902908 513036461 511280670 508157310 511526756 510935440
466.8E10935440j322250N468902j167030n871811k371178j72424m38538j644020n010337
475.5D98406754k618447k962074k825279K896881J12037O14319M106980j476975o128044
484.1D90126152K733040K904587j993752m54178m424362k610435N62553k52495K599869
492.8D89190979L887291M82063k371902O78062j485481j715164k41013j028366l29475
501.5D87066994l067627r7199j065483j576195k835350n010109K248040M37584l912011
510.2D72188644l297996N5466j077767l225097j172066k617684k950019p68357M83322
518.9D57618446l935661l134804N45159l405877k540779N44815j709861l154145J379204
527.5D42206497Q56781N61714m94651k578621J546363P95136R8953K6627J279869L833160
$$ plain form
466.8 510935440 509613190 515082092 513915062 508043251 505672073 505499649 505061111 503417091 498406754
475.5 498406754 495788307 492826233 490000954 492897835 493009872 493624191 497731171 496254196 490126152
484.1 490126152 492859192 495763779 493770027 493315849 488891487 486281052 486843605 486591110 489190979
492.8 489190979 493078270 493560333 491188431 491866493 490381012 488665848 488424835 487396469 487066994
501.5 487066994 483999367 483902168 482836685 481260490 478425140 473415031 475663071 476100655 472188644
510.2 472188644 468890648 468946114 467868347 464643250 463471184 460853500 457903481 457135124 457618446
518.9 457618446 453682785 450547981 451093140 447687263 445146484 445691299 443981438 440827293 442206497
527.5 442206497 443063278 443624992 443130341 440551720 442098083 442893219 442992172 443018799 444298668 448131828
537.2D48131828K035294K338905K752877M757652K999573J005325K198791Q698Q93059
545.9D67122002J122169r54j88026m08821p32956j655350M12216J06431j208992k224732
555.5D62342987k761421q35381P0839n42297k309799k794800k239914p45926j921196
564.2D48263092l287086k643471l675995l924255m551888k245407k188759k546081
571.9D23200150k252503k920761j78261j27144J069603J341820K394905K544670J550904
580.6D26623383L005142L345108N713730L431472J326523L505516L968010L305168
588.3D54224052J547394M10614J67885P28531k00577M87709L026619J201706j343193
597D60250740p03163N24483n66979o75087Q84133J184196j91803j578255j441230j000939
$$ plain form
537.2 448131828 450167122 452506027 455258904 460016556 463016129 464021454 466220245 466228943 467122002
545.9 467122002 468244171 468243217 468055191 467646370 466913414 465258064 465670280 465776711 464567719 462342987
555.5 462342987 459581566 458746185 458817024 458274727 455964928 453170128 450930214 450184288 448263092
564.2 448263092 444976006 442332535 438656540 434732285 430180397 427934990 425746231 423200150
571.9 423200150 420947647 418026886 417848625 417721481 418791084 420132904 422527809 425072479 426623383
580.6 426623383 429628525 432973633 438687363 442118835 443445358 446950874 450918884 454224052
588.3 454224052 455771446 456182060 456349945 457078476 456877899 457365608 460392227 461593933 460250740
597 460250740 459547577 460072060 459505081 458829994 459714127 460898323 460706520 459128265 457687035 456686096
606.6D56686096Q37593K81983m75922J478005J793136J254158M67949J559181J474457
615.3D65356636n5122P57064J118546O14777Q72612J174354O93207K112274L736076
624D76380424L475075K019501Q56018J268501J172829J11542j45340Q90579J12267
632.7D86141396J134224L122749J623154O48880l14675M66767J058502L07922Q95119
641.3D95084038j31645l43781l29819n52520N17501J293679J264000Q62388Q47206
650D98511047L26386P86629J392936P56150r64623m15955L94211q85544R80912J436767
659.7E02318916J327591J529274P82509J574631N55954P24487l2234n358505j3733864
668.3D89688759P605514O898995K364082J849137J902122J164780K623825J961174
$$ plain form
606.6 456686096 457523689 457805672 457329750 458807755 460600891 461855049 462322998 463882179 465356636
615.3 465356636 465301514 466058578 467177124 467791901 468664513 469838867 470532074 472644348 476380424
624 476380424 479855499 481875000 482731018 483999519 485172348 485283890 485138550 486029129 486141396
632.7 486141396 487275620 490398369 492021523 492670403 492355728 492822495 493880997 494188919 495084038
641.3 495084038 494952393 494608612 494278793 493726273 494243774 495537453 496801453 497663841 498511047
650 498511047 498837433 499624062 501016998 501773148 500808525 500392570 500786781 499901237 500882149 502318916
659.7 502318916 503646507 505175781 505958290 507532921 508088875 508813362 508781128 503422623 489688759
668.3 489688759 497294273 504193268 506557350 508406487 510308609 511473389 514097214 516058388
676.1E16058388M83818k18239K0676o97747p56874J57509K60353Q86803J096764K409133
685.7E19700584J738930J423378K161408l84293j077385p58095o28891j180877j576081
694.4E19418678n70488j096306n83190J49993J48735J74408m30679p83653j018677
703.1E15408821j838341k889900j793327r26285j261711q04978n1231J888619L153152
711.7E10884819J988068J593437K553787K108002Q01544L89442O03219J125030K690086
720.4E24737434L796311L306427K883224L006897M728585M566764J319733R19991K123375
729.1E51388741J621398J385384J300659P10869O54183J878967K339859K541008L462944
737.8E67284012K389107R58786k6780q14933j590042k294198j419410l83263N79071
$$ plain form
676.1 516058388 516542206 516323967 516344643 515646896 514890022 515047531 515307884 516194687 517291451 519700584
685.7 519700584 521439514 522862892 525024300 524640007 523562622 522804527 522175636 520994759 519418678
694.4 519418678 518848190 517751884 517168694 517318687 517467422 517641830 517211151 516427498 515408821
703.1 515408821 513570480 510680580 508887253 507960968 506699257 505894279 505843048 507731667 510884819
711.7 510884819 512872887 514466324 517020111 519128113 519929657 520319099 520922318 522047348 524737434
720.4 524737434 528533745 531840172 534723396 537730293 542458878 547025642 548345375 549265366 551388741
729.1 551388741 553010139 554395523 555696182 556407051 557061234 558940201 561280060 563821068 567284012
737.8 567284012 569673119 570631905 570605125 569790192 568200150 565905952 564486542 564103279 564682350
746.5E64682350l23868p70187M29611l11699o01883n66940k157059l434257l514824
755.1E53431244l874245l939361l096276r43145L97338l78799k81639J04256R50622
763.8E42369995M6921j918182q07839K91214M79851L63235J343651K824783L921090
772.5E48914719O145782N918465M512176M689408M379310K876053K038078K849198
780.2E82323189J619835J341133K569160L042527L719558L254624K712555L349952
787.9F03932533M022484K326508N68199j085892o78596R49668l4523R86443J363602
796.6F12350426K931595M474029K903137K764206K023888K096825J936759N83725j329536
805.3F30735054j464500m91944l17917J091538J571274L069076K315979J573677K155953
$$ plain form
746.5 564682350 564358482 563588295 564017906 563706207 563104324 562537384 560380325 556946068 553431244
755.1 553431244 549556999 545617638 542521362 541578217 541975555 541596756 541315117 541419373 542369995
763.8 542369995 542416916 540498734 539690895 539982109 540461960 540825195 542168846 544993629 548914719
772.5 548914719 555060501 560978966 565491142 570180550 574559860 577435913 579473991 582323189
780.2 582323189 583943024 585284157 587853317 590895844 594615402 597870026 600582581 603932533
787.9 603932533 607955017 610281525 610849724 609763832 609085236 610034904 610000381 610986824 612350426
796.6 612350426 615282021 619756050 622659187 625423393 627447281 629544106 631480865 632064590 630735054
805.3 630735054 629270554 628778610 628460693 629552231 631123505 634192581 636508560 638082237 640238190
814F40238190L6621o38161j017837j076241k970047l007698j049385l62358Q02536
822.6F30955620k29340M5510M02832n64576j779899k295838k986602m165078k885780
831.3F16496849l306465k482300j739197k155189j35422P84493J11999j217422j530152
840F04827194k502785k834854l128318m209404k795144j825981j204681r31854o30684
848.7E84763489l86620p59926q65631j490783k010537l235702l293877l655319m211998
857.4E64853096l129082k358589p62977N63735J464959K752151M075585M840011L749428
866E76048317K701263K924691M168319L244439L349113N765915O021538N930023M961815
874.7F15115433M392128L960609L161659J377526m93622j131592k939987l292656k512245
$$ plain form
814 640238190 640274811 639636650 638618813 637542572 634572525 631564827 630515442 630153084 630955620
822.6 630955620 630726280 630771790 631174622 630610046 628830147 626534309 623547707 619382629 616496849
831.3 616496849 613190384 610708084 608968887 606813698 606678276 607462769 607574768 606357346 604827194
840 604827194 602324409 599489555 596361237 592151833 589356689 587530708 586326027 585394173 584763489
848.7 584763489 584376869 583616943 582751312 581260529 579249992 576014290 572720413 569065094 564853096
857.4 564853096 561724014 559365425 558602448 559166183 560631142 563383293 567458878 572298889 576048317
866 576048317 578749580 581674271 585842590 589087029 592436142 598202057 604223595 610153618 615115433
874.7 615115433 619507561 623468170 626629829 628007355 627513733 626382141 623442154 620149498 617637253
883.4F17637253j360398o77185k27584p36161j166916p86895k434044k381478k764473
892.1F05102119l487548l135529l759041l333778j714745r10339k045937j211738o49414
900.8E84854050j909409k913589m387665l882981l679046m191704m672813n215378
908.5E54001465m574547m058723m058609l788643l537064m287300n122490n733452
916.2E18840637o168022o319542o217461n155868l692627l059883j845818k94532m51851
924.9D85635033o38428j67160J526l50991M5853M62570R6665M85840J360359J293182
934.5D88224449J570130K980461L158455L462982L380699K275047K260246K998429
942.2E10310898K833900J215897P89680R51081N82962k46277j072121r66224j832467
$$ plain form
883.4 617637253 616276855 615599670 615372086 614635925 613469009 612682114 610248070 607866592 605102119
892.1 605102119 601614571 598479042 594720001 591386223 589671478 588761139 586715202 585503464 584854050
900.8 584854050 582944641 580031052 575643387 571760406 568081360 563889656 559216843 554001465
908.5 554001465 549426918 545368195 541309586 537520943 533983879 529696579 524574089 518840637
916.2 518840637 512672615 506353073 500135612 494979744 491287117 488227234 486381416 486086884 485635033
924.9 485635033 484996605 484829445 484830971 484479980 484525833 484988403 485085068 485570908 486931267 488224449
934.5 488224449 489794579 492775040 495933495 499396477 502777176 505052223 507312469 510310898
942.2 510310898 513144798 514360695 515150375 516101456 516684418 516438141 515366020 514399796 512567329
950.9E12567329k742729k892837m504853o464996o443748n996399o847382o958542
958.6D69715843p109909p481499p084770p069664o696396p602806p816620q627166
966.3D10227013r715119r654884j0200119q850060r849167r250259r119415j0313072
974.1C33274918q240624q721638q750515r651527r211388q194580p668724o906833
981.8B65929089o819897m847336n345364m052333l826065l488369l241692l514137
989.5B30793896j163960j312275n33771j512776j67923m55684j343956N66292k91577
998.2B24578266J377716L29476Q40053P16248M70810R43279k02007J385021j246491
1006.8B29192371n63488n49965o95343j09481j683903k44446j185989P47204j11046
$$ plain form
950.9 512567329 509824600 506931763 502426910 495961914 489518166 483521767 476674385 469715843
958.6 469715843 462605934 455124435 448039665 440970001 434273605 426670799 418854179 410227013
966.3 410227013 400511894 390857010 380656891 371806831 361957664 352707405 343587990 333274918
974.1 333274918 325034294 316312656 307562141 297910614 288699226 280504646 272835922 265929089
981.8 265929089 259109192 254261856 248916492 244864159 241038094 237549725 234308033 230793896
989.5 230793896 229629936 228317661 227783890 226271114 226103191 225647507 224303551 224869843 224578266
998.2 224578266 225955982 226285458 227125511 227841759 228312569 229255848 229053841 230438862 229192371
1006.8 229192371 228628883 228078918 227383575 227274094 225590191 225345745 224159756 224906960 224795914
1015.5B24795914L20816Q99296p83082Q62275l50495J513157N18665J327725J840401
1024.2B30944672N14087K580319J273842K270012J355648K144661K129917J392765
1031.9B44605923K237129Q92715J747227j01318N14774L37124R84077J264210o17657
1040.6B51864204L25451j682968N19600M42810o88743m36917K03533J398106p61223
1049.3B51183853J581440J363793K186222K220630J664582L144092K933731M741230
1057B71019573K541752L554955L832187M042607M999847L819561N141563M231282N893707
1065.7C09077034M246998K716560K375298m99859k458019n531540n430336o149884
1073.4B98346252m298133l706799l924465j940575k219372K07787k37770J599827J177978
$$ plain form
1015.5 224795914 225116730 226016026 225232944 226095219 225744724 227257881 227776546 229104271 230944672
1024.2 230944672 231458759 234039078 235312920 237582932 238938580 241083241 243213158 244605923
1031.9 244605923 246843052 247735767 249482994 249381676 249896450 250233574 251217651 252481861 251864204
1040.6 251864204 252189655 250506687 251026287 251469097 250780354 250343437 250546970 251945076 251183853
1049.3 251183853 252765293 254129086 256315308 258535938 260200520 263344612 266278343 271019573
1057 271019573 273561325 277116280 280948467 284991074 289990921 293810482 298952045 303183327 309077034
1065.7 309077034 313324032 316040592 318415890 317916031 315458012 309926472 304496136 298346252
1073.4 298346252 294048119 290341320 286416855 284476280 282256908 282464695 282226925 283826752 285004730
1082.1B85004730J374531K860603J479016L428154K215976L200913K847938L444081
1089.8C05855942L825245L060646N265979L822518L699188J324501J339913J971283
1097.5C30165215R37957R13086r02633M27017o0997Q66050L91922J57776J093064l7766
1107.1C33950691J691170M48685J569748K049522K170486K284546J155815K465325
1114.9C47785988R92241K380066K324638J458321J332740P29905J390380L81127J114807
1123.5C59890213j53122Q8921P20405R27963J691247J140556K878380K470131L315658
1132.2C72970352K155342N22461P70188k18544J92680j390228j584931k578964k689056
1140.9C68149300k086373l054657k424507l557968l201218m088516l502884k572746
$$ plain form
1082.1 285004730 286379261 289239864 290718880 294147034 296363010 299563923 302411861 305855942
1089.8 305855942 309681187 312741833 318007812 321830330 325529518 326854019 328193932 330165215
1097.5 330165215 331103172 332016258 331113625 331540642 331479645 332345695 332737617 332895393 333988457 333950691
1107.1 333950691 335641861 336090546 337660294 339709816 341880302 344164848 345320663 347785988
1114.9 347785988 348778229 351158295 353482933 354941254 356273994 357003899 358394279 358775406 359890213
1123.5 359890213 359737091 359826012 360546417 361474380 363165627 364306183 367184563 369654694 372970352
1132.2 372970352 375125694 375648155 376418343 376199799 376392479 375002251 373417320 370838356 368149300
1140.9 368149300 366062927 363008270 360583763 357025795 353824577 349736061 346233177 343660431
1148.6C43660431k976265k306175k787628j498375k440911p06939J22909L54157J685295
1157.3C33106499L69835J474838O80313J809082K313728K733460L286781K748299M857940
1166C53380775M813385N817299N739212O371880O561890O426773P693786O643792O888313
1174.6D10337105O078949O108703O898423P236633P169762O405677O531449N986404
1182.4D62753105O259728N856781N012359M568520M093704L627472K799454L069420
1190.1D98040543L377952K715416K061348K135544J861916J031112Q30498Q66623J80626
1198.8E13101578j94321j26457k49863M50325P00913O36558J067085J244202J620751
1207.4E18250771J466369J710549J938400J749420J519775J323548J983871J822853
$$ plain form
1148.6 343660431 340684166 338377991 335590363 334091988 331651077 330944138 331067047 331421204 333106499
1157.3 333106499 333476334 334951172 335631485 337440567 339754295 342487755 345774536 348522835 353380775
1166 353380775 358194160 364011459 369750671 376122551 382684441 389111214 396805000 403448792 410337105
1174.6 410337105 416416054 422524757 429423180 436659813 443829575 450235252 456766701 462753105
1182.4 462753105 469012833 474869614 479881973 484450493 488544197 492171669 494971123 498040543
1190.1 498040543 501418495 504133911 506195259 508330803 510192719 511223831 512054329 512920952 513101578
1198.8 513101578 512907257 512780800 512530937 512981262 513682175 514318733 515385818 516630020 518250771
1207.4 518250771 519717140 521427689 523366089 525115509 526635284 527958832 529942703 531765556
1215.1E31765556K014542K431412J767082J820755K612457K212715J023598K59361
1222.9E45907478n41916p93266q17299p56721j205559j502419j008529o91452l74375
1231.5E38215942n18150m57039k36397r64737j701507j624222j069832r88502j182175
1240.2E29473381r96246o75621r2392L77159M32625O15120J018714J000481M31519
1248.9E31584740K48527L70598M8904J22986O88820N90439L63617N18608J231422J182709
1258.5E36951370L87688O55060M55093r8534j92756L7384O4659k26135J57127R96819
1268.2E39187775J589584J618004J659050J109962P92809Q47587j19133n62172p93724
1276.9E45329742m82978m59099m77219O7597R1323M53301K57797k44636j36338J71509
$$ plain form
1215.1 531765556 533780098 536211510 537978592 539799347 542411804 544624519 545648117 545907478
1222.9 545907478 545365562 544572296 543754997 542998276 541792717 540290298 539281769 538590317 538215942
1231.5 538215942 537697792 537240753 537004356 536039619 534338112 532713890 531644058 530655556 529473381
1240.2 529473381 528477135 527801514 527709122 528086281 528518906 529134026 530152740 531153221 531584740
1248.9 531584740 531833267 532203865 532252769 532375755 533064575 533655014 534018631 534537239 535768661 536951370
1258.5 536951370 537339058 537994118 538449211 538350677 538157921 538195305 538259964 538033829 538190956 539187775
1268.2 539187775 540777359 542395363 544054413 545164375 545957184 546804771 546685638 546123466 545329742
1276.9 545329742 544846764 544387665 543910446 543978043 544069366 544522667 544780464 544535828 544399490 544570999
1286.5E44570999n06897j071930p36770q29277p36428j001968o48461m43878l72123
1295.2E38223267j81046o74858k93121o26374j264572j934089j791916j428109k252082
1303.9E27777100r55162q4115j067581j134605n51109Q01p5569n86319j229783j329917
1313.5E20763741j217423j155777r42345j032066j182671r39483k07977r1286l91770
1322.2E13602943p50122j337433j764144k419091k837410k521705k730103k925262
1329.9D96317673k492028k248191j798516j416092j447639j569977r53979j066513
1337.6D83324738j429482j129265n23758M65241L41148M18663N23377P29332N18684
1346.3D83238678P27463J030540K54784k5215j41907K4681n53780p01561n90095p51610
$$ plain form
1286.5 544570999 544064102 542992172 542255402 541426125 540689697 539687729 539039268 538595390 538223267
1295.2 538223267 538042221 537367363 537074242 536447868 535183296 533249207 531457291 530029182 527777100
1303.9 527777100 526821938 526737823 525670242 524535637 523984528 523985329 523909760 523323441 522093658 520763741
1313.5 520763741 519546318 518390541 517448196 516416130 515233459 514293976 514085999 513994713 513602943
1322.2 513602943 512852821 511515388 509751244 507332153 504494743 501973038 499242935 496317673
1329.9 496317673 493825645 491577454 489778938 488362846 486915207 485345230 484391251 483324738
1337.6 483324738 481895256 480765991 480242233 480707474 481048622 481467285 481990662 482719994 483238678
1346.3 483238678 483966141 484996681 485251465 485226250 485084343 485109024 484555244 483853683 483263588 482511978
1355.9D82511978q1024k54517K26899P9879l60336k81486n90401m90189n33371l46870
1365.6D79880562j087036q37746o28166j42021P94601J6632O55403N49355K14538M84505
1375.2D79900627N07469N78041k18734K94571J1863Q0681J42441P20367J803131J438370
1384.9D85258827J882744J542397J980896J977691J503983R42001M85458K63787k13318
1393.6D95624466o13251j003799L39279m84619r08241j072731o67687K43530j364708
1402.2D90092239j752357j633110j783714r91250q18862q03147j224861n32341r84840
1410.9D79567757n62134l12882r56001m93812j085587q41484r82971l75252k004814
1419.6D71952820L88832K194977L64952P69119L32413Q66623Q72802K12327R34867
$$ plain form
1355.9 482511978 482430954 482176437 482403336 482483215 482122879 481841393 481250992 480760803 480227432 479880562
1365.6 479880562 478793526 477955780 477327614 477185593 477980194 477996826 478652229 479201584 479416122 479900627
1375.2 479900627 480408096 480986137 480767403 481061974 481073837 481154518 481296959 482017326 483820457 485258827
1384.9 485258827 487141571 488683968 490664864 492642555 494146538 495088539 495573997 495837784 495624466
1393.6 495624466 495011215 494007416 494346695 493862076 492953835 491881104 491213417 491456947 490092239
1402.2 490092239 488339882 486706772 484923058 483931808 483112946 482309799 481084938 480552597 479567757
1410.9 479567757 479005623 478692741 477736740 477242928 476157341 475315857 474332886 473957634 471952820
1419.6 471952820 472341652 474536629 474901581 475670700 476003113 476869736 477742538 477954865 478889732
1428.3D78889732l16887K43721K19384R48639J162414P62520J268082k30942J85966
1437D83132629K110024K340088P82470N73273R68819j87874J99776k01645Q84514J46904
1446.6D90748978l03765k77214p3852L71246j072159l02315q93516p8812j074257k219276
1456.2D84825058j801758k561493L635750K82631J841850O94428O94961J793404o0692
1464.9D89344139L527374J738396L013115K142296L226547L663101J233521M969253
1472.6E12857742L932305O594581L016625M566536N723457M002914M189949K242051
1480.3E47126160L424720K218476L389511K773590K168350K844391J125717L638344
1488.1E68709259J485481K179222L218041L567238K917595P03582J680527k4490M59289
$$ plain form
1428.3 478889732 478572845 478816566 479035950 479984589 481147003 481909523 483177605 482946663 483132629
1437 483132629 485242653 487582741 488365211 488938484 489907303 489719429 489919205 489717560 490602074 490748978
1446.6 490748978 490445213 490167999 490094147 490465393 489393234 489090919 488197403 488118591 487044334 484825058
1456.2 484825058 483023300 480461807 484097557 484380188 486222038 486916466 487611427 489404831 489344139
1464.9 489344139 492871513 494609909 497623024 499765320 502991867 506654968 507888489 512857742
1472.6 512857742 516790047 523384628 526401253 530967789 536691246 540694160 544884109 547126160
1480.3 547126160 550550880 552769356 556158867 558932457 561100807 563945198 565070915 568709259
1488.1 568709259 570194740 572373962 575592003 579159241 582076836 582780418 584460945 584436455 584895744
1496.7E84895744K296639J572532J976166K390976K216568M08249J863747J042976
1504.5E98663597n3062n305710l423271O822471J890068K073479J315193J141701N98793
1513.1F03723259J115913O28662k52990L80058o50139K859230Q74329l185616j253814
1521.8F04238892K121696L242416M76876J90964J330680J726838M29878J98135R46388
1530.5F14902763n35011M959k390327k160416J886215R05457P75871m76799l932609
1539.2F08980103n420342L636665K013703K28843J916275r84382j463318O71158J87836
1547.9F09766541l91350k038002j199684R16214O75888n56908l150826m66194Q85201
1556.5F04440880j177025j0802155l952522P198563L479576J638298K61040q44689
$$ plain form
1496.7 584895744 587192383 588764915 590741081 593132057 595348625 595756874 597620621 598663597
1504.5 598663597 598610535 593304825 589881554 596704025 598594093 600667572 601982765 603124466 603723259
1513.1 603723259 604839172 605467834 605214844 605594902 604944763 607803993 608678322 605492706 604238892
1521.8 604238892 606360588 609603004 610079880 610270844 611601524 613328362 613758240 613956375 614902763
1530.5 614902763 614367752 614372711 611982384 609821968 611708183 612613640 613389511 612912712 608980103
1539.2 608980103 603559761 607196426 609210129 609438972 611355247 610370865 608907547 609578705 609766541
1547.9 609766541 609375191 607337189 606137505 607053719 607729607 607172699 604021873 603555679 604440880
1556.5 604440880 603263855 592461700 588509178 595707741 599187317 600825615 601086655 600241966
1564.2F00241966j761017N09530P58819k55165j171722l249436J165428O58875m71459
1572.9E96425819k10113k0599j623040l157692L601837K193375J59340l54195l79028
1581.6E96635704m50516j064834p09839l95088k97356l33366n06554l13034o78101
1590.3E91887016l25813m86755l97339p97844j260834p20444j273651j205902j522865
1599E83895569p13196n28412p92770o10237r97582n01442j167335j065483j707344
1607.6E75811768j498948j690750j966705n66368j680794j270256j749611o94160j298447
1616.3E63395729n680695J393013k73590o83517j697235j295662k226448l266869P35092
1625E50399818p79151n31388j882858q62808l96004q74672l66898j188163q3618q64182
$$ plain form
1564.2 600241966 598480949 598990479 599749298 599494133 598322411 595072975 596238403 596897278 596425819
1572.9 596425819 596215706 596195107 594572067 591414375 595016212 597209587 597368927 597014732 596635704
1581.6 596635704 596185188 595120354 594410515 594015427 593718071 593384705 592878151 592565117 591887016
1590.3 591887016 591561203 591074448 590677109 589879265 588618431 587897987 586624336 585418434 583895569
1599 583895569 583182373 582653961 581861191 581250954 580253372 579751930 578584595 577519112 575811768
1607.6 575811768 574312820 572622070 570655365 570088997 568408203 567137947 565388336 564694176 563395729
1616.3 563395729 557715034 559108047 558834457 558150940 556453705 555158043 552931595 549664726 550399818
1625 550399818 549620667 549089279 547206421 546343613 545947609 545072937 544706039 543517876 543434258 542570076
1634.6E42570076m092140p96967J115723O89583K90374P35856J14631J004181R2392
1643.3E41723709Q19550Q51745j199760k85187O02417L107300J591911K203484J485710
1652E50900879n130196q92715O148834M743271K540436K535972J726075K001991J481666
1660.7E66056213J426392J673889J192322L603363K812118K466813J853027J241569
1668.4E82325706O30761K738495M105224K293587K990074K725716J549339J538734
1676.1F00897636K971573L042031K061615J851959J909141L358803K933388L204j63650
1684.8F18865700N586662M529877K330131J323929K521515K537155K273865K474403
1692.5F42443237J922303K041702L68576l171768M554977L970108L736801r33227k983170
$$ plain form
1634.6 542570076 538477936 537680969 538796692 539486275 539776649 540512505 540627136 541631317 541723709
1643.3 541723709 542543259 543395004 542195244 541910057 542512474 545619774 547211685 549415169 550900879
1652 550900879 545770683 544877968 551026802 555770073 558310509 560846481 562572556 564574547 566056213
1660.7 566056213 567482605 569156494 570348816 573952179 576764297 579231110 581084137 582325706
1668.4 582325706 582956467 585694962 589800186 592093773 595083847 597809563 599358902 600897636
1676.1 600897636 603869209 606911240 608972855 610824814 612733955 616092758 619026146 619029350 618865700
1684.8 618865700 624452362 628982239 631312370 632636299 635157814 637694969 639968834 642443237
1692.5 642443237 644365540 646407242 646775818 643604050 648159027 652129135 655865936 654932709 651949539
1701.2F51949539M887085K960434P31049j07117J737137O89621J854400K038575N84793
1709.9F67325516N44739J247940J188736J2283j487503q5831K324906o9733k623978
1718.5F68377075M010620K426224J124344P27234N18036K43988N37796N77316P23190
1727.2F79265823P46689P1259l91922P94296K284164J496125k456742q31298L706054
1735.9F84684448K947617Q10776J065750n99594q78983K557144J111603m0283J062164
1744.6F92720642K320328J519546R59473J071396Q80966L006363k4338L86048K981948
1753.3G05822372J880494J637344J040649J66855J820450K461853J570129J660309
1761G18060455k17971O31942K230301N25055N02701O97632N88760j060028J559067
$$ plain form
1701.2 651949539 656836624 659797058 660528107 660420990 662158127 662847748 664702148 666740723 667325516
1709.9 667325516 667870255 669118195 670306931 670319214 668831711 668745880 671070786 671001053 668377075
1718.5 668377075 672387695 674813919 675938263 676665497 677183533 677427521 677965317 678542633 679265823
1727.2 679265823 680012512 680083771 679691849 680486145 682770309 684266434 681809692 680978394 684684448
1735.9 684684448 687632065 688442841 689508591 688908997 688030014 690587158 691698761 691658478 692720642
1744.6 692720642 695040970 696560516 697519989 698591385 699472351 702478714 702454376 702840424 705822372
1753.3 705822372 707702866 709340210 710380859 710547714 712368164 714830017 716400146 718060455
1761 718060455 717842484 718474426 720704727 721229782 721732483 722430115 723018875 721958847 723517914
1769.7G23517914K689819r49936q93097J318970K774582J094894j09863J375656m1885
1778.3G30777054K39410j86615o4239Q89206J059570J149902Q0796Q21533J154785
1787G35921402O78940j8006J41297r46350j082459p49283L76664K376098M86298N70450
1796.7G37755051J713333J195831k21786j030884J233291l99017K34451Q22220j21994
1805.3G41180496J34049j22376M27246J045151J372681m15116O22101J138306k25830
1814G45156708l6392o17066K77557j66702K04315N73731l8452J037597M87976Q59528
1823.7G47738800M98581j320801R6665R02404K66419j499710k042313J093598J783294
1832.3G47516937M39453P61719Q46100J58997k5406P3623R81827m56848l97568n87768
$$ plain form
1769.7 723517914 726207733 725257797 724364700 725683670 728458252 729553146 729443283 730818939 730777054
1778.3 730777054 731016464 730829849 730765610 731654816 732714386 733864288 733945084 734766617 735921402
1787 735921402 736600342 736582336 736723633 735777283 734694824 733945541 734322205 736698303 737184601 737755051
1796.7 737755051 739468384 740664215 740442429 739411545 740644836 740245819 740480270 741302490 741180496
1805.3 741180496 741314545 741192169 741619415 742664566 744037247 743622131 744244232 745382538 745156708
1814 745156708 745120316 744503250 744780807 744614105 744818420 745392151 745353699 746391296 746879272 747738800
1823.7 747738800 748237381 746916580 747013245 747915649 748182068 746682358 744640045 745733643 747516937
1832.3 747516937 747956390 748718109 749564209 749723206 749697800 749771423 750753250 750296402 749898834 749311066
1842G49311066k80686n56640k985764K406845J919174Q89054M00924N47028O95496
1850.7G52346497m41895K670o56662j71508k89307o18439K34757K80151O24771K74735
1860.3G51585770R80529K85950R1324J24130m78439J4954r16062k89917j276703o65054
1869.9G49456482J215897J073989J182709O27442Q29696N5466k23389l62854m4403
1878.6G53811035J85471n25894J06201m64173r079J64719M12750J003266M11148J012878
1888.3G56108322J4725r34525K88163M14123n49927o23550m27857k97088J045380L45916
1897.9G55383682K50016O19735M74015K52609k1973L09143q22983o22024l30734m60968
1907.6G55030518l19291l38287J21079O32247J610413L04566L16390L00980n49698
$$ plain form
1842 749311066 749030380 748473740 745487976 747894821 749813995 750703049 751103973 751651001 752346497
1850.7 752346497 751904602 751907272 751250610 751079102 750789795 750171356 750406113 750686264 751311035 751585770
1860.3 751585770 752566299 752852249 752943573 753067703 752589264 752604218 751688156 751398239 750121536 749456482
1869.9 749456482 750672379 751746368 752929077 753556519 754386215 754441681 754218292 753855438 753811035
1878.6 753811035 753996506 753470612 753576813 753112640 753103561 753268280 753681030 754684296 755095444 756108322
1888.3 756108322 756123047 755188522 755476685 755890808 755340881 754717331 754289474 753992386 755037766 755383682
1897.9 755383682 755633698 756253433 756727448 756980057 756958084 757267227 756444244 755822220 755491486 755030518
1907.6 755030518 754711227 754372940 754494019 755126266 756736679 757041245 757357635 757658615 757108917
1916.2G57108917L31192j444092o50177J11542k56729J3046m40673O45141J324997
1924.9G56743164J137085K50855K34832l34549n17196k50473p95441m59137l95126
1933.6G55614014Q9035M6844O28739Q63189N50614Q01239k3346K62375j147538j788253
1943.2G55896912K60467J57623k00958l29437M28467L43704Q39767J063309O13861
1951.9G59073715l1280p04880p9269m00391j97830n90210m85840J35651j80588P25174
1961.6G57264252P04956P94983M48074J96381p248o61621r6894k79998k89078o81381
1971.2G57392426l58811J54419L81699Q96759O00204O76346J56174K99377j92413p91931
1980.8G59214249l83454m85687j59607n76935j95999K97623N56869P16706L73764O48803
$$ plain form
1916.2 757108917 757440109 755996017 755345840 755457382 755200653 755213699 754773026 755418167 756743164
1924.9 756743164 757880249 758131104 758365936 758031387 757514191 757263718 756468277 756009140 755614014
1933.6 755614014 755703049 755749893 756378632 757241821 757792435 758593674 758570328 758832703 757685165 755896912
1943.2 755896912 756157379 756315002 756114044 755784607 756213074 756556778 757396545 758459854 759073715
1951.9 759073715 759042435 758337555 758258286 757857895 757660065 757069855 756584015 756719666 756539078 757264252
1961.6 757264252 757969208 758764191 759212265 759408646 759401398 758739777 758642883 758362885 758073807 757392426
1971.2 757392426 757033615 757188034 757569733 758466492 759066696 759743042 759899216 760198593 760006180 759214249
1980.8 759214249 758830795 758345108 758185501 757608566 757412567 757710190 758267059 758983765 759357529 760006332
1990.5G60006332k61612n90057j11847k58026o44379n16357q3084j80283L77121M08020
2000.1G58145828L82462M24042N17883K03628k77710J17798m13513q71735q78524r5673
2009.8G57254486K4719l26309K56882L83529P19529K40783l67965q62046j22909L88260
2019.4G57588959r15070q60138n77316k15454j34354K93350N54352R1019J92108k48413
2029.1G55769043L25546o0653p03736p43332r06906k63061l20053J06277p3013l3722
2038.7G53096390L93219M61654L94974n3100K25601q61054p80563m73709p15866j82190
2048.4G51505356l46070J83182J63040N83954M87519J16043M63562K3651j20239p26929
2058G52333069l66287k92511m16108o4621j36261L47062K64511N90744P08618P68509
$$ plain form
1990.5 760006332 759744720 759154663 759042816 758784790 758140411 757624054 757540970 757360687 757737808 758145828
2000.1 758145828 758528290 758952332 759470215 759673843 759396133 759513931 759100418 758228683 757350159 757254486
2009.8 757254486 757279205 756952896 757209778 757593307 758312836 758553619 758185654 757323608 757200699 757588959
2019.4 757588959 756673889 755813751 755236435 755020981 754886627 755179977 755734329 755825348 756017456 755769043
2029.1 755769043 756094589 756033936 755330200 754586868 753679962 753416901 753096848 753203125 753130112 753096390
2038.7 753096390 753489609 753951263 754346237 754293137 754518738 753657684 752877121 752403412 751687546 751505356
2048.4 751505356 751159286 751342468 751505508 752089462 752576981 752693024 753156586 753180237 753059998 752333069
2058 752333069 751966782 751674271 751258163 751193542 751057281 751404343 751668854 752259598 752968216 753736725
2067.6G53736725K82287m71725p40433r54666L0747l56141m56008m5014R4605R28268
2077.3G52048645P87506O42929L63465K19574l02124m75388o29044j081924l18298
2086G51255341r6360J88675O5537J76315O97250O29502N48858L75977M27551m95529
2095.6G53773117n05981l71018o04324m28848m43573L78341N86624Q26950O23169N58854
2105.2G54393311M24423l93601j93023k60163k46582r55353n65109J10474j20316N78614
2114.9G52772675N10940Q68683P96356M99954j02157q00171l73077m02527l53470q14362
2124.5G52602844l23410j19705J8845R48181P36923J097259O44761K38952j71814r89456
2134.2G54683380p37686m30679k65046m24346n875K57416P26089O83136L20358P38984
$$ plain form
2067.6 753736725 754019012 753547287 752806854 751852188 751882935 751526794 751070786 751025772 751120377 752048645
2077.3 752048645 752836151 753479080 753842545 754062119 753759995 753284607 752655563 751573639 751255341
2086 751255341 751158981 751347656 751413193 751589508 752286758 752916260 753465118 753841095 754268646 753773117
2095.6 753773117 753267136 752896118 752291794 751862946 751419373 751797714 752384338 753211288 753834457 754393311
2105.2 754393311 754817734 754424133 754231110 753970947 753724365 752769012 752203903 752314377 752194061 752772675
2114.9 752772675 753283615 754152298 754948654 755448608 755346451 754546280 754173203 753770676 753417206 752602844
2124.5 752602844 752279434 752159729 752178574 753126755 753863678 754960937 755605698 755844650 755672836 754683380
2134.2 754683380 753945694 753515015 753249969 752825623 752819748 753077164 753803253 754486389 754806747 755545731
2143.8G55545731K32315j80436p30667o78100o42624n57480J14594j3276K38724L94974
2153.5G53723755J019897R75495L81927Q3466m41056j65176l80020o54221q34426j20240
2163.1G53589401L69721K48108P40966N87769Q64868P20978N94711N4245n84793l00293
2172.8G56885681n09033j87302n27496k80228O35453R47494P81555M78821R18045K51083
2182.4G59394073L7308J36948j61286l57894o58875n56641k43301N74799M30755Q07801
2192G59403687P59429J41678N60150J97602K55279j25580k57415l87039p03812j3733
2201.7G59830246L36456M14276M1352Q70895J007233M13971N52444q0566l02963n77698
2211.3G62505646m83017k94266L1128P2250j63574L08304N17120P80945M78897O87485
$$ plain form
2143.8 755545731 755778046 755597610 754866943 754188843 753546219 752988739 753103333 753090057 753328781 753723755
2153.5 753723755 754743652 755719147 756101074 756184540 755743484 755578308 755198288 754544067 753709641 753589401
2163.1 753589401 753959122 754207230 754948196 755535965 756400833 757121811 757716522 757770767 757185974 756885681
2172.8 756885681 756376648 756189346 755661850 755381622 756017075 756964569 757746124 758224945 759142990 759394073
2182.4 759394073 759431381 759568329 759407043 759049149 758390274 757833633 757590332 758165131 758595886 759403687
2192 759403687 760163116 760304794 760864944 761062546 761317825 761192245 760934830 760547791 759843979 759830246
2201.7 759830246 760166702 760580978 760622330 761493225 762500458 762914429 763466873 763386307 763083344 762505646
2211.3 762505646 762022629 761728363 761759491 761831741 761668167 761976471 762493591 763274536 763753433 764440918
2221G64440918K54517l42179j24130o42319m20379m99192L281m6539l815J257553P91397
2231.6G64669113N62058N37948L26081l31192o35376j84708o00510o46057k47650K14615
2241.2G63664322P2861O06460J050263M42733L03269k5788p4539J10474p8735j203309
2250.9G64868011j067810j50222r5292K90223R0713M87900P61795Q82874O13250k17056
2260.5G66464386l17993p58133o09055p21359m40903k87475k1363R07670O37130P16553
2270.2G65569458N49088O34994J92795l27377l22571q80204n09719m45252L2730J8997
2279.8G64512939K67792N90286L92075J025925M55169K47727m28009q02765p85675
2288.5G65475464j033783o09284j030349j64719K8000O90689J133652O20041K53601
$$ plain form
2221 764440918 764695435 764353256 764229126 763586807 763166428 762667236 762670517 762623978 762620163 763877716 764669113
2231.6 764669113 765231171 765769119 766095200 765764008 765128632 764943924 764343414 763697357 763449707 763664322
2241.2 763664322 763737183 764343643 765393906 765836639 766139908 766114120 766039581 766150055 766071320 764868011
2250.9 764868011 763800201 763649979 763554687 763844910 763935623 764423523 765185318 766068192 766681442 766464386
2260.5 766464386 766146393 765388260 764779205 764057846 763616943 763329468 763308105 764215775 764852905 765569458
2270.2 765569458 766118546 766753540 766946335 766618958 766296387 765416183 764906464 764461212 764493942 764512939
2279.8 764512939 764780731 765371017 765763092 766789017 767244186 767491913 767063904 766261139 765475464
2288.5 765475464 764441681 763832397 762802048 762637329 762665329 763356018 764489670 765109711 765363312
2297.2G65363312q48770m0436j251297j673126q65937j302566m70658m02755M04892
2305.8G58912659k34757p1335N32380j62430j94855j055298n68390r22775q95004j433487
2315.5G53906708j302185k41165j665574m85534m50135l15475J67770n65795n10026
2324.2G48538589p18002j188202k324447j257325k263412q15811J086578O41098J757660
2332.8G43456726K32849P61948j259842j421509l00064j583481j090393j956558K47269
2341.5G37086945k04087L7995Q85467J014710K633667L229293M691315O18439l298569
2350.2G46695175k992325l184890l472062k513351k448425k484589j99432r79538o91834
2358.9G27728729Q76389N13840R73510r16214N4245m24423l69568R61991J474685K536164
$$ plain form
2297.2 765363312 764514542 764474106 763222809 761549683 760683746 759381180 758910522 758507767 758912659
2305.8 758912659 758677902 758606567 759138947 758976517 758781662 757726364 757157974 756235199 755340195 753906708
2315.5 753906708 752604523 752363358 750697784 750212250 749762115 749446640 749614410 749048615 748538589
2324.2 748538589 747820587 746632385 744307938 743050613 740787201 739971390 741057968 741699066 743456726
2332.8 743456726 743689575 744451523 743191681 741770172 741470108 739886627 738796234 736839676 737086945
2341.5 737086945 736882858 736920853 737806320 738821030 741454697 744683990 749375305 749993744 746695175
2350.2 746695175 743702850 740517960 737045898 734532547 732084122 729599533 729400101 728420563 727728729
2358.9 727728729 728605118 729118958 730092468 729176254 729230499 728806076 728436508 729398499 730873184 733409348
2368.5G33409348J836013K625351K947617K643814J884994J607132J073914O53534
2376.2G48681717Q27331J5107M08859P06482J514435J987381J833496J708832Q57238
2384.9G58540878Q46100R7504k02713j39313q24432q32901l12119k9220m85077L2119
2394.6G56690826K13395M45861P13730K37808M05961k62070q40225j109238q55408
2403.2G55640640p02591n84869O8512M8828O14166O63605P10220K20642o03332k48718
2412.9G55827103n53589j030121j081238o19430p83310k93808M01382M17481N73349
2421.6G52857819m18244p9040J98364j78070m19388p72629o26678j122284n52673k38648
2431.2G48648529k289M1733k82745L58734J19934J42059j82800l10745o40793j399460
$$ plain form
2368.5 733409348 735245361 737870712 740818329 743462143 745347137 746954269 748028183 748681717
2376.2 748681717 749509048 749524155 749933014 750639496 752153931 754141312 755974808 757683640 758540878
2384.9 758540878 759386978 759484482 759281769 759142456 758318024 757485123 757173004 757143784 756658707 756690826
2394.6 756690826 756904221 757350082 758063812 758301620 758707581 758445511 757605286 756496048 755640640
2403.2 755640640 754938049 754353180 754421692 754470520 755084686 755748291 756458511 756679153 756075821 755827103
2412.9 755827103 755273514 754243393 753162155 752542725 751759415 751465607 751866989 752284470 752857819
2421.6 752857819 752439575 752360535 752558899 752380829 751961441 751188812 750562134 749439850 748887177 748648529
2431.2 748648529 748646240 748687973 748405228 748763962 748883896 749025955 748843155 748532410 747891617 746492157
2440.8G46492157p51266m37775n02091k77557L53546j40610P172N18723j30005J754
2450.5G45134048p92236r54895r02405q12454k94113o79779q316P2021Q774L25318
2460.1G41095963J29776J30004J44806l35388j077041q09784r06449j133575p07627
2468.8G36530685J12153J95922q4533O20956K89002m6692l09143m17328l06778p50885
2478.5G35833359q76923j118316l63083m0741p3090J90735K12631M32358j05515j53122
2488.1G33938293m57992o52619o16989p53936m91028p35169j0528L67202L6316Q622
2497.7G30632172J85394K89535n01632n17121k8762j54572r27963j017075k27814k9907
2507.4G27702255j02005O6681L65677K83432L85437k3727l97263m03442q04291o26450
$$ plain form
2440.8 746492157 745740891 745303116 744801025 744523468 744877014 744736404 744743576 745262299 745132294 745134048
2450.5 745134048 744341812 743386917 742484512 741672058 741377945 740698166 740689850 740761871 740770645 741095963
2460.1 741095963 741225739 741355743 741500549 741165161 740088120 739278336 738371887 737238312 736530685
2468.8 736530685 736642838 736838760 736754227 737375183 737664185 737617493 737308350 736891022 736584244 735833359
2478.5 735833359 734956436 733838120 733475037 733434296 733361206 733551941 733764572 734196930 734091415 733938293
2488.1 733938293 733480301 732827682 732210693 731456757 730965729 730230560 730220032 730587234 730623550 730632172
2497.7 730632172 730817566 731107101 730605469 730088348 730059586 729905014 728977051 727959976 727732162 727702255
2507.4 727702255 727600250 727666931 728032608 728316040 728701477 728677750 728280487 727877045 727072754 726446304
2517G26446304m29916k82059o51169k47345J98594k53373M66004M41742j80741l84903
2526.7G25123138l00750p39899j091614n32379n19256k59324m41436j60523L20969
2535.4G21398926K78320K70157n53436l22342k61078r00345r92203l71322j68991n70069
2545G17807617j7319j82418K7008J97525k66495l11813m30603k13166o97708n61752
2554.6G15350876l50571o85577n47257m31671j77688n8976M60892J37177m55552m12445
2564.3G12829208m18014l77350o23169l77121l48663n20783o41784k13318L18908j00326
2573.9G09527588j31760o5078j60065o39649p39059m40292j79902j58462o58875m82101
2583.6G05872345n66177j7472K65656j42746r5062m46091k58942m17633q2016j21612
$$ plain form
2517 726446304 726016388 725734329 725083160 724835815 725034409 724781036 725247040 725688782 725508041 725123138
2526.7 725123138 724822388 724082489 722990875 722458496 721939240 721679916 721238480 721077957 721398926
2535.4 721398926 721677246 721947403 721393967 721071625 720810547 719910202 718917999 718546677 718377686 717807617
2545 717807617 717790298 717607880 717634888 717832413 717565918 717254105 716823502 716610336 715912628 715350876
2554.6 715350876 715000305 714314728 713767471 713335800 713158112 713099136 713560028 713697205 713241653 712829208
2564.3 712829208 712411194 712033844 711410675 711033554 710684891 710164108 709522324 709309006 709627914 709527588
2573.9 709527588 709395828 709330750 709170685 708531036 707791977 707351685 707171783 707013321 706354446 705872345
2583.6 705872345 705306168 705288696 705554352 705411606 705316544 704870453 704611511 704193878 704111862 703990250
2593.2G03990250p20368n77621o25534k37122l91006J55258K61383p2708J43356o15158
2602.9G01310730k68784k99148n77927m76455o40793m34800k76107R5215k12021l64762
2612.5F97855148o18896m06571K88468l27759p82623q98972o67267l56750j70441j29089
2622.1F93785248k89231o38198o69480j47171o19201m26178l05558p26394k83051l44849
2631.8F89335937o78100q58536n83954p05948o43539k75879k26822j35040o07376m63181
2641.4F84157562r03702j174850m20761k82440l32642q31756p91550m07944k78473
2650.1F78733444k93579j51977l00370q50601j95541l47824j221848r63974k86865
2658.8F74120865l93524o46286k95105l47596l6468l01819p54700p44857q86917n31617
$$ plain form
2593.2 703990250 703269882 702692261 702066727 701829605 701438599 701593857 701855240 701782532 701925888 701310730
2602.9 701310730 701041946 700742798 700164871 699688416 699047623 698612823 698336716 698431931 698219910 697855148
2612.5 697855148 697236252 696829681 697118149 696790390 696007767 695108795 694441528 694084778 693914337 693785248
2622.1 693785248 693496017 692857819 692188339 692041168 691421967 690995789 690690231 689963837 689680786 689335937
2631.8 689335937 688657837 687799301 687215347 686509399 685865860 685589981 685363159 685228119 684620743 684157562
2641.4 684157562 683253860 682079010 681658249 681375809 681043167 680211411 679419861 679011917 678733444
2650.1 678733444 678439865 678287888 677987518 677136917 676941376 676593552 675371704 674407730 674120865
2658.8 674120865 673727341 673081055 672785950 672438354 672401886 672100067 671345367 670600510 669713593 669181976
2668.4F69181976m62570k80304o13937p44095k64740k86865j75553k31399j52283m89426
2678.1F65480804m19540r0103p78351r90448q10394m91410j32141k72140o04706l14026
2687.7F60577545o3858k52838m37546q08410m85459j59302k39563m64477o86112n25817
2697.4F56454163n66330o06079l36457j80206p65762o11725l31803o53610l57895o97174
2707F51347122p41119l16773j78909o87027j096649l04642k20260k19803n01557q62426
2716.6F46217957l87650l23410l91769m18396j69602l00293m86984m33884m90646k94876
2726.3F42520447n70297q06962o85272k79541j64032n17349m78706M3945J51825m77333
2735.9F38736725l80478m42581o29273j43089m4441k45247n13268n71251m20227N0660
$$ plain form
2668.4 669181976 668719406 668439102 667825165 667081070 666816330 666529465 666353912 666122513 665970230 665480804
2678.1 665480804 665061264 664971161 664192810 663202362 662391968 661900558 661768417 661496277 660891571 660577545
2687.7 660577545 660513687 660260849 659823303 659014893 658529434 658370132 658130569 657666092 656979980 656454163
2697.4 656454163 655887833 655281754 654945297 654765091 653999329 653387604 653055801 652402191 652044296 651347122
2707 651347122 650606003 650289230 650110321 649423294 648326645 648022003 647801743 647581940 647080383 646217957
2716.6 646217957 645830307 645506897 645115128 644696732 644527130 644226837 643739853 643305969 642815323 642520447
2726.3 642520447 641950150 641143188 640457916 640178375 640014343 639496994 639018288 639062233 639214058 638736725
2735.9 638736725 638356247 637913666 637284393 637141304 637096863 636851616 636338348 635767097 635346870 635397530
2745.6F35397530p2022n12047l82805n16090n31425l99590j85699l49045o84052m45175
2755.2F31319580j72462l77388m30413k6931l17955j40152j04638o26373m05578m54445
2764.9F28263245m60968k65236P5264k64206m90685j94664l91655j07650n06058o64520
2774.5F24992867l70141n43861m47311m83895l39126j47286k02484p69844l68423j41106
2784.2F21179390r72557n49812j71891m38232r51004m57039j04065r03053q89015o99997
2793.8F15042725o18592r23576n08156j55144m42161m63524r36470p31239q98323j027832
2803.4F08337708j047707r23157k69737o91109p70035r09996q69712o58226o57082
2812.1F01540947p66335j417541j211472j190796j003227r09652q27561m78439j033974
$$ plain form
2745.6 635397530 635325508 634813461 634430656 633914566 633383141 632983551 632797852 632448807 631764755 631319580
2755.2 631319580 631147118 630769730 630339317 630312386 629994431 629854279 629749641 629123268 628717690 628263245
2764.9 628263245 627802277 627537041 627612305 627348099 626857414 626662750 626271095 626163445 625657387 624992867
2774.5 624992867 624622726 624078865 623631554 623147659 622808533 622661247 622458763 621688919 621320496 621179390
2784.2 621179390 620206833 619657021 619485130 619046898 618095894 617638855 617534790 616631737 615742722 615042725
2793.8 615042725 614424133 613500557 612992401 612837257 612395096 611931572 610995102 610263863 609365540 608337708
2803.4 608337708 607290001 606366844 606097107 605405998 604635963 603725967 602856255 602198029 601540947
2812.1 601540947 600774612 599357071 598145599 596954803 595951576 595041924 594214363 593735924 592701950
2820.8E92701950j006050q56247o30760r06182j186180j160125j819649j499252r92203
2829.5E82645302n43022p65038j334038j315193j374092r46960j073609j074905j215859
2838.2E73002586j839485j970367k080727j687317j547012j463547j334266j658745
2845.9E59421120j735459j996269k574882k468415j477623j203460j703720j462861
2853.6E44798431p75222r42955j034584o49682r57183r38149n23605o86226j559334
2862.3E36731491j665344j025925j212540j557388k148742k062760j496010j580505
2870E23982277j813736k207642k077980k137069k382508k213859k071190k092819k279663
2878.7E04705811k058182j682549j295891j280784j440354j352920j207428q09250
$$ plain form
2820.8 592701950 591695900 590839653 590208893 589302711 588116531 586956406 585136757 583637505 582645302
2829.5 582645302 582102280 581337242 580003204 578688011 577313919 576366959 575293350 574218445 573002586
2838.2 573002586 571163101 569192734 567112007 565424690 563877678 562414131 561079865 559421120
2845.9 559421120 557685661 555689392 553114510 550646095 549168472 547965012 546261292 544798431
2853.6 544798431 544023209 543080254 542045670 541395988 540438805 539500656 538977051 538290825 536731491
2862.3 536731491 535066147 534040222 532827682 531270294 529121552 527058792 525562782 523982277
2870 523982277 522168541 519960899 517882919 515745850 513363342 511149483 509078293 506985474 504705811
2878.7 504705811 502647629 500965080 499669189 498388405 496948051 495595131 494387703 493578453
2886.4D93578453q88481r42459p24335p92656q40301n54085k86484j26381K22778k60047
2896D88386002n21851k94113l26996l49770r32922q57277n83229p89223o89773l96958
2905.7D82643890n19065j135064o90841m49601j165924j562309j492309j202164j844978
2914.3D72581635k270585j672782j661225k095184j966820j654205j649857j389847
2922.1D58221130j124725j000862q47473r94873q80738l12538r5787m52728o95458
2930.7D51815948K36397J351700J016579Q87451J290970J559486J877442J768226K215271
2939.4D64019470K434731K190628K497711K354469J792488J961556K514381K295532
2947.1D82060966K341156K559968K557182K782669K545929K391891K135811J661682
$$ plain form
2886.4 493578453 492689972 491747513 491023178 490230522 489390221 488836136 488549652 488423271 488646049 488386002
2896 488386002 487864151 487570038 487243042 486893272 485960350 485103073 484519844 483730621 483040848 482643890
2905.7 482643890 482124825 480989761 480298920 479849319 478683395 477121086 475628777 474426613 472581635
2914.3 472581635 470311050 468638268 466977043 464881859 462915039 461260834 459610977 458221130
2922.1 458221130 457096405 456095543 455248070 454253197 453372459 453059921 452964134 452511406 451815948
2930.7 451815948 452052345 453404045 454420624 455308075 456599045 458158531 460035973 461804199 464019470
2939.4 464019470 466454201 468644829 471142540 473497009 475289497 477251053 479765434 482060966
2947.1 482060966 484402122 486962090 489519272 492301941 494847870 497239761 499375572 501037254
2954.8E01037254J711350K341385K622146K385674K015343J582374K335167K725220
2962.6E18755913J555481J155395J701241J212044Q35838J445656J436310J604080
2970.3E29701958J849212J677819J296959J185607J315651J270562J808204J437989
2978E41543961J279754J626930J173516J076240R69467J229554J203994J153336J379662
2986.7E52636414J451301J544266R40857O36749N88913O71501L90282L82080O83517
2995.3E59925880J31302M45023P29217O75545M44451J16920P3471j24626L09219j5869
3005E62710533m93240l17536k68135k18963k40021Q011j5221j56135p30858j299439
3014.6E58978996j018753m54826n21774j138192q61740n72624q61397r76295m33121
$$ plain form
2954.8 501037254 502748604 505089989 507712135 510097809 512113152 513695526 516030693 518755913
2962.6 518755913 520311394 521466789 523168030 524380074 525215912 526661568 528097878 529701958
2970.3 529701958 531551170 533228989 534525948 535711555 537027206 538297768 540105972 541543961
2978 541543961 542823715 544450645 545624161 546700401 547669868 548899422 550103416 551256752 552636414
2986.7 552636414 554087715 555631981 556572838 557209587 557798500 558470001 558860283 559242363 559925880
2995.3 559925880 560057182 560502205 561231422 561906967 562351418 562468338 562541809 562417183 562726402 562710533
3005 562710533 562217293 561899757 561631622 561412659 561172638 561180649 561165428 561009293 560278435 558978996
3014.6 558978996 557960243 557505417 556983643 555845451 554983711 554411087 553549690 552573395 552140274
3023.3E52140274j86958j016846j123848o42700o17371r52263r03167q01621j100960
3032E44794540j231308j405067r72519n63049p86858r72366j004715j016579r14116
3040.7E35927963p41043j080818j535034j663780r01947n11551p97272q69827j336212
3049.4E26490479j148797j159133j337739j251640j088066r11560j578751j290664
3057.1E16724129j068535r12590n37224j139297j120186j120148j105843j168022j114731
3065.7E07437553p03811j179199j409607r75533q93936j400261j355476j111260p74422
3074.4D97634048n63736j172370j123696j125603j161537j037559j142578r41964r79804
3083.1D88385201j081124j167793r23844q56018r77363j119995j340294r91707j302910
$$ plain form
3023.3 552140274 551953316 550936470 549812622 549169922 548552551 547600288 546697121 545895500 544794540
3032 544794540 543563232 542158165 541185646 540622597 539835739 538863373 537858658 536842079 535927963
3040.7 535927963 535186920 534106102 532571068 530907288 530005341 529493790 528696518 527826691 526490479
3049.4 526490479 525341682 524182549 522844810 521593170 520505104 519593544 518014793 516724129
3057.1 516724129 515655594 514743004 514205780 513066483 511946297 510826149 509720306 508552284 507437553
3065.7 507437553 506733742 505554543 504144936 503169403 502275467 500875206 499519730 498408470 497634048
3074.4 497634048 497070312 495897942 494774246 493648643 492487106 491449547 490306969 489365005 488385201
3083.1 488385201 487304077 486136284 485212440 484356422 483379059 482259064 480918770 479927063 478624153
3091.8D78624153j488609j154671j231651j022873j062851j119652l99971k37045r38378
3100.5D69968452j385002j449470r23920r65729j370735j183967j262360r53674r32274
3109.1D59541321j355057j125488n78346o08483q85124j094971j869011j192970p40471
3117.8D50091400j364899j192016j163216o49986q04977j346283j231537j170159r73243
3126.5D40195084j119118r18694r57679r00994p97767j322327j420784j364822j178742
3135.2D30214157r57489n14336m60357q95806j067428j370430j407585j410942j116104
3143.9D21013680n55001r78317j592979j157647r67865p11364o9848q04443j464195
3152.5D12712021j556587j090241q25195j348457q08907p18575r38606q88481j006508
$$ plain form
3091.8 478624153 477135544 475980873 474749222 473726349 472663498 471543846 471143875 470906830 469968452
3100.5 469968452 468583450 467133980 466210060 465244331 463873596 462689629 461427269 460473595 459541321
3109.1 459541321 458186264 457060776 456482430 455873947 454988823 453893852 452024841 450831871 450091400
3117.8 450091400 448726501 447534485 446371269 445721283 444916306 443570023 442338486 441168327 440195084
3126.5 440195084 439075966 438157272 437199593 436298599 435500832 434178505 432757721 431392899 430214157
3135.2 430214157 429256668 428742332 428281975 427386169 426318741 424948311 423540726 422129784 421013680
3143.9 421013680 420458679 419480362 417887383 416729736 415761871 415050507 414980659 414176216 412712021
3152.5 412712021 411155434 410065193 409239998 407891541 407082634 406364059 405425453 404536972 403530464
3161.2D03530464q76961j090889j123542o25115l40156j078911j223488j139565j435127
3169.9C94596710p81555m29153p34063j320533r43108o80122q85125o59332j415634
3178.6C86748085j229210o27861p55272j050911r93690m79279p21016o63566p45049
3187.3C79482231j043548p99370n45311r91287j166153n40390q45261p77474q10165
3195.9C71963272j108551j003036o06652j16882q62312n97763r04808j489525n03769
3204.6C64769974n46875o84128n19791k75383j024399j313323k41356n91584r41848
3213.3C58631287o58875k44141o31675j091271n79376n52559q65669q41217m19808
3222C52746696o21910r10759o65054l54538l27530o79512o85997m43573j64528p46879
$$ plain form
3161.2 403530464 402653503 401562614 400439072 399813957 399473801 398394890 397171402 396031837 394596710
3169.9 394596710 393815155 393386002 392651939 391331406 390388298 389708176 388823051 388163719 386748085
3178.6 386748085 385518875 384891014 384135742 383084831 382091141 381611862 380890846 380227280 379482231
3187.3 379482231 378438683 377639313 377094002 376102715 374936562 374396172 373550911 372773437 371963272
3195.9 371963272 370854721 369851685 369245033 369128151 368265839 367668076 366763268 365273743 364769974
3204.6 364769974 364223099 363538971 363019180 362743797 361719398 360406075 360164719 359573135 358631287
3213.3 358631287 357972412 357728271 357096596 356005325 355425949 354873390 354007721 353166504 352746696
3222 352746696 352124786 351214027 350548973 350194435 349866905 349187393 348501396 348057823 347893295 347146416
3231.6C47146416p01599l88756j021500q12492o30417l63655n08309p80448o52390
3240.3C41286850q63724m28924j04637j01433n71709q35152p14225n09148k93999q89663
3249.9C35974236m17595j94207p07969n88532m79774k31323n20783o07414l90892n68543
3259.6C31267204n07889l13568n97038o79016n05333m82445o0501m75693n34286j32332
3269.2C26979103o44493o90575l27377o4163m94194n69115m88167n73806M997p3853
3278.9C23058357k62451k96173l10402p78809q37249J69029P2784p02095r33494l98846
3288.5C18780651j46255m7589j35898n99499l73116m42924j68285j96324q80299q13808
3298.2C14976654n84335k09389K12898P8850m49772k83127l17497o18706k85968j52474
$$ plain form
3231.6 347146416 346444817 346056061 345034561 344222069 343591652 343227997 342719688 341939240 341286850
3240.3 341286850 340423126 339994202 339889565 339788132 339216423 338381271 337667046 337157898 336863899 335974236
3249.9 335974236 335556641 335362434 334654465 334065933 333586159 333354836 332834053 332226639 331835747 331267204
3259.6 331267204 330759315 330445747 329848709 329169693 328664360 328181915 328121414 327645721 327111435 326979103
3269.2 326979103 326334610 325644035 325316658 325252495 324758301 324189186 323701019 323127213 323132210 323058357
3278.9 323058357 322795906 322499733 322189331 321410522 320573273 320742302 320815086 320112991 319179497 318780651
3288.5 318780651 318634396 318586807 318450909 317851410 317478294 317035370 316867085 316670761 315790462 314976654
3298.2 314976654 314392319 314182930 314395828 314474678 314024906 313741779 313424282 312805576 312519608 312367134
3307.8C12367134n22900q72249m04644k72751l3798k84519q21057l57456o06842j33991
3317.4C08056927k40555p33147n09033o71730R2888k27814o02760j83106j9531k54650
3327.1C04707489j124554o58645j10283k39506p91817m91409K77939l62358m63486
3335.8C00743370o19717m67224j19476p29713n23015j77421n89180q77209k97928J99089
3345.4B96541576j99852n48400m36230j79405j38531n31712m72831j99891p11155o35147
3355.1B92488422o61411o39553L45497K00806n78137q67023p74632m44812O9446p3089
3364.7B89065514o10714m84486l55606j48945m75140n69953l12233k23790k26020o21701
3374.3B85036926k50301m34284k32983K83547l75748k91729n4436l39794q26206k68765
$$ plain form
3307.8 312367134 311844234 310971985 310567341 310294590 310260792 309976273 309155216 308797760 308190918 308056927
3317.4 308056927 307816372 307083225 306574192 305902462 305995350 305767536 305164776 304981670 304962139 304707489
3327.1 304707489 303582935 302924290 302814007 302574501 301782684 301291275 301569214 301206856 300743370
3335.8 300743370 300123653 299656429 299536953 298807240 298284225 298106804 297517624 296640415 296342487 296541576
3345.4 296541576 296341724 295793324 295357094 295177689 295039158 294507446 294034615 293834724 293123569 292488422
3355.1 292488422 291827011 291187458 291532955 291733761 291155624 290288601 289513969 289069157 289138603 289065514
3364.7 289065514 288454800 287970314 287614708 287465763 286990623 286420670 286108437 285884647 285658627 285036926
3374.3 285036926 284786625 284352341 284119358 284402905 284027157 283735428 283680992 283341198 282514992 282246227
3384B82246227o3991m92344N2395q7014k20909m35924j54228J98040m37413m12597
3393.6B80192242k3518J47553k84596l32813l42140k14558M21295K16580j27068m25606
3403.3B79227371j38645J07555J67866l04012n28374M11434l46889m26140K98023l7994
3412.9B78430195J12514N1651k80628m82368p8717M66576K43397n56526J21212J168270
3422.6B79195576L42884l51906p23400j49632N99099P01370L04184p38278r0522M47254
3432.2B79536629n9338L5019M83246L61252j70040M5299J56117J00917l08780Q9283
3441.8B80269604R29546L17116L16181O95076K78530j60217M72088L76339L22609J086406
3451.5B84903278M14658j54800J74198N74035O25973L71819Q9931J34049Q42361O96297
$$ plain form
3384 282246227 282182236 281689892 281742287 281655273 281434364 280998440 280844212 281042252 280604839 280192242
3393.6 280192242 280168724 280316277 280031681 279698868 279356728 279142170 279563465 279780045 279652977 279227371
3403.3 279227371 279088726 279196281 279364147 279060135 278531761 278943195 278596306 278170166 278468189 278430195
3412.9 278430195 278542709 278594360 278313732 277831364 277752647 278219223 278462620 277906094 278027306 279195576
3422.6 279195576 279538460 279186554 278463154 278313522 278912621 279613991 279918175 279179897 279089375 279536629
3432.2 279536629 279477291 279512310 279995556 280356808 280186768 280232067 280388184 280489101 280180321 280269604
3441.8 280269604 281199150 281516266 281832447 282527523 282806053 282645836 283117924 283494263 283816872 284903278
3451.5 284903278 285317936 285163136 285337334 285911369 286537342 286909161 286999092 287133141 287975502 288671799
3461.1B88671799o5651k41738R18522J123371M38939O98471L04603L94325M40884K47078
3470.8B92930603L47595M39244P88250K98347L09620P52773Q39596K61955J53504Q52585
3480.4B97974072P99255O68335J38149P13177N42793j4553R04369N97268Q73680R74540
3490.1C04171085P31316Q78334K54612N89619J013107L67203L8299O61564J007786
3498.7C09712925R06296M76131P63264J032314R5635N90248R51042Q59528O26049O57367
3508.4C16670799P93858L1242M18759O21738J305046J339779M39453N37033O26679
3517.1C22784386R07058M02260O53610J381646J222648M88625k80228J156960J721725
3525.7C30438690J032067M86297P06024Q80623P92122N63355K90031Q88672O83174
$$ plain form
3461.1 288671799 288606148 288364410 289282932 290406303 290845242 291543713 291848316 292242641 292683525 292930603
3470.8 292930603 293278198 293717442 294505692 294804039 295113659 295866432 296706028 296967983 297121487 297974072
3480.4 297974072 298773327 299441662 299579811 300292988 300835781 300821228 301725597 302322865 303196545 304171085
3490.1 304171085 304902401 305780735 306035347 306624966 307638073 308005276 308043575 308705139 309712925
3498.7 309712925 310619221 311095352 311858616 312890930 312986565 313576813 314527855 315387383 316013432 316670799
3508.4 316670799 317464657 317495899 317914658 318536396 319841442 321181221 321620674 322157707 322784386
3517.1 322784386 323691444 324093704 324747314 326128960 327351608 327840233 327560005 328716965 330438690
3525.7 330438690 331470757 331957054 332663078 333543701 334335823 334899178 335189209 336077881 336761055
3534.4C36761055J388130J212959M02833J428184J069298R37881O63109O88553Q48770
3543.1C45400772J339340R49707M2687J783180J073113J669311J109619R25636K368622
3551.8C56661987M1542R98993J108284J450348J617241M05541J857643J190452Q01277
3560.5C66133308Q90770K500687J875687J029358L850135k2430M8523O15044J73950
3569.1C77095032L371887J734543K012634K150688J477928R53408J661491K227440
3576.9C92685051J021843K334404J391563J297036K240066K198525J837577J104699
3584.6D06110764L528480Q96187l50647K911797L91998L129883L259048K794762J766205
3593.2D24438477J612396K794494o53266L069191L873901J46103J635513J546555K368774
$$ plain form
3534.4 336761055 338149185 339362144 339764977 341193161 342262459 343200340 343863449 344552002 345400772
3543.1 345400772 346740112 347689819 347732506 349515686 350588799 352258110 353367729 354293365 356661987
3551.8 356661987 356703529 357702522 358810806 360261154 361878395 362283936 364141579 365332031 366133308
3560.5 366133308 367024078 369524765 371400452 372429810 376279945 376257515 376306038 376921082 377095032
3569.1 377095032 380466919 382201462 384214096 386364784 387842712 388796120 390457611 392685051
3576.9 392685051 393706894 396041298 397432861 398729897 400969963 403168488 405006065 406110764
3584.6 406110764 409639244 410535431 410184784 413096581 413488579 416618462 419877510 422672272 424438477
3593.2 424438477 426050873 428845367 428192101 431261292 435135193 435281296 436916809 438463364 440832138
3601.9D40832138L207245K083702K128334L024368J783142k37884M495888O18095K28920
3610.6D58163948P179413J450004j563415L498001l46222M064980M372253j1330J855317
3619.3D78662949J33247J825562L465805K619514K881966K549362J089973K096291
3627D95324669N747719j906929p376633O167145N880737N180397Q78334j196098K996788
3635.7E11696129L717880K211990M30298J557885K306938K558746J548195J247673
3643.4E27275734K868195L369102M704285r48449j749114L731307j967659r30137J666145
3652.1E38019409N951119M330444L719826M121322o899528K518349N144043J316070
3659.8E58221054J419258Q51212K313156R31892J324005J558838M48990L991852J332169
$$ plain form
3601.9 440832138 444039383 446123085 448251419 451275787 453058929 452821045 457316933 457935028 458163948
3610.6 458163948 465343361 466793365 465229950 468727951 468381729 472446709 476818962 476807632 478662949
3619.3 478662949 478796196 480621758 484087563 486707077 489589043 492138405 493228378 495324669
3627 495324669 501072388 499165459 491788826 497955971 503836708 509017105 509895439 508699341 511696129
3635.7 511696129 515414009 517625999 518056297 519614182 521921120 524479866 526028061 527275734
3643.4 527275734 530143929 533513031 538217316 537268867 535519753 539251060 537283401 536353264 538019409
3652.1 538019409 543970528 548300972 552020798 556142120 549242592 551760941 556904984 558221054
3659.8 558221054 559640312 560491524 562804680 563736572 565060577 566619415 567068405 571060257 572392426
3668.5E72392426j378632O35757m271125M261131P790680O725082m657097j4919433
3676.2E66578789P132492P932281L522530j486054J663475K281380J227417K011681
3683.9E90863991N87845R28383M109153N044747r319344k905388Q074150m128532Q93249
3692.6E94148254N258980J207314J640358N84068L15971J178627R62525K177009J436119
3701.3F08909225m866447n34439N386047J570702K43225N41496J955223K347222o224404
3709.9F09327850N370522K824287j2010421O260528M707832J98975J222191L045654
3717.7F20947418J039620m109917Q82988N026932m107666l358803O443901K704697
3725.4F25469170j044083l279038M22936K684135J098710O437721k525330p267952
$$ plain form
3668.5 572392426 571013794 571649551 567378426 571639557 579430237 586155319 581498222 566578789
3676.2 566578789 573711281 581643562 585166092 583680038 585343513 587624893 588852310 590863991
3683.9 590863991 591451836 592380219 596489372 601534119 592214775 589309387 597383537 593255005 594148254
3692.6 594148254 599407234 600614548 602254906 602838974 603154945 604333572 605296097 607473106 608909225
3701.3 608909225 604042778 603508339 608894386 610465088 610708313 611249809 613205032 615552254 609327850
3709.9 609327850 614698372 617522659 605512238 611772766 616480598 616679573 617901764 620947418
3717.7 620947418 621987038 617877121 618760109 623787041 619679375 616320572 622764473 625469170
3725.4 625469170 624425087 621146049 621568985 624253120 625351830 631789551 629264221 621996269
3733.1F21996269P243653j492081q159790L009262L580513R35097K684135K450523
3740.8F32247581k710952M085159J1221809j0090141j6173973R815903N687103M268532
3748.5F38351021m955025o302833J0922241m660454m094315N627213M616699K958603
3756.2F42463150m938660K466126L855362p815819K81525M814415J705474O81687L181534
3764.9F46694794k554932m097900K987289M199371m09011p848626K669640L418045
3772.6F45058670N22232J045685n02930J195221J308365K356567q66165p188415L078155
3781.3F46007385L052063J883621J956940l751144o29044J230774Q31604J132431j29776
3790F51584854O38733L03879O41937J64871Q28858J957779m167481k643280K729721
$$ plain form
3733.1 621996269 629239922 627747841 619588051 622597313 626177826 627112923 629797058 632247581
3740.8 632247581 629536629 633621788 644843597 634753456 618579483 628395386 634082489 638351021
3748.5 638351021 633395996 627093163 638015404 633354950 629260635 634887848 639504547 642463150
3756.2 642463150 637524490 639990616 643845978 636030159 636311684 641126099 642831573 643513260 646694794
3764.9 646694794 644139862 640041962 643029251 647228622 646819611 638970985 641640625 645058670
3772.6 645058670 645580902 646626587 646123657 647318878 648627243 650983810 650117645 642929230 646007385
3781.3 646007385 649059448 650943069 652900009 649148865 648519821 649750595 650582199 651714630 651584854
3790 651584854 652223587 652527466 653169403 653334274 654163132 656120911 651953430 649310150 652039871
3798.7F52039871M900665N797730q744965r202652N334855L882064M725647M074478
3806.4F62807693j0350799k445450N346985J862259L20053M85001P08160J757812M508820
3815.1F65000534m540710j2632065P306747N999451L613281J36643j6052552L740082
3822.8F52571411O060028K305832K331009p03201l949356R88464K256241L701477J305847
3831.4F66867752q610382L275452O039962o544189P04956P379150r991073l584824
3839.2F55536804Q075562m326630J116486O546707k495651k113114L168411J095505
3846.9F66604080j48544J470337j268845J262512M255371p442016j475144j1671676
3854.6F51586075M602279J0326157j72272j718216J727372K699737K055817n331726
$$ plain form
3798.7 652039871 656940536 662738266 653993301 644790649 650125504 654007568 658733215 662807693
3806.4 662807693 652456894 650011444 655358429 657220688 657540741 658025742 658733902 660491714 665000534
3815.1 665000534 660459824 647827759 655134506 661133957 664747238 664883881 648831329 652571411
3822.8 652571411 658631439 660937271 663268280 662565079 658615723 659604187 661860428 665561905 666867752
3831.4 666867752 658257370 661532822 667572784 661028595 661733551 669112701 659121628 655536804
3839.2 655536804 663612366 659285736 660402222 666948929 664453278 662340164 665508575 666604080
3846.9 666604080 666455536 667925873 666657028 667919540 672174911 664732895 663257751 651586075
3854.6 651586075 656188354 666514511 666342239 664624023 666351395 669051132 671106949 665775223
3862.3F65775223J338272O274948o395416l787918M084091M367294N025711q536911
3870F68145294q038864N083618P282181K929535r927292J526642L833847K89230K239304
3878.7F73363495L605575o872940o878738O965332K281036K187958L732300j2488174
3886.4F65895844J986465M003906J194992L826371j963501p282181K302780K864609
3894.1F72829285j559983J486588R99374J696778Q62884p735290N929336J142960n505371
3902.8F70146561M470367l401565j207505J081085R56727K466049M80880P34559l91159
3911.5F75335999q21000J87607K49253J939239K145920m029770l031845M270782r0637
3920.2F76155548l086166K235946R56726K79694j362915j943970K253571K127075Q18176
$$ plain form
3862.3 665775223 667113495 673388443 666993027 663205109 667289200 671656494 676682205 668145294
3870 668145294 660106430 665190048 672472229 675401764 665474472 667001114 670834961 671124191 673363495
3878.7 673363495 676969070 670096130 663217392 670182724 672463760 674651718 678384018 665895844
3886.4 665895844 667882309 671886215 673081207 676907578 674944077 667661896 669964676 672829285
3894.1 672829285 671269302 672755890 673755264 675452042 676314926 668579636 674508972 675651932 670146561
3902.8 670146561 674616928 671215363 670007858 671088943 672045670 674511719 674992599 675727158 675335999
3911.5 675335999 674514999 674702606 674951859 676891098 679037018 675007248 671975403 676246185 676155548
3920.2 676155548 673069382 675305328 676262054 676541748 675178833 673234863 675488434 677615509 678433685
3928.8F78433685j875992j137008J631775k618866o96411K421569J49308K73513K03248
3937.5F76784821p3777N53665j9378J641235O57273m291077l41797J357422J137695
3946.2F77406082J395264j868515J374664Q11844k715530J277465N91736o98700N39627
3954.9F78113937O91224m21525n78842R90448p2632J79596j66473j110458P05566M71191
3964.5F78802032Q4229o790N8288O83594j03302m17785L86123l86734p65686M90036
3974.2F78824005J33057j55335P8583K06757P07397J50681m41819Q8883K60162l93524
3983.8F79458847p6904Q3465Q7967J15052M1503N59693n58472n22079M17022L56980
3993.5F79963074L20892n70145J81809O47049m82102l51562O80847
$$ plain form
3928.8 678433685 676557693 675420685 677052460 674433594 673737183 676158752 676308060 676581573 676784821
3937.5 676784821 676711044 677264709 677245331 678886566 679543839 675252762 674910965 676268387 677406082
3946.2 677406082 678801346 676932831 678307495 679119339 676403809 677681274 678273010 677574310 678113937
3954.9 678113937 678805161 678383636 677804794 678795242 678722610 678902206 678735733 677625275 678330841 678802032
3964.5 678802032 678886261 678879471 678937759 679621353 679518051 679100266 679486389 679099655 678333969 678824005
3974.2 678824005 678957062 678801727 678880310 679087067 679794464 679945145 679503326 679592209 679852371 679458847
3983.8 679458847 679381943 679465408 679553375 679668427 679709930 680269623 679711151 679189072 679606094 679963074
3993.5 679963074 680283966 679713821 679895630 680542679 680060577 679709015 680389862
4000.2F80389862
$$ plain form
4000.2 680389862
##END=$$ End of the data block
