##TITLE=$$ Begin of the data block
##JCAMP-DX=5.00 $$ ACD/SpecManager v 10.08
##SPECTROMETER/DATA SYSTEM=Varian
##DATE=20 Nov 2012 10:06:48
##DATA TYPE=INFRARED SPECTRUM
##DATA CLASS=XYDATA
##ORIGIN=
##OWNER=
##NPOINTS=3735
##FIRSTX=399.26403809
##LASTX=4000.35498047
##MAXX=4000.35498047
##MINX=399.26403809
##MAXY=76.93329620
##MINY=22.40842438
##XFACTOR=1.0000000000
##YFACTOR=0.000000100000000
##FIRSTY=52.31905365
##DELTAX=0.96440572
##XUNITS=1/CM
##YUNITS=TRANSMITTANCE
##XYDATA=(X++(Y..Y))
399.3 523190536 531761131 530303650 529174843 524528961 520394630 519148254 519062462 514526176 512511864
407.9 512511864 518916245 520460777 518443375 518069496 518030891 521039009 522189407 522487030 525377846
416.6 525377846 525581741 518512039 511454849 518903427 524588203 519095726 512833443 517949524 517993889
425.3 517993889 514203568 512619629 510114632 510555878 512055435 508028412 506465950 510942764 513689651
434 513689651 510904121 504882736 505102806 507843590 502280540 499054108 501587715 501244164 506002274
442.7 506002274 511921959 514720688 516790733 513228912 512719994 516362953 516382561 518200836 519454613
451.3 519454613 513596725 512289734 518652077 520631561 521107483 519758453 515696602 517763863 518391266
460 518391266 516588135 516115761 516097412 515341187 517601547 516013451 509152184 506342812 508270226
468.7 508270226 511270027 510356636 510642548 509151726 501912155 500288048 499302254 499037514 494319344
477.4 494319344 492334366 494692039 492226295 491240578 490159225 489716377 487920341 487274170 490092621
486.1 490092621 492312775 494655266 493060684 490856133 489624367 488154984 488723183 491300926 491274719
494.7 491274719 489109802 489748878 488286781 487895317 485085106 480889778 481766129 483689537 483555107
503.4 483555107 477539330 476278229 477856941 475180511 474435158 473323097 473167915 471921768 470742760
512.1 470742760 467798500 464720268 462238846 458909607 458231888 455493546 456789894 454838181 449784851
520.8 449784851 449391022 448256645 447318764 443896370 442356415 443586578 444486809 444700317 444071236
529.5 444071236 444200325 442613945 442286835 441708641 443428726 446375542 446808090 449787483 453442154
538.1 453442154 455488243 456505241 459328232 462748909 463490372 463351212 464538307 466358414 466921082
546.8 466921082 468895264 469862862 468254700 466293449 464974289 464850159 464198990 463858376 462223740
555.5 462223740 461595955 460794830 457061501 456540604 456803513 455710258 454512558 453097992 450566177
564.2 450566177 445569000 440482712 437609100 435443954 430392303 426344070 424149513 423674164 421861687
572.9 421861687 419206085 420827904 422192154 422857895 421986389 422520370 425466080 428428230 431519089
581.5 431519089 434094582 437233391 439019241 443156242 448415947 451813240 454657478 457051735
589.3 457051735 458507500 457807465 458105164 458146286 458385658 459844704 460317574 461705818 462396126
597.9 462396126 461565475 460298576 459867516 459716492 459992676 460142708 458644180 458828163 458762321 458425064
607.6 458425064 459015007 459503746 460277290 460566368 461585846 463275070 465715179 466765060 466803932
616.3 466803932 467620316 467997208 468807487 469989777 471886826 472912025 474607964 477683105 480265121
624.9 480265121 482398453 483041611 484748688 486878548 487487564 486854858 486732063 488470802 489510994
633.6 489510994 491234703 493084679 493598213 494512482 495037155 495364761 496052132 496522331 496031799
642.3 496031799 495514107 495319595 494835968 495132141 495951500 496643524 497923889 499690857 499786377 499473267
651.9 499473267 500233574 500474815 500456772 500479317 500038986 500085640 501585388 502528229 503338432 505063095
661.6 505063095 506149139 507883263 509197197 509086876 509084816 506117287 493340569 497766228 503610954
670.3 503610954 507339935 509790993 511898384 513158073 514152908 515979424 517842216 519201775 519190559
678.9 519190559 517465477 516333656 516164589 516641350 517621803 518190651 519294510 521542397 523988152
687.6 523988152 524682503 524354858 524898262 525087280 523942032 521818657 520076103 519236450 518644409
696.3 518644409 518306541 518399925 518770790 518495369 518064880 517515068 515444374 513362007 512654533 511205864
705.9 511205864 508811646 507106514 506962433 508434601 509361382 511158142 513987350 515795059 518036690
714.6 518036690 519192390 519376488 520644989 522231560 522934875 524207802 528067513 531902199 535817528
723.3 535817528 540367393 544658089 548507538 549878960 550812950 552936974 553656998 554546013 556215286
732 556215286 557041855 558167648 560311317 563170204 566905022 569946899 571075439 572155342 572724609
740.7 572724609 571500740 568786201 566191139 565534782 565482597 565599213 564910240 563618355 563439026
749.3 563439026 564179382 564805794 563306618 560396767 557321281 554555969 551549568 547878685 545043297
758 545043297 543439064 543168640 543225250 543310013 543781776 543334465 541916656 540924759 540912209 540635414
767.7 540635414 540277710 541064720 542962227 545582542 549069138 554713554 561244354 566632004 571143951
776.4 571143951 575390778 579487228 582380295 584515839 585402832 586753807 589552612 592337189 596039658
785 596039658 599363823 602295685 605722923 609442596 612284203 613150444 613111649 612670593 612061234
793.7 612061234 611486282 612270012 613869514 615671196 619078331 622956200 625614052 628401337 631691628
802.4 631691628 633351097 633933487 632763672 630845795 630367546 630566902 631431427 633289299 636187553
811.1 636187553 637955818 639895973 641365509 640507126 639683571 638698044 637506561 634936829 632896957
819.7 632896957 631715622 631016312 631428032 631025429 631442795 631451340 630960197 629575272 626805038 623938980
829.4 623938980 620096703 616699944 613599014 612111397 610749931 608368645 607745399 608182602 608811607
838.1 608811607 607714043 604700699 601111107 598410034 596032257 592727242 589906921 587379456
845.8 587379456 585876160 585198212 584545746 584677238 585019722 584446335 582997932 580894508 577232780
854.5 577232780 573583450 570073051 565727921 562540436 560963745 559536972 559068756 560836906 563866348
863.1 563866348 567818108 572523346 576637573 579942360 583136978 586872902 589944229 593349724
870.9 593349724 598716278 604782944 610574684 615406914 620336418 624615746 627043762 627276268 626646843
879.5 626646843 626124802 623778610 620504761 617693329 616151581 615441551 614903793 614149742 613699379
888.2 613699379 613157692 611289368 608577957 604647102 601167183 598060646 594792709 591515274 589156227
896.9 589156227 588379669 586827774 585244217 583337593 581841202 580443344 577063942 572829208 568118553
905.6 568118553 563919830 558976822 553984451 549403000 544768944 541077499 537214661 533626060
913.3 533626060 529247284 524138298 518779984 512452621 506751251 501509132 496280899 491830482
921 491830482 488517570 486528053 485363808 484934998 484915543 484779625 484970474 484966621 485121193 485175133
930.7 485175133 485149879 486190109 487264824 488166771 489993515 492986412 496108551 499228516 502443352
939.3 502443352 505558090 508655891 510901680 512415161 514094925 515562477 516085625 516191559 515596771
948 515596771 514433556 513790359 512484322 509774513 506218376 501499710 496077576 490102463 483403969
956.7 483403969 476242790 468847809 462103615 455798340 448619881 440732155 433867149 426676674
964.4 426676674 417948380 408540764 399790115 390722084 380756874 372037354 362235565 352559471
972.1 352559471 342904243 333230896 324698067 314978294 306205769 297407894 289547215 281285152
979.8 281285152 272904453 266142559 259361019 253980370 248252602 244541645 240650616 237407036
987.6 237407036 235724373 233275471 231951618 229572582 228523598 227128658 226109314 225428810 224340553
996.2 224340553 224494610 224542999 226009464 225588207 226677589 227886200 227984791 228837376 228686619 229827404
1005.9 229827404 228734112 228458672 227956181 227362480 227605705 226256409 226220741 224504089 224146252
1014.6 224146252 224084244 224619255 225434284 225312614 226792336 226525593 227459412 227849636 229076042
1023.2 229076042 230356789 231437492 234205952 235579662 238482857 239653606 241660194 243527260
1031 243527260 244745789 246583061 246962662 249517365 249960861 250775509 250736294 250147438 251649799
1039.6 251649799 252208080 252828999 251656513 252140541 251743298 251235886 251318474 251106110 252360764
1048.3 252360764 251765003 252800102 253286591 255414944 258247204 260794754 264896774 267245159 271198559
1057 271198559 274029484 277315254 280972309 284815273 289417439 293892269 299975624 304485493 309878044
1065.7 309878044 313543835 316289234 318608112 317926388 315661869 310232162 304983482 298845959
1073.4 298845959 293927975 289954853 286337910 285152588 283325558 283609390 283615055 284110336 284644470
1082.1 284644470 286643867 289681721 291708527 295001068 296251869 299206524 301879520 305322132
1089.8 305322132 309866734 313409481 317608223 319925919 323815880 326487808 328664818 330419502
1097.5 330419502 331081696 332174950 331491432 332144585 331681519 331901512 332487488 333030739 334460220
1106.2 334460220 334501953 335625496 336059799 338205299 340044518 341382713 343473587 345028496 347688103
1114.9 347688103 349184303 351982880 353914871 355248642 356519852 357228737 358946648 358884163 359542198
1123.5 359542198 359337311 359505959 360690308 361477699 363145714 364811401 367737312 370137863 373341064
1132.2 373341064 375277023 375732002 376790504 376999893 377381783 375999870 374145508 371300774 368333740
1140.9 368333740 365951500 362571716 359573784 356112366 353883972 350306053 346495476 343466492
1148.6 343466492 340286522 338415756 335942764 334428177 332628632 332071228 331980934 332455406 333720322
1157.3 333720322 333646049 334914207 336015892 338224602 339647484 341813431 345501595 348658371 353821335
1166 353821335 358674393 364492683 370411148 376814957 383620224 390147705 397404518 403789825 410309448
1174.6 410309448 416476479 423385544 430235138 436398621 442774086 449446907 456488228 462892418
1182.4 462892418 469417496 475420074 480988007 485105438 488077202 491569977 494825630 498306427
1190.1 498306427 501474457 504033432 506180573 507923355 509922485 511709366 512473335 512814445 513196373
1198.8 513196373 513172112 512671471 512378235 513082733 513695946 513937454 514871864 516399612 518388290
1207.4 518388290 520193367 522168922 523917809 525068970 526390915 527714119 529695129 532144699
1215.1 532144699 534224091 536096001 538224945 539985008 541702843 543809395 545175476 545640335
1222.9 545640335 545411339 544863014 543955765 543072968 541665497 539978104 539392052 539067841 538464241
1231.5 538464241 537626419 537229652 537006378 535885506 534733086 533297005 531599007 530371475 529025192
1240.2 529025192 527940216 527750206 528234329 528573151 528993950 530098801 530833435 531163597 531873055
1248.9 531873055 532234116 532007484 532058372 532444839 533092918 533908920 534615135 535394669 536420326 537543182
1258.5 537543182 538358002 538629608 538635101 538548546 538240471 538304939 538497124 538648529 538902435 539501762
1268.2 539501762 540905037 542285538 543927994 545479202 546331787 546932526 546792717 546661148 546210709
1276.9 546210709 545256004 544533119 544314232 544342613 543979263 543698959 544250183 544825935 544798393 545318184
1286.5 545318184 545038795 543671341 542437744 541283913 541093140 540587730 539980354 539595680 539010429
1295.2 539010429 538616142 538044586 537326241 536336327 535534973 533723145 531546860 529368134 527509499
1303.9 527509499 528191452 528137894 526574821 525641060 525207710 524900436 524157333 523580933 522590714 521193657
1313.5 521193657 519892235 519058380 518269882 516754036 515746307 514748573 514457436 514764824 514215088
1322.2 514215088 513594055 512260475 510067368 507854004 505364761 502552299 499491539 496527367
1329.9 496527367 493942528 491743813 489988136 488684731 487559853 486215897 485225754 484092178
1337.6 484092178 482797050 481526833 481044617 481326294 481243210 481631927 482089729 482933159 483612671
1346.3 483612671 484325104 485292702 485547829 486000710 485936203 485633049 484949875 484103661 483519669 482945023
1355.9 482945023 483132706 483003311 482747917 482648087 482828178 482462997 481390381 480746918 480251503 480258331
1365.6 480258331 479338264 478604698 478124199 477601891 478265152 478667603 479568977 480059929 480062408 480292625
1375.2 480292625 480853043 481275558 480803719 481349106 481508141 481801720 482246590 482707520 484135437
1383.9 484135437 485749054 487698441 488825684 490629082 492664261 494448166 495578079 495822372
1391.6 495822372 495655251 494825668 494219551 493736305 494512596 494640617 493907585 492754669 491691284
1400.3 491691284 491541100 490116005 488668365 487254829 485226402 484009056 483020744 482363052 481519432
1409 481519432 481082344 480022469 479403229 479211845 478441505 477930756 476515732 475404663 474228287
1417.7 474228287 473580399 472146759 472640228 474733963 475216713 475800514 475794220 476765785 477999687
1426.3 477999687 478311615 479115906 479090157 479404259 479636154 480650520 481245041 481961479 483794632
1435 483794632 483984604 483894272 485426865 487872658 488790588 489393234 490275154 490148964 490806961 490612984
1444.7 490612984 491051826 490912285 490480118 490074158 490192299 490958443 489738922 489094543 488274727
1453.3 488274727 488466721 488068695 486716728 483621559 478582993 482787209 484094734 486191902 486814232
1462 486814232 487762032 490207977 490644989 494064407 495607643 498352242 500171471 503028412 506613083
1470.7 506613083 508042450 513299332 516728745 523577347 527010803 531457253 537266884 541119690
1478.4 541119690 545060196 547287025 550815659 553397789 556733551 559058495 560999756 564405670
1486.1 564405670 566096268 569361801 570939369 572982826 575738602 579167175 582371521 583648643
1493.8 583648643 585341606 585362473 585749779 587746658 589017677 590718117 593067398 595246925 596167946
1502.5 596167946 598051796 598671341 598149261 592346649 589821854 595318832 597838364 600806313 602488747
1511.2 602488747 604089203 604344559 605712051 606665688 605814743 605945969 605249557 607906799 607886581
1519.9 607886581 603111038 602030334 605206146 609409294 610287552 610322342 611410789 613150558 613797569
1528.6 613797569 614469337 615568619 614531326 614134102 612482758 611508408 612972794 613319550 613800087
1537.2 613800087 613210411 608509521 602413292 607679405 609776077 609616814 611579094 610714951 610076103
1545.9 610076103 610465546 610113678 609716110 607839699 606841774 607817726 608386612 607479820 604184036
1554.6 604184036 604193268 605325623 605429840 601266785 596354485 595987244 599086647 600574799 600762634
1563.3 600762634 600274048 598813629 599333038 599851227 599414177 598583565 595711555 596857910 597563820
1572 597563820 597153015 596895370 596558762 594551048 590924988 594592209 597135353 597875710 597920036
1580.6 597920036 597320251 596922035 596261368 595350189 594520721 593981209 593682327 593131180 592929497 592439804
1590.3 592439804 591856155 591381683 590961113 590041924 588804398 588095207 587255630 586504707 585230331
1599 585230331 584263306 583175316 582234650 581798172 580926781 580336533 579087105 577805023 576079941
1607.6 576079941 574885139 573409157 571709290 571176872 569349480 568037491 566214600 565283661 564035950
1616.3 564035950 558431740 559628448 559685249 559162064 557236061 555818825 553858490 550576057 551041718
1625 551041718 550452805 550109558 547998657 546491623 546351471 546265335 545875053 544323273 543977432 543164749
1634.6 543164749 538860207 537623100 539268761 540000534 540515938 541415291 541220245 542160645 542131157
1643.3 542131157 542998962 543837051 542003441 541776581 542588425 546354599 548399467 550668564 552471008
1652 552471008 550251122 547458344 552264481 557050552 559559860 562017708 564046745 566138687 567373466
1660.7 567373466 568436470 570057755 572052841 575434799 577636681 579967575 582340240 584033546
1668.4 584033546 583969307 586995735 591593590 593904305 596721535 599088898 599894066 601415100 604881897
1677.1 604881897 607944527 610107193 612573318 614465828 617388039 619749031 618795891 619209099 625102959
1685.8 625102959 629997101 632652016 633863754 636177979 638528824 640646210 643111801 644932175
1693.5 644932175 647153778 648615875 645506973 648830185 652263260 655713501 654737167 652534485
1701.2 652534485 657456970 660579605 661571960 660976028 662469482 663793640 665764923 667803497 668663025
1709.9 668663025 669326248 670440216 671472092 671571960 670305252 669442215 671427917 672009430 669123535
1718.5 669123535 672808533 675588684 677035446 677341080 677411270 677951736 678929596 679872437 680512390
1727.2 680512390 681116409 681377792 680976334 681435318 683797836 685409012 682219315 681808624 685664902
1735.9 685664902 688538132 689441833 690542679 689623413 688440399 691422348 692858810 692845535 693980484
1744.6 693980484 696188354 697663193 698463058 698983154 699512558 702765198 703358383 703986282 707055359
1753.3 707055359 708794937 710332336 711827927 711969299 713105850 715508270 717450485 719370117
1761 719370117 719091415 719643860 721871796 722405243 722915192 723291550 723459549 722638321 724326859 727004776
1770.6 727004776 726753006 725680466 726385269 729541397 730506744 730139160 731590500 731545486 731828842
1779.3 731828842 731308823 731256409 732554016 733705521 734802704 734651260 735306625 736444702 737371597
1788 737371597 737252350 737025223 736303177 735464783 734896393 735040970 737234573 738051834 738993835 740944290
1797.6 740944290 742120438 741593781 740442123 741605911 741207428 741599274 742191391 741878967 742270432
1806.3 742270432 742304459 742881775 743607483 744369812 744152679 745037842 746167755 746081848 746242294 745636520
1815.9 745636520 745754929 745414276 745640564 746514435 746535873 747240753 747512436 748563995 749368057 748234177
1825.6 748234177 748058548 748595734 748903580 747725601 745682144 746569901 748342896 748763504 749528275
1834.3 749528275 750392532 750371323 750581589 750733566 751564484 751458664 751370850 750675049 749920807 749262848
1843.9 749262848 746532364 748864670 750605087 751220245 751914520 752545624 753081360 752901917 753206711
1852.6 753206711 752400742 751837158 751758118 751760178 751916733 751455917 751886826 752388687 753310394 753372726
1862.2 753372726 753613815 754285202 753766479 753669586 752871399 752216263 750644913 750085831 751588211
1870.9 751588211 752779770 754059906 754465485 754849930 755016632 755001602 754885635 754852600 754838257 754347153
1880.6 754347153 754371719 753993378 754329147 754641113 754673767 755459976 756217041 757128220 756566467 755642395
1890.2 755642395 755990829 756407394 756348724 756000671 755572128 755271454 756032181 756139069 756290665 756729584
1899.8 756729584 757261124 757921753 757892532 757853851 757089615 756824493 756412659 755697708 755556335 755176926
1909.5 755176926 755574951 756370926 757648773 758080750 758334351 758701859 758397980 758649063 757119598
1918.2 757119598 756392288 756628647 756265793 756104660 755699844 756341095 757465973 758507614 758939438
1926.8 758939438 759050064 759001312 758786621 758210907 757305145 756901245 756660233 756992722 757018509 757168655
1936.5 757168655 757772217 758333511 759146042 759319229 759496460 758355484 756851883 757212448 757208786 756881714
1946.1 756881714 756727829 757086334 757597351 758575516 759413528 759924545 759998322 759490891 759389191 758807449
1955.8 758807449 758346786 758111496 758030624 757923126 757787781 758455048 758895874 759487534 759783249 760181427
1965.4 760181427 760445938 759606323 759358063 759314194 759045410 758570404 758370972 758257370 758450012 759372177
1975.1 759372177 760225296 760694046 760633316 760974426 760944366 760546188 759989929 759241333 759036789 758775253
1984.7 758775253 758695755 758414154 759020615 759826813 760091324 760890808 760686035 760480423 760443115 760153580
1994.3 760153580 759706802 758916168 758413467 758065414 758394318 758976669 759648743 760177841 760560303 760688171
2004 760688171 760597076 760615234 759937515 759466324 758833389 758309937 758204575 758060532 758187943 758176422
2013.6 758176422 758923264 759530716 759328079 758669586 758505402 758667831 757809448 757012711 756302032 755959244
2023.3 755959244 755981827 756363907 756935043 757044525 757337723 757534103 757669449 757146759 756483688 755653534
2032.9 755653534 754718628 754480362 753996735 754140701 754247055 754058228 754393845 755144958 755657730 755478745
2042.6 755478745 755375748 754531250 754008331 753419952 752686996 752700272 752488174 752753754 752984314 753341751
2052.2 753341751 753623581 753988647 754652252 754744263 754707565 754008713 753291702 752548141 752373123 752463760
2061.9 752463760 752053299 752423477 752725449 753488998 754418182 754798126 754943161 754760666 754281311 753401947
2071.5 753401947 752888031 752186966 751804657 751902237 752194061 753253098 753989182 754161911 754501419 754978790
2081.1 754978790 754831924 754685287 754146576 753042374 752514420 752491302 752796631 752625656 752743988 753333969
2090.8 753333969 754395447 755266342 755212479 755356979 754781647 754318161 753747787 753142242 753014679 752494278
2100.4 752494278 752828522 753385391 754262390 755015335 755407715 755963516 756026764 755889740 755264053 754906082
2110.1 754906082 754417725 753993912 753981018 754106369 754533463 754702835 755406570 756003418 756668472 756888046
2119.7 756888046 756307983 755777740 754922180 754600067 754094772 753800583 753623123 753584595 754352417 755076828
2129.4 755076828 756286926 756923370 757041245 756855316 756197662 755554581 754943771 754692459 754134064
2138 754134064 753931732 754227905 755031509 755899353 756515427 757184448 757146912 756990509 756247406 755414734
2147.7 755414734 754884644 754610367 754751740 754370575 754351654 754895248 755904160 756582336 756805954 757158127
2157.3 757158127 757261353 757389069 756921997 756165848 755577316 755367966 755263138 755517197 756160355 756537933
2167 756537933 757671890 758482742 758787689 759053116 758777237 758172836 757692947 757560959 757028885 757203064
2176.6 757203064 757565842 757930603 758889847 759799347 760829468 761046524 761062012 760844193 760327835 759913177
2186.3 759913177 759432373 759314194 759335861 759821091 760177612 760678711 760990524 761474838 762389984 762395248
2195.9 762395248 762598724 762205734 761898499 762104950 761613541 761294174 761198273 761371841 761759186 762805862
2205.5 762805862 763550797 763891296 764476395 764625397 764334259 763509750 763293228 763147430 762900009 762893906
2215.2 762893906 762916946 763332138 763775101 764584122 764957047 765464325 766020126 765854263 765491333 764742661
2224.8 764742661 764335480 763994751 764170151 764461288 764608231 765343552 765992050 766607132 767180176 767685547
2234.5 767685547 767173767 766264420 765526886 765021515 765254669 765125351 764979477 764961166 765691299 766510239
2244.1 766510239 766974640 767601166 767387238 767278214 767208252 766965637 766251755 765575409 765299530 764778976
2253.8 764778976 764990616 765395660 766179810 767013474 767774353 768313293 767979279 767569199 766875229 766308060
2263.4 766308060 765446548 764955673 764820480 764844360 765573959 766097260 767053299 767636337 768032455 768218002
2273 768218002 767984314 767764969 766923599 766341705 765747986 765842133 766019669 766139069 766773911 767429199
2282.7 767429199 768612976 769157410 769332962 768657379 767545471 766805267 765988998 765635910 764793930
2291.4 764793930 764028244 763610001 764382782 765216980 765747604 766276169 765634155 765499268 764086304
2300 764086304 762756119 762191925 760997696 760515137 759925156 760068359 759670715 759865570 760243378 759910049
2309.7 759910049 759903946 758687820 758305054 757150192 755905533 754900131 753567886 753110428 751583862
2318.4 751583862 751700668 751448822 749891357 749285431 749431076 749245377 748071289 747136307 745048904
2327.1 745048904 744384918 743472290 741959229 741302414 741190186 742788696 743539658 745156631 743950195
2335.7 743950195 741517487 741490097 740922089 739817810 737545853 737583313 737682953 737284698 737597046 739531555
2345.4 739531555 743116760 746495056 750660019 751014252 747182312 743105240 740500488 738009262
2353.1 738009262 735382233 733641586 731551285 729945679 728779907 729627914 730329361 729365616 729668655
2361.8 729668655 729903717 730293045 728699417 729660339 732410278 732936401 734075089 736489487 739566345
2370.4 739566345 741220474 743507080 746171722 747917099 748676529 749223709 750358429 750950394 751827545
2379.1 751827545 752647705 754324112 756417770 757768631 759061356 760101471 761000824 760916214 760601349
2387.8 760601349 760293045 759691544 759044495 758203659 757762375 757581558 758273697 758688354 758913040 759551620
2397.4 759551620 759807053 760111389 759837341 759451065 758370590 757194824 756662292 756014023 756084518
2406.1 756084518 756449814 757049637 757542801 758096466 758156281 757502899 757308960 756766510 755944443 754953995
2415.8 754953995 754261703 753797989 753460617 753474121 753678131 754222183 754200287 754396210 754325027 753657913
2425.4 753657913 753169174 752520523 751635666 750316162 749891357 749918900 749980927 750066605 749927368 750269623
2435.1 750269623 750380630 750630112 750492630 749691467 748755112 747744370 747151337 746704178 746218262
2443.7 746218262 745964890 746355057 746174850 746146927 746577454 746227798 746166687 745904922 745264816 744358444
2453.4 744358444 743581085 743040314 742495499 742448044 742072983 742076263 742619705 743077927 743080368 742853851
2463 742853851 742457581 741191101 740353317 739606552 738724365 738084030 737731171 738125458 738649063 739158859
2472.7 739158859 739121170 738845291 738692322 738361282 737802124 737013931 736302643 735854340 735566711 734949722
2482.3 734949722 734835205 735034485 735593109 736330261 736256409 736177902 735442886 734674301 734127121 733439407
2492 733439407 732918167 732091980 731742706 731638412 731933212 732280045 732558289 732794418 732334824 732131653
2501.6 732131653 731759415 731203156 730522232 729744797 729447098 729497299 729469604 729288254 729685745 730053787
2511.2 730053787 730325317 730151443 729783478 729387512 728460770 728076630 727372131 726723709 726284943 725996628
2520.9 725996628 726431198 726611481 726970749 727032394 726753845 726516190 726334991 725843506 724980545 724375458
2530.5 724375458 723519669 723280487 723284454 723272705 723300476 723347702 723769150 723225937 722665634 722367401
2540.2 722367401 721931152 721185760 720122375 719631042 719341354 719239578 718884048 719072418 719578934
2548.9 719578934 719382706 719046021 718561325 718265457 717725677 717302551 716986313 716395798 715571518 714819870
2558.5 714819870 714812241 714685059 714832764 714890060 714583359 714233017 713742676 713611908 713092346 712800217
2568.1 712800217 712418365 711434555 710830841 710822449 711176376 711105728 710965881 711024017 710922623 710201111
2577.8 710201111 709522018 709220657 708477478 707898788 707379837 706857529 706701889 707006454 707307892 707155075
2587.4 707155075 706742706 706305008 706350937 706069870 705733032 705439529 704777374 704289474 703689194 703356552
2597.1 703356552 703146439 703195572 703405991 703422318 703462601 703138809 702617798 702106705 702015686 701634979
2606.7 701634979 700920563 700488358 700307159 700444794 699930115 699358749 699080505 699052048 699300232 698834152
2616.4 698834152 697833481 696954803 696431580 695702972 695301285 695275955 694841003 694212265 693820343 693989410
2626 693989410 693662338 693033371 692349167 691318207 690755997 690514069 690019302 689311142 688866119 688100739
2635.6 688100739 687579117 687934875 687944794 687285233 686388092 685814819 685032654 684243240 683882217 683365402
2645.3 683365402 682667618 681813736 681165695 680859451 680841675 680429306 679757919 679321060 678600235 678095322
2654.9 678095322 677769241 677116470 676371918 676039658 675535736 674658203 674274979 674154053 673951111 673420410
2664.6 673420410 672926712 672352448 671719360 671373291 670919952 670634232 670152206 669530334 668905869 668421402
2674.2 668421402 668186646 667849274 667679520 667238159 666931534 666779404 666114426 665091400 664057693
2682.9 664057693 663433609 663240891 663266678 662958221 662876816 662626343 661816025 661264572 660611725 660168228
2692.5 660168228 659888306 659670486 659398956 658849869 658124084 657349014 657117081 656951981 656595840 655899734
2702.2 655899734 655035172 654199371 653798981 653850327 653338547 653239517 653046722 652134399 651130905 650334625
2711.8 650334625 650162125 649936676 649736938 649129868 648376465 647798157 647248001 647142181 646949615 646917725
2721.5 646917725 646178894 645189819 644993668 644800568 644616776 644087296 643411407 642704773 642246094 642228088
2731.1 642228088 641902161 641253052 640964355 641041794 640724564 640390701 639754829 638840561 638539467 638675270
2740.8 638675270 638596497 638063889 637785873 637519646 637214012 636924820 636701508 636572380 635947685 635252266
2750.4 635252266 634689827 634739761 634686966 633966675 633470154 633023148 632674675 632579536 632541199 631838264
2760 631838264 631298714 631322517 630932541 630530357 629974174 629491959 629318504 629319458 629030685 628713646 628873405
2770.7 628873405 628681068 628563385 628048325 627193222 626762428 626241188 625718918 625221519 624792976 624297791
2780.3 624297791 623931808 623554764 623208466 623009415 622542572 622062798 621451759 620751152 619936447 619661407
2789.9 619661407 619465332 618387985 617534256 616997223 616583023 616125679 615672264 615306053 614656792
2798.6 614656792 613723984 612837372 612190056 611296043 610406036 609389496 608663254 608088608 607249908
2807.3 607249908 606753464 605941010 605400581 604723167 603686066 602687378 601395912 600528297 599363213
2816 599363213 598277550 597407990 596588516 595921021 594768143 593761063 592889023 592167931 590843315
2824.7 590843315 589297523 588442497 587292404 585815010 584434662 583556900 582720680 581962051 580930786
2833.3 580930786 579435387 578483658 577663612 576686630 575038376 573182945 571506958 569631462 567863159
2842 567863159 566045570 564343910 562662811 561104660 559200096 556998863 555143967 553253670 551454239
2850.7 551454239 549891243 548324966 546501160 545553665 544544792 543115501 542962189 542391129 541407928
2859.4 541407928 540586243 539440575 538174477 536923409 535710793 534008751 532565002 530887833
2867.1 530887833 528855629 527107964 525321579 523597069 521562195 519527855 517285881 515063705
2874.8 515063705 513015366 510614319 508283768 506236534 504651947 502858391 501267281 500076294
2882.5 500076294 498632240 497316093 495909157 494934235 494300156 493273582 491946831 490990410 490803833
2891.2 490803833 490409431 489994049 490278587 490364532 489638824 488962860 488431168 488134995 488168678 487655144
2900.8 487655144 486881218 486281013 485883446 484949188 483926773 483515816 482713013 481950302 480842819
2909.5 480842819 479440346 478724899 477777634 475982056 473998566 472274590 470415878 468410606 465843010
2918.2 465843010 463603706 462460594 461070557 459654579 458685341 458052368 457019806 455775604 455079231
2926.9 455079231 454575844 454464493 454032936 453151283 453078766 454183693 455089417 455732384 457478752
2935.6 457478752 459434662 461388664 463652077 465656586 467583351 469836464 472096100 474363098
2943.3 474363098 476777534 479085121 481867867 484359818 486237793 488343964 490825882 493587189
2951 493587189 496093102 498529930 500479889 502358818 504520760 506615295 509157829 511436920 513590317
2959.7 513590317 515829811 518052940 520054398 521254539 522682571 524673309 526327248 527473373
2967.4 527473373 528686752 530079613 531502190 532918472 534551239 536240311 537562828 538946495
2975.1 538946495 540511131 542442818 544133759 545336075 546631241 547552986 548461380 549728470 551288757
2983.8 551288757 552786331 553927917 554938812 556038971 557250214 558242073 559288635 560051460 560641289
2992.5 560641289 561260223 561632423 562254333 562708397 563142586 563792839 564347534 564595222 564540138 564911919
3002.1 564911919 565171204 564888382 564568863 564342766 564295959 564149780 564023476 564098091 563702126 563187523
3011.7 563187523 562839546 562146454 561454582 560881920 560495949 559691010 558685341 558199921 557375793
3020.4 557375793 556576309 555660286 554769249 554496307 553792648 552908669 552207603 551277008 550128555
3029.1 550128555 549203491 548377647 547217751 546014938 544913712 544004822 543079529 542120132 541393814
3037.8 541393814 540740433 539629936 538580551 537962112 536798325 535212059 533719635 532811050 531890831
3046.5 531890831 530632782 529563484 528466797 527860641 527046928 525966759 524797363 523558464 522767143
3055.1 522767143 521135864 519437752 518380699 517498550 516852379 515892410 514674721 513551369 512838631
3063.8 512838631 511841278 510768738 509705276 508113861 506863861 505928040 504805374 503449440 502599335
3072.5 502599335 501862602 500748940 499779091 498719940 497523499 496164436 495352211 494445724 492816277
3081.2 492816277 491734276 491156921 490425911 489318199 488171730 486917915 485798492 484801140 483586578
3089.9 483586578 482513046 481050186 479539719 478514366 477579842 476331863 475331535 474863319 474043274
3098.5 474043274 472913284 471514778 470584984 469869308 468491020 467217216 466132088 465138321 463920822
3107.2 463920822 462504997 461642036 460968781 459484253 458268433 457932663 457147980 455955315 454292717
3115.9 454292717 453045502 452159615 450818024 449698410 448580856 447842140 446778336 445542145 444705772
3124.6 444705772 443409729 442482071 441751060 440713692 439673157 438836517 437647858 436015091 434811363
3133.3 434811363 433954201 433451042 432654495 431247787 429827385 428968697 428319550 427310486 426223335
3141.9 426223335 424771194 423472786 422260666 421416702 420762253 419059486 417591705 416960869 416524696
3150.6 416524696 415628395 414741592 413833237 412304649 411168442 410130692 409161835 408331490 407596474
3159.3 407596474 406805611 405437927 404252205 403281021 402422867 401666298 400931702 399833488 398636360
3168 398636360 397811356 396633415 395762329 395224037 394346161 393304749 392361069 391318169 390284920
3176.6 390284920 389703560 388784561 387848129 387122955 386370697 385459709 384236336 383447151 382840843
3185.3 382840843 382012558 380940247 380284805 379830933 379115105 378652344 377882195 376681557 375435715
3194 375435715 375034790 374602356 373286438 372083931 370945015 370230751 369574089 368880348 368095016
3202.7 368095016 367305374 366773033 365861206 365315857 364611740 363500404 362626381 362102928 361926613
3211.4 361926613 361374588 360672531 360111923 359490166 358262138 357192879 356666756 356049805 355687141
3220 355687141 355178566 354515343 353470688 352661896 352249413 351761818 351523361 350535011 349720535 349562607
3229.7 349562607 349287910 348734741 347986336 347451019 346479721 345612221 344941711 344269753 344125481 343899841
3239.3 343899841 343075905 342189064 341820755 341415138 340923309 340158005 339523315 339225960 338516159 337933464
3249 337933464 337413979 336994896 336504745 335791512 335129814 334532318 334167213 333614731 333169899 332725372
3258.6 332725372 332270470 331779709 331234131 331061592 330618210 330049210 329408684 329042015 328980522 328550568
3268.3 328550568 328029137 327545967 327216492 326806145 326422424 325926552 325488434 325112648 324340248 324089355
3277.9 324089355 324052582 323832130 323420525 322821388 322318077 321666298 321120491 321059036 321288834 321046829
3287.5 321046829 320553360 319952774 319513817 319299355 318536301 318280869 318257732 317721653 317298470 316924076
3297.2 316924076 316512375 316385803 316184998 315359650 314982414 314870644 314605465 314416447 313793964 313354416
3306.8 313354416 313044338 312406616 311692657 311329060 311223965 311082668 310855980 310543308 310070896 309118805
3316.5 309118805 308673229 308475494 308309364 308244381 307533436 307100811 306574230 306262817 306084919 305418186
3326.1 305418186 305141678 304809093 304773655 304494133 303690796 303188572 302757969 302531757 302247734 301806870
3335.8 301806870 301443062 301044540 300067196 299407082 299492054 299056530 298519344 298095570 297682705 297233582
3345.4 297233582 296569672 296072369 295825787 295617619 295534763 295660782 295009346 293878002 293206501 292854118
3355.1 292854118 292573910 292442303 292344437 291702805 291202393 291028519 291117687 291029930 290302086 289668560
3364.7 289668560 288735752 288390846 288550453 287936440 287295017 287174587 287129574 286452351 285939007 285802021
3374.3 285802021 285446968 284736328 284100246 284220104 284007740 283621712 283712349 283512135 282990456 282847538
3384 282847538 283184910 283109093 282462330 282026463 281800709 281205921 281166344 281556511 281494312 281334610
3393.6 281334610 280942593 280973701 280845966 280311012 280430069 280333366 279873962 279700165 279970608 279957123
3403.3 279957123 279321499 278813248 278882141 278988800 278785114 279262352 279612579 279160995 279162445 279551582
3412.9 279551582 279590988 279360237 279090481 279027920 279174900 279093533 279168854 278976421 278436718 278541832
3422.6 278541832 278609009 278559380 278882847 279327812 279245262 279076691 279485435 279992256 280241814 280088234
3432.2 280088234 280394211 280897484 280828533 280395699 280164623 280576496 280854759 280938282 281103573 281692047
3441.8 281692047 282154179 281890316 281767521 282379284 283427067 283105373 283113232 283972836 284353638 284897232
3451.5 284897232 285127716 285659885 286316853 286625004 286888027 287321644 288123093 287982693 288013401 289031925
3461.1 289031925 289660473 289694386 290140190 290867157 291472321 292056923 291642818 291643562 292353001 292871208
3470.8 292871208 293555984 294469929 295589008 295770416 296269245 297085876 297156525 297328167 297524529 298140831
3480.4 298140831 298796062 299820976 300764065 301182899 301496944 301583710 302622032 303190956 303365154
3489.1 303365154 304592953 305640850 306243229 306542377 307023849 307790661 308264408 308407059 309060230
3497.8 309060230 310343437 311127720 311459923 312394676 313335266 313311367 313746910 314960556 315946198
3506.5 315946198 316489925 317747345 318952293 318689861 319314251 320034752 320504723 321522446 322185402
3515.1 322185402 322711601 323172035 323769264 324396400 325227852 326603355 328344994 329245110 328778152
3523.8 328778152 329527969 331124077 332207222 332543259 333123550 334024086 334882622 335582123 336111526
3532.5 336111526 337550735 338511276 339651527 340833168 341066551 342342300 343252792 344127388 345525169
3541.2 345525169 346987038 347695274 348071404 348984642 349255142 350396461 351113663 352605896 354369392
3549.9 354369392 355950165 358109322 357608604 358353806 360122566 361761818 363271332 363779030 365651627
3558.5 365651627 367129745 367825165 368297501 370332489 372249413 373822937 377609406 377233772 377308769
3567.2 377308769 378101387 378231354 382236481 384735069 386251678 387531204 388587761 389536171 391670074
3575.9 391670074 394702530 396179237 398544884 399849968 400633659 402632370 404757919 406383476
3583.6 406383476 408036041 412310905 413260498 412644844 415272522 415696907 418992844 422248154 425391273
3592.3 425391273 426898308 427894669 430998077 430166245 432270813 435464897 436834221 440109711 441464233
3601 441464233 442997093 446011505 448313446 450617905 454288559 457417488 456790237 459665413 459781609
3609.6 459781609 460080109 466561394 467098579 466334305 470225449 470005760 474677925 478982582 478839493
3618.3 478839493 480842133 480283546 481726952 485637093 489166451 491912537 494501381 496409683
3626 496409683 497914963 503697319 502428284 493630981 500022469 506047363 511720123 512742767 511564026
3634.7 511564026 514869537 517995834 519882698 520749512 522601166 525288353 527911987 528486443 529323311
3643.4 529323311 532733002 536093102 540504799 538349838 535246887 540051842 539573326 538500748
3651.1 538500748 540259743 546318092 550698891 554552650 558308754 551122627 553977394 559396782
3658.8 559396782 560805588 561733704 562214813 564607506 565942535 567469368 569257202 570258026 574176140
3667.5 574176140 575753174 574696693 574672661 570009537 573773766 581410370 588449745 586437988 571233177
3676.2 571233177 575775681 583370361 587314301 586681480 588114052 590328789 591652527 593233795
3683.9 593233795 593942223 594858932 598939972 603629112 593434639 591461525 599934044 596302986
3691.6 596302986 597253571 602262039 603378181 605201607 605549622 605691681 607255135 607749100 609939384
3700.3 609939384 611751289 606181564 605774803 611333961 612717781 612766037 613789101 615951347 618157158
3709 618157158 612520676 616952782 619402695 608538666 614449768 619082222 619767189 621060486 623264961
3717.7 623264961 624311218 621340027 622534676 627423515 623279953 619775581 624689064 625620041
3725.4 625620041 624891472 622650452 623952065 627738838 629126472 633789825 629294357 624030151
3733.1 624030151 632724190 630704193 621332512 624292183 628316193 630320740 633646278 636119003
3740.8 636119003 632843018 636213303 645145111 628230095 617955894 630588570 636957283 642403030
3748.5 642403030 637802582 629043961 639699211 635656242 630935631 637021980 642227249 645443802
3756.2 645443802 640805206 643216019 647868423 640138168 638876457 643234329 644883728 645469437
3763.9 645469437 648249359 645375671 642055511 645764618 650387726 650129929 641632919 644010239
3771.7 644010239 648454590 649655380 650304031 649695053 650108490 650792007 653716736 653079071 646103516
3780.3 646103516 649448929 652335968 653346558 654825668 652004318 651445923 652380600 653332825 654582596
3789 654582596 654745255 655580826 655635223 655511856 655448608 657063904 659891739 655571442 652353668 655008621
3798.7 655008621 659314041 664827347 657701874 648710480 652872314 656356888 661435547 665456696
3806.4 665456696 654826279 652635269 658131409 660490341 661270752 661799622 662030945 663162766 667702560
3815.1 667702560 664105835 651421509 657789917 663190384 667316742 668989944 652636490 655370636
3822.8 655370636 660830765 663162384 665633316 664141159 659440079 660881348 664143295 667807388
3830.5 667807388 668411255 660249329 663948059 670645065 663876724 663821335 672105789 663285370 658934021
3839.2 658934021 666532211 662724380 664247818 670605545 667265854 664227295 667516479 669227371
3846.9 669227371 669223328 670383072 668945999 670769958 676127853 668669357 666318054 655471268 660073090
3855.6 660073090 669966507 668940125 667056885 669367599 672129440 673618546 668390884 669380569
3863.3 669380569 675113678 669520645 665731888 670077515 675227051 681285477 672678757 662518311
3871 662518311 667561417 675126648 678088684 667525711 669633331 674124146 673473511 675367203 678813934
3879.7 678813934 670929489 665370331 672983780 674772644 676399384 679199219 666700592 670596008
3887.4 670596008 675255051 675873718 679467010 677853012 670628052 672734909 675990372 674057846
3895.1 674057846 674879227 676603622 679173660 679901581 671170807 676906586 678570786 673406906 677533493
3903.8 677533493 674845428 674272232 674628448 675698624 677964020 677378769 677581024 677982788 678965530
3912.5 678965530 679516983 678810577 679682999 681245956 677453690 674671249 679456100 679196854 675779190
3921.1 675779190 678063049 679164200 680112534 678209991 675182800 677322769 679698257 680727310
3928.8 680727310 679012985 678309555 680416031 677988968 676499176 678450470 679127121 679440002 679264221
3937.5 679264221 679440002 680763855 680934067 681435013 680991516 676717072 676939697 679203568 680397797
3946.2 680397797 681355820 679776611 681126175 681387253 679135056 681248398 681400299 680606003 680793533
3954.9 680793533 680531006 681118164 681123734 681661987 681679840 682082520 682167816 680704498 680964355 681308060
3964.5 681308060 681539383 681506195 681516495 682372589 682581863 682248383 681953964 681854706 681415558 681739960
3974.2 681739960 682371140 681955719 681575165 681390076 682087021 683163528 683298874 682672882 681922073
3982.8 681922073 681807556 682346954 682715073 682608795 683002548 683654709 683562317 682999268 683031387 683034286
3992.5 683034286 682626419 682646408 682537003 682833405 683516006 683655319 683415451 683507767
4000.2 683507767
##END=$$ End of the data block
