##TITLE=$$ Begin of the data block
##JCAMP-DX=5.00 $$ ACD/SpecManager v 10.08
##SPECTROMETER/DATA SYSTEM=Varian
##DATE=20 Nov 2012 10:06:44
##DATA TYPE=INFRARED SPECTRUM
##DATA CLASS=XYDATA
##ORIGIN=
##OWNER=
##NPOINTS=3735
##FIRSTX=399.26403809
##LASTX=4000.35498047
##MAXX=4000.35498047
##MINX=399.26403809
##MAXY=77.13819122
##MINY=22.47158813
##XFACTOR=1.0000000000
##YFACTOR=0.000000100000000
##FIRSTY=52.74660492
##DELTAX=0.96440572
##XUNITS=1/CM
##YUNITS=TRANSMITTANCE
##XYDATA=(X++(Y..Y))
399.3E27466049l32756M135895K246132m065743j3064689o743279P815094N45616j898765
407.9E16103554L356476K732467j138992k340736n68581m16679J611824K719497P40929
416.6E22799759j0378952k5709953J0637283K1837845L753738J305161K378540n202599
424.3E21420822q288231o968231k36778K529869j49384M1771n863647j016274L426247
433E04896164o6605K680359N10330k06680m68368n923005n058136J710129n1994J931991
442.7D99954185P316933M480896N774689J730881k398186r36318n04608J365319J780548
451.3E18564339J942596m333000N7526O238403J739426l027688l005905L506852l401528
460E18281021p745933k234841K787132J804963k405663k03285K742233J215019n467033
$$ plain form
399.3 527466049 527133293 531269188 533515320 529449577 516384888 509641609 517456703 518002319 516103554
407.9 516103554 519460030 522192497 521053505 518712769 518144188 517727509 519339333 522058830 522799759
416.6 522799759 512420807 486710854 497348137 519185982 522939720 524244881 526623421 521420822
424.3 521420822 513132591 506164360 505927582 508457451 508308067 508349838 502486191 501469917 504896164
433 504896164 504829559 507509918 508020248 507813568 507345200 501422195 496364059 498074188 498022194 499954185
442.7 499954185 507271118 511752014 517526703 519257584 516859398 515923080 515418472 516783791 518564339
451.3 518564339 520506935 516173935 516231461 522469864 524209290 521181602 518175697 521682549 518281021
460 518281021 510535088 508300247 511087379 512892342 510486679 510283394 513025627 514240646 508773613
468.7E08773613j976547L154449K704354j941338r974594l072243j216125o88897l173065
477.4D92589607n37338M197273j266670l387871m262733K390785L543015O70471K025795
486.1D95962334j73531J122246m523583k392921q76617m539071J713791K947922J112175
494.7D90352745j190796l9749j229897j688461j835098k107010j63078k666626R59434
503.4D80391464O48804J51520k394028l319702M11377p41348J568794l352394l898354
512.1D69466133k686729k947808n29060k662773j92299l484726j419601L21426j926346
520.8D53938217j821670n319291j797561o08826j69029P7286m47769l15667J47820
529.5D43683510K016067k131996j096115N76363j00098J197929K609482L871384K190971
$$ plain form
468.7 508773613 506797066 509951515 512655869 510714531 500739937 497667694 496451569 495762672 492589607
477.4 492589607 492052269 496249542 494982872 491595001 487332268 489723053 493266068 493936539 495962334
486.1 495962334 495788803 496911049 492387466 489994545 489117928 484578857 486292648 489240570 490352745
494.7 490352745 489161949 489122200 487892303 486203842 484368744 482261734 482098656 479432030 480391464
503.4 480391464 481040268 481191788 478797760 475478058 475889435 475148087 476716881 473364487 469466133
512.1 469466133 466779404 463831596 463302536 460639763 460447464 456962738 455543137 455864563 453938217
520.8 453938217 452116547 446797256 444999695 444390869 444221840 444299126 443851357 443535690 443683510
529.5 443683510 445699577 443567581 442471466 443047829 442947731 444145660 446755142 450626526 452817497
538.1D52817497K685852J836968J829338K629967J199226J775398K047043J358261
545.9D68179550n15365J93214P43904j92757n38253j396981n70755l72123l3188j112976
555.5D64384270j770249k146301j713715k14347j738968m88663k016983l584709j952057
564.2D48758278k562752l411522m269066k714195k749634k875595l405800k713775
571.9D24055939k335701j898270M77524m12560K121354J819114J118736O44722K047616
580.6D27638474M811363K275314L605537L337365M004059L859176K310105L033866
588.3D54875259J892662K047310L9902n03159l31993J44577K535592K38189j15318
597D60823021J193466R42497n91697l4218O21643j288872m08745j36985j41449p97310
$$ plain form
538.1 452817497 455503349 457340317 459169655 461799622 462998848 464774246 466821289 468179550
545.9 468179550 467664185 467857399 468601303 468408546 467870293 466473312 465902557 465530434 465497246 464384270
555.5 464384270 462614021 460467720 458754005 458539658 456800690 456312027 454295044 450710335 448758278
564.2 448758278 446195526 442784004 438514938 435800743 433051109 430175514 426769714 424055939
571.9 424055939 421720238 419821968 420299492 419886932 422008286 423827400 424946136 425590858 427638474
580.6 427638474 432449837 434725151 438330688 441668053 445672112 449531288 451841393 454875259
588.3 454875259 456767921 458815231 458855133 458351974 458019981 458164558 460700150 460938339 460823021
597 460823021 462016487 462958984 462367287 462333069 462954712 461665840 461257095 461120110 460978661 460181351
606.6D60181351m69818L37677l2540P08237j14174J819038K206765R74655J905403
615.3D67516594K69241o85692M17366J224366J312294J789207J655502K609978L612671
624D79721527J833077J388626K321510K033348K25906m38232M47464J379700J223068
632.7D90135994J59149J756973K833252J631165n10407r08126J251754P66983P18270
641.3D97835007O48040p71408m70314o27822J14707J715432J577530N75485Q60519
650E01457176Q64029k0866k72446r55315j74369P60345o59523k7084J678390Q65021
659.7E03515358Q75893J975593J544419M58526P23763K195282J556396m377060j7006302
668.3D91461868P647858O747627L496475K848130J254387O14624J474914K013779J975670
$$ plain form
606.6 460181351 459711533 460049210 460016670 460724907 460610733 462429771 464636536 465611191 467516594
615.3 467516594 467785835 467100143 467517509 468741875 470054169 471843376 473498878 476108856 479721527
624 479721527 481554604 482943230 485264740 487298088 487523994 487085762 487533226 488912926 490135994
632.7 490135994 490295143 492052116 494885368 496516533 496006126 495098000 496349754 497116737 497835007
641.3 497835007 498483047 497711639 497241325 496613503 496728210 498443642 500021172 500596657 501457176
650 501457176 502321205 502300339 502027893 501072578 500898209 501658554 500999031 500971947 502650337 503515358
659.7 503515358 504391251 506366844 507911263 508369789 509093552 511288834 512845230 508468170 491461868
668.3 491461868 499109726 505857353 509353828 512201958 513456345 514070969 515545883 517559662 519535332
677E19535332Q02116o63414j624832r57756m55437N16243K147484J880951J457481
685.7E22638168J690255J852378M96178m76341l09906p89032j034889j638108r69429
694.4E21459274J95961j91879l90739K92282O03180N722o98777j948165j461373r17015
704E16948471k240372k661094k366295p17392L56560R87167J355476J493073K366485
712.7E15522079J918450K146072J925850M32892k66914N42678J775895K485199M151077
721.4E30633278L847122L179321L645440M206619M434280K140083J485672K033616
729.1E55605431R86595J040725M31900J44234J012039K181130K951431K935104L248902
737.8E70537491K122879P41691j47552k35825q85429k230110p69653n31235r08737
$$ plain form
677 519535332 520337448 519674034 518049202 517091446 516636009 517152252 519299736 521180687 522638168
685.7 522638168 524328423 526180801 526676979 526200638 525890732 525101700 524066811 522428703 521459274
694.4 521459274 521655235 521463356 521072617 521364899 521968079 521973801 521275024 519326859 517865486 516948471
704 516948471 514708099 512047005 509680710 508963318 509319878 510307045 511662521 513155594 515522079
712.7 515522079 517440529 519586601 521512451 521945343 521678429 522221107 523997002 526482201 530633278
721.4 530633278 534480400 537659721 541305161 545511780 549946060 552086143 553571815 555605431
729.1 555605431 556592026 557632751 558064651 558208885 559220924 561402054 564353485 567288589 570537491
737.8 570537491 572660370 573402061 573254509 573018684 572133255 569903145 569133492 568602257 567693520
746.5E67693520k87095n32073o34842m11950j6479p74765k118454l264961l808670
755.1E55844231l871231l319512k261848j295853l5057j45493l58772N72701J05934
763.8E45235100j409378j459732o19736k98271M83742J407089K326088K772674L479996
772.5E51917572N817719N960273M925881M909172L925018L086548K689590K541390
780.2E85773163R96132J139259K372589K097626L566208L991661L324318L650245L654137
788.9F10565338K433281R78890j36376l54080j95313j050949P83387K409286K367325
797.6F17800789L262176L376656L139725K613601K509346J902352K44560j286888j110268
806.2F32452049m59289p4921J320686K132302K406807J288643J582374K042694K51465
$$ plain form
746.5 567693520 567406425 566874352 566239510 565827560 565811081 565036316 562917862 559652901 555844231
755.1 555844231 551973000 548653488 546391640 545095787 545060730 544915237 544556465 545129166 545235100
763.8 545235100 543825722 542365990 541746254 541447983 541931725 543338814 545664902 548437576 551917572
772.5 551917572 557735291 563695564 568621445 573530617 577455635 580542183 583231773 585773163
780.2 585773163 586769295 587908554 590281143 592378769 595944977 599936638 603260956 606911201 610565338
788.9 610565338 612998619 613977509 613841133 613487053 613291740 612240791 613024178 615433464 617800789
797.6 617800789 621062965 624439621 627579346 630192947 632702293 634604645 634849205 633562317 632452049
806.2 632452049 631992760 631917839 633238525 635370827 637777634 639066277 640648651 642691345 642942810
814.9F42942810j162491j765594r98040k507629l084907j315461M78936N6114j212044
823.6F31431694J780815J633835o10008j765328k827873l254471m691009l904381k906723
832.3F14886551k020950j933709k103729l4485K30751o19049o22825j349564l267784
841F03165207l744927k834930k550888l284225k812691n13687n93911r37309p9994
849.6E85812645k35748r12552j732636k060356k760887l875542m182052l735657l489342
858.3E62827873k188606q38890l8K101059L590889M083786M211540L854179L497658
867E81139450K493057L264466M052925L399696N123444O726227N158538M137802N818177
875.7F21313782M892654J580010m89693n47752l86582k020492l128396k775993j874046
$$ plain form
814.9 642942810 641780319 640014725 639016685 636509056 633424149 632108688 632587624 632643738 631431694
823.6 631431694 633212509 634846344 634236336 632471008 629643135 626388664 621697655 617793274 614886551
832.3 614886551 612865601 610931892 608828163 608793678 609024429 608405380 607782555 606432991 603165207
841 603165207 599420280 596585350 594034462 590750237 587937546 587423859 586829948 585892639 585812645
849.6 585812645 585576897 584664345 582931709 580871353 578110466 574234924 570052872 566317215 562827873
858.3 562827873 560639267 559800377 559800339 561901398 565492287 569576073 573787613 577641792 581139450
867 581139450 583632507 586896973 590949898 594349594 599473038 606199265 611357803 615495605 621313782
875.7 621313782 626206436 627786446 627296753 626749001 626362419 624341927 621213531 618437538 616563492
884.4F16563492j684036m86260O1035p24106j092186j879539k579613l046455l021660
893F02110672l678436l170967k678986k670059k059479j901398o55174j224708j657563
901.7E82413902k315368l855591l450203m503861n355339n055351m507408m564629
909.4E48806152l961715l120308l781090l799858m735146n434990n401382n735741
917.2E12835922n659027o058769n866699m494133l418083j772309l14827j86806k0484
925.8D85044785j99662k23732j23520N33829L95012j71585N08804R79462J936951K255859
935.5D90936203K417793L040505L280334L127022K645569K289123J804085K140579
943.2E11681213K296982J619530N42679m49791q35228r66339o34346j351395k413444
$$ plain form
884.4 616563492 614879456 614393196 614454231 613730125 612637939 610758400 608178787 605132332 602110672
893 602110672 598432236 595261269 592582283 589912224 587852745 585951347 585296173 584071465 582413902
901.7 582413902 580098534 576242943 572792740 568288879 562933540 557878189 553370781 548806152
909.4 548806152 544844437 541724129 537943039 534143181 529408035 523973045 518571663 512835922
917.2 512835922 507176895 501118126 495251427 490757294 487339211 485566902 485252075 485065269 485044785
925.8 485044785 484845123 484621391 484497871 485031700 485426712 485255127 485763931 486743393 488680344 490936203
935.5 490936203 493353996 496394501 499674835 502801857 505447426 507736549 509540634 511681213
943.2 511681213 513978195 515597725 516140404 515690613 514855385 513889046 513254700 511903305 509489861
951.9E09489861l324433m840545n705758o469993o605950p264824p105712o356698
959.6D61815948p329406o892510o706466o773987p809944q593483q824654r704170
967.3C99181328r445038r852943r267273r590264q859215q874931r599876q914948
975C24776840j0063667q675041q679581q415070q282184p577400o592713p405529m994259
983.7B54091396n120315m144440l641624k832756k695160l374672j119328k047195
991.4B29115906q72956j398468o47735N9261n46970M29134n90458J146393k19498R60732
1001.1B27435341Q54549p06253Q10719J61075J245633p94411m64096q21457k80705
1009.7B27440395N84431j687698K73304o20385J55964q20560n94254N34573n49889
$$ plain form
951.9 509489861 506165428 501324883 495619125 489149132 482543182 475278358 468172646 461815948
959.6 461815948 454486542 447594032 440887566 434113579 426303635 417710152 408885498 399181328
967.3 399181328 389736290 379883347 370616074 361025810 352166595 343291664 333691788 324776840
975 324776840 314713173 306038132 297358551 288943481 280661297 273083897 266491184 259085655 254091396
983.7 254091396 248971081 244826641 241185017 238352261 235657101 232282429 231163101 229115906
991.4 229115906 228242950 226844482 226196747 226256008 225709038 226138172 225547714 226694107 226474609 227435341
1001.1 227435341 228289890 227583637 228394356 228555431 229801064 229006653 228542557 227721100 227440395
1009.7 227440395 228024826 226337128 226610432 225990047 226146011 225325451 224731197 225265770 224715881
1018.4B24715881J171627k80723J315880J042022J434384J645412L28045K281571J875801
1027.1B35529900K327232J061096K702065K341594R86596J652946Q20065K486057J29547
1035.8B50037098K02465M10461K85874r3193o50883J102581r48696P31945k05307l67565
1045.4B50504780K69813K41776J885815l36190J314774M61273J408138K306557K823696
1054.1B60880432M341889K584629M534282L027993K964477K775440L911763M978351
1061.8B89999256L563652N502434M505138O227265M271793K387028K075519o89468
1069.5C17842617j724167n549621n190926n260086m796906m465446m513264k058944
1077.2B84283257j925126P64199j82152J116943J607819J858864L165474J136799K772655
$$ plain form
1018.4 224715881 225887508 225606785 226922665 227964687 229399071 231044483 231372528 233654099 235529900
1027.1 235529900 237857132 238918228 241620293 243961887 244948483 246601429 247421494 249907551 250037098
1035.8 250037098 250239563 250650024 250935898 250842705 250191822 251294403 250345707 251077652 250872345 250504780
1045.4 250504780 250774593 251016369 252902184 252565994 253880768 254342041 255750179 258056736 260880432
1054.1 260880432 265222321 267806950 272341232 275369225 278333702 281109142 285020905 289999256
1061.8 289999256 293562908 299065342 303570480 309797745 314069538 316456566 318532085 317842617
1069.5 317842617 316118450 310568829 305377903 300117817 295320911 290855465 286342201 284283257
1077.2 284283257 282358131 283122330 282940178 284057121 285664940 287523804 290689278 291826077 294598732
1085.9B94598732K166843L073864K684441L272552L959942K913475M519177L125839
1093.6C20314865L717079K233734K043686J828308O54717J335335n48401J140289J61247
1102.3C32880859l55224j06774j8119J695213M06761Q56590Q40607J987381J546326
1111C39733620J773758K100792J155738L407288K496185J834374J334877J788673J418076
1119.7C57043381N90210J058120l79104Q43773M75845N38063P51801J234436K071037
1128.4C64227562J564484K673072J225968K650146K373772O27594J160660N9623j69258
1137C76393623j571960j580849k493820k573433k316856l269348k499543l246383k351532
1145.7C54489899m067307m383125k806664k078972j414489l004074j312371j591148
$$ plain form
1085.9 294598732 296765575 299839439 302523880 305796432 309756374 312669849 317189026 320314865
1093.6 320314865 324031944 326265678 328309364 330137672 330792389 332127724 331579323 332719612 332880859
1102.3 332880859 332525635 332418861 332400742 334095955 334502716 335359306 336199913 338187294 339733620
1111 339733620 341507378 343608170 344763908 348171196 350667381 352501755 353836632 355625305 357043381
1119.7 357043381 357633591 358691711 358312607 359156380 359632225 360170288 360922089 362156525 364227562
1128.4 364227562 365792046 368465118 369691086 372341232 374715004 375342598 376503258 376562881 376393623
1137 376393623 374821663 373240814 370746994 368173561 365856705 362587357 360087814 356841431 354489899
1145.7 354489899 350422592 346039467 343232803 341153831 339739342 336735268 335422897 333831749
1153.4C33831749j110115o74400j98784J023063M26903K175598J436730K013511J628571
1162.1C40552826K112350L270302L157883N272331M482308N415344N896606O609230
1169.8C76769180O896897O165733P097778P026444P105369N837288O586991O859321
1177.5D30345001O183739O545563O512375P240219O757812O244965N726814N434227
1185.3D80990715M687881L443490K910308K922860L520355L074074K636947K493325
1193E06679955J988220J512489J274376J310043N80216j86501J8463l2882m70848l5172
1202.6E12638359N33104M98238J015815J877060K247963K186280J985855J420593J495895
1211.3E25899162J489067J026650J490669J884956K173653K282181K117729J775475
$$ plain form
1153.4 333831749 332721634 332047234 331848450 332871513 333298416 335474014 336910744 338924255 340552826
1162.1 340552826 342665176 345935478 349093361 354365692 358848000 364263344 370159950 376769180
1169.8 376769180 383666077 389831810 396929588 403956032 411061401 416898689 423485680 430345001
1177.5 430345001 436528740 443074303 449586678 456826897 463584709 469829674 475556488 480990715
1185.3 480990715 485678596 489122086 492032394 494955254 498475609 501549683 504186630 506679955
1193 506679955 508668175 510180664 511455040 512765083 513345299 513158798 513177261 513144379 512673531 512638359
1202.6 512638359 513171463 513669701 514685516 516562576 518810539 520996819 522982674 524403267 525899162
1211.3 525899162 527388229 528414879 529905548 531790504 533964157 536246338 538364067 540139542
1219E40139542K065849K255211J297951M99076o06193j044922p59697j004486j347160
1227.7E41495171j051598p31392n05791m10041q92487o35986m05045j003380j315727
1236.4E34543724j291237j136436j220246j261062r18198l88832J75743L16315M45900
1245E29265671P12013J032982J031151M94232J79901p6675k8344L38021N67283P51496
1254.7E34267731P41653P69463J151504J058541M46968K54249J90621N8174k31590
1263.4E38707314p5188N9738m8027L42102Q99200J454010J457787J651154J691360
1272E46139450Q76083N20325Q3580l51486q83102q34160m01955k65884j08757j30310
1281.7E44643784j3009M23203M83437p5684j74980m36173q30345r76753j049500o07795
$$ plain form
1219 540139542 542205391 544460602 545758553 546257629 545651436 544606514 543846817 542842331 541495171
1227.7 541495171 540443573 539712181 539206390 538796349 537903862 537267876 536862831 535859451 534543724
1236.4 534543724 533252487 532116051 530895805 529634743 528716545 528327713 528503456 528819771 529265671
1245 529265671 529977684 531010666 532041817 532536049 532715950 532639275 532610931 532948952 533516235 534267731
1254.7 534267731 535009384 535778847 536930351 537988892 538435860 538690109 538880730 538938904 538707314
1263.4 538707314 538632126 538691864 538643837 538985939 539885139 541339149 542796936 544448090 546139450
1272 546139450 547015533 547535858 547619438 547267952 546384850 545550690 545148735 544882851 544774094 544643784
1281.7 544643784 544630775 545053978 545537415 545461731 545286751 544850578 544020233 543043480 541993980 541386185
1291.3E41386185p68547p48444l76968k05803l13263k89116k64855j000824j305427
1300E36112938j664696j785469j227379m74891j031723k018166j154556o97060m74663
1308.7E25584335m48303n69191m38995j061325j423989j394310q10814r20181j443977
1317.4E17073250j248436r61952j3504J36489k36358o44112j642418k214889k160530
1326E08087540k369118k749024k725906k648926k647323k227974j875496j671372r67063
1334.7D88205338j156998j128426j175346j399841r76868p15942J54838K07710L92151
1343.4D82406616O27480J025352Q10814M48799R30901M38423o7787k58446j6441m93050
1353.1D85852661j130142o51169m14200L6164q6251O0578M9514o99348o46477l11012
$$ plain form
1291.3 541386185 540617638 539869194 539492226 539286423 538973160 538684044 538419189 537418365 536112938
1300 536112938 534448242 532662773 531435394 530960503 529928780 527910614 526756058 526058998 525584335
1308.7 525584335 525136032 524566841 524127846 523066521 521642532 520248222 519437408 518517227 517073250
1317.4 517073250 515824814 514862862 514849358 514985847 514749489 514105377 512462959 510248070 508087540
1326 508087540 505718422 502969398 500243492 497594566 494947243 492719269 490843773 489172401 488205338
1334.7 488205338 487048340 485919914 484744568 483344727 482367859 481651917 481806755 482014465 482406616
1343.4 482406616 483034096 484059448 484870262 485319061 486249962 486688385 486620598 486362152 486345711 485852661
1353.1 485852661 484722519 484071350 483657150 483693314 483607063 483667641 483717155 483017807 482371330 482060318
1362.7D82060318l86314n06821k45018n85899p10297j087875n72815O68144M26292
1371.4D79059715P53937L72124L26042P00302K73094K36550j25351K38914J65367M69399
1381D82470093L73420O25039J372566J420288J713791J120910J773377K118111J941108
1389.7D94928703J026841J98822l0251m27437o60934j224213N70831M55971n46875
1398.4D94291458j846504p93381K05841j243210j119384j631165k245483r08470p78122
1407.1D83931580q71659j312828o10008q65479k52304q4343j110992p44591r65614
1415.7D77113762o83327j290855m41284j638794j00708K084579M91600M77371j29051
1424.4D75883293J122399J564750K41432K84005k57225Q09402N65681R60503O29807
$$ plain form
1362.7 482060318 481674004 481167183 480922165 480336266 479625969 478538094 477965279 478633423 479059715
1371.4 479059715 479813652 480185776 480511818 481212120 481485214 481721764 481596413 481835327 482000694 482470093
1381 482470093 482843513 483468552 484841118 486261406 487975197 489096107 490869484 492987595 494928703
1389.7 494928703 495955544 496154366 496124115 495696678 495035744 493811531 494382362 494838333 494291458
1398.4 494291458 492444954 491651573 491857414 490614204 489494820 487863655 485618172 484709702 483931580
1407.1 483931580 483059921 481747093 481137085 480271606 480019302 479934959 478823967 478079376 477113762
1415.7 477113762 476430435 475139580 474698296 473059502 472958794 475043373 475534973 476012344 475883293
1424.4 475883293 477005692 478570442 478811874 479095879 478838654 479648056 480213737 481174240 481804047
1433.1D81804047N54390J810684P13691K28577J293755K421989Q46672J82343O21643
1441.8D90477791L03345Q54148m55169N70068J72539m45137l59497p3853O31294r09843
1451.4D90765686n45654r40972j60141r92698j341973j122856m837341K973251J351929
1460.1D85149231K225800O35452O52733J708336o2752L740310K073670L081207K049065
1468.8E01253052L060417L460655J533165N508537L366280O441154L406029M502144
1476.5E32531433N338783L942871M012223K135010L512649K556610L592301K673339
1484.2E60295219J939278K865944J227570L278122J472740J826629K923661L878364
1491.9E79707527L167648J182786J822662m75464j41869K572098J905937J878319K228279
$$ plain form
1433.1 481804047 482358437 484169121 484882812 485111389 486405144 488827133 489673805 489856148 490477791
1441.8 490477791 490781136 491635284 491180115 491750183 491922722 491477585 491118088 491044235 491675529 490765686
1451.4 490765686 490220032 489279060 489118919 488126221 486784248 485661392 480824051 483797302 485149231
1460.1 485149231 487375031 488010483 488663216 490371552 490308800 494049110 496122780 499203987 501253052
1468.8 501253052 504313469 507774124 509307289 514815826 518182106 524623260 528029289 532531433
1476.5 532531433 537870216 541813087 545825310 547960320 551472969 554029579 557621880 560295219
1484.2 560295219 562234497 565100441 566328011 569606133 571078873 572905502 575829163 579707527
1491.9 579707527 582875175 584057961 585880623 585405159 585263290 587835388 589741325 591619644 593847923
1500.6E93847923K375527R56611J811905R09462L35846o507797n393410O939011K987976
1509.3E98263054K672386J382713J545792P96165J421814R85260l97224n01785j336975
1518F04831200L532333J133575l125953q77648J002160L423614J205864L08342J255302
1526.6F12688789J184960j76697J133690J451225q29010j70021k318115j744499J929016
1535.3F13149338O41708O88553o0310m935456p211380O463166K219963j350403J510734
1544F11115913l36036l0060P31430p553m15535k139626j392479R91135O88858o40030
1553.6F08566017l037300m89960J337586O87065p845802p610894L810959L767433J904374
1562.3F01089478N60607k32620j229439L53699N37682l74337j708641l405075J950417
$$ plain form
1500.6 593847923 596223450 597180061 598991966 599901428 600237274 593729477 588336067 595275078 598263054
1509.3 598263054 600935440 602318153 603863945 604660110 606081924 607067184 606669960 606168175 604831200
1518 604831200 608363533 609497108 606371155 605493507 606495667 609919281 611125145 611433487 612688789
1526.6 612688789 613873749 613697052 614830742 616281967 615452957 615282936 612964821 611220322 613149338
1535.3 613149338 613791046 614479599 614419289 609483833 602272453 608735619 610955582 609605179 611115913
1544 611115913 610779877 610749817 611481247 611473694 611058159 608918533 607526054 608517189 609206047 608566017
1553.6 608566017 605528717 605038757 606376343 607063408 599217606 591606712 595417671 599185104 601089478
1562.3 601089478 601650085 601417465 600188026 600541725 601079407 600705070 598996429 595591354 597541771
1571E97541771Q74901m27246j64070l3150j755715l619308L610229K372094L65905
1579.7E98765411m23545p42875l72696l93219m60014o91337n85862m53148k89993n5199
1589.3E94297523p81784m97894n27611n99784j115304j342010p96280j016045m18243
1598E87202568j256294j128235q80585r13772o25344j042709m59747j080323j181564
1606.7E78633995j552658j002617j542740j961593l81546j599274j375084j949921
1614.4E67268562r02786j535416n809936J685867J3695o10924j949997j594734k470436
1623.1E54093895k957497J398125n02701o35261k074318j131058r2163m39949o29273
1631.7E47029800j461143k48566j236953m131585l56979J481590Q63915L55110P07168
$$ plain form
1571 597541771 598416672 597989426 597825356 597792206 596036491 592417183 596027412 598399506 598765411
1579.7 598765411 598341866 597598991 597226295 596833076 596373062 595681725 595095863 594642715 594352722 594297523
1589.3 594297523 593515739 593017845 592490234 591890450 590775146 589433136 588636856 587620811 587202568
1598 587202568 585946274 584818039 583937454 583023682 582398338 581355629 580895882 579815559 578633995
1606.7 578633995 577081337 576078720 574535980 572574387 572192841 570593567 569218483 567268562
1614.4 567268562 566365776 564830360 559020424 560706291 560719986 560109062 558159065 556564331 554093895
1623.1 554093895 551136398 552534523 552031822 551396561 549322243 548191185 548099022 547659073 547029800
1631.7 547029800 545568657 545320091 544083138 539951553 539594574 541076164 541940079 542295189 543002357
1640.4E43002357J80398J111755l20168O55556O76689j667251N00068O21453L359069
1649.1E48119926J598778K237091K648087l978195k989426O387520M899864K900963
1656.8E61824608K631225J477776J483574J499367J790237J880455J608849L340149
1664.5E77536240K598457K590294J974640J140518L04146L255806L898010J614304
1672.3E94912415K940750K762489J860313J783715K850456L041573K009620K042122
1680F14203453K304497L090439K579384Q52890P26966M148713M126777K235489J089211
1688.6F35357819K170181K385177K524109K619019J809997K046738M99649l140030
1696.4F46272659M537964L760452L065262j231231j626511M222412K783890J109619
$$ plain form
1640.4 543002357 543182755 544294510 543974342 544629898 545306587 543639336 544139404 544760857 548119926
1649.1 548119926 549718704 551955795 554603882 550625687 547636261 554023781 558923645 561824608
1656.8 561824608 564455833 565933609 567417183 568916550 570706787 572587242 574196091 577536240
1664.5 577536240 580134697 582724991 584699631 585840149 586144295 589400101 593298111 594912415
1672.3 594912415 597853165 600615654 602475967 604259682 607110138 610151711 612161331 614203453
1680 614203453 616507950 619598389 622177773 623030663 623757629 627906342 632033119 634268608 635357819
1688.6 635357819 637528000 639913177 642437286 645056305 646866302 648913040 649412689 646272659
1696.4 646272659 650810623 654571075 657636337 656405106 654778595 659001007 661784897 662894516
1704.1F62894516O5155J358337Q76008K241210K173844R11026J88751O42014J141586
1712.8F72492447J68533j428833q19626J818390m34570k882462M830399L219070J571350
1721.4F78534698J93406p1106O66580J152573Q84552L60794M26406M11835q2168N06591
1731.1F82984161K313919J876374l447876j428223M449539K865982O20575J008454
1738.8F91242905q89969o67420K889710J150589j88446J213531K287827J365509J077957
1747.5F99482193R19113N86395L091355P96966P87964K637024J585541J445465J135254
1756.2G12467270n0202J565400K941513K250824K008362j082840P3547K449646N12695
1764.8G23136215N10254N19180M69056m62418J624603K468949p24869j366425J101380
$$ plain form
1704.1 662894516 662959671 664318008 665194016 667435226 669609070 670520096 670708847 671350861 672492447
1712.8 672492447 672660980 671232147 670412521 672230911 671796341 668913879 673744278 676963348 678534698
1721.4 678534698 678728104 678656998 679323578 680476151 681360703 681721497 682147903 682559738 682477570 682984161
1731.1 682984161 685298080 687174454 683726578 682298355 686747894 689613876 690234451 691242905
1738.8 691242905 690352936 689685516 692575226 693725815 693537369 694750900 697038727 698404236 699482193
1747.5 699482193 700401306 700987701 704079056 704876022 705663986 708301010 709886551 711332016 712467270
1756.2 712467270 712417068 713982468 716923981 719174805 721183167 720100327 720173874 722623520 723136215
1764.8 723136215 723646469 724165649 724634705 724172287 725796890 728265839 727540970 726174545 727275925
1773.5G27275925L434295J072388n68390J236496n7373K39410n29251J86081J363755
1782.2G33653336J164932J299743L0671O93893J204300O60248k27814j8768j075669
1790.9G37384872j077804l56598K27203K267914O43997P63855J887284J145935m25721
1799.5G42460937j314163J072007J6174M05197M75159m3030N56259J91193O91299P54776
1809.2G45265808O86188k66037R85947R74197K0523K97699q30612j76010m68216K01568
1818.8G46691055Q70285L48816P25708J49994R51462L45612j025696J62506P81784
1827.5G50001526M40292j662826k533951J139984K302322O69327N28641R37042M01230
1836.2G52223587j6479l61710Q25348k26975j52816n62897n17883n59540l291168K289428
$$ plain form
1773.5 727275925 730710220 731782608 731214218 732450714 732393341 732632751 732103500 732289581 733653336
1782.2 733653336 734818268 736118011 736148682 736842575 738046875 738707123 738479309 738460541 737384872
1790.9 737384872 736307068 735950470 736177673 738445587 739089584 739853439 741740723 742886658 742460937
1799.5 742460937 741146774 742218781 742234955 742640152 743115311 743072281 743628540 743819733 744511032 745265808
1809.2 745265808 745951996 745685959 746671906 747646103 747666626 747964325 747133713 746957703 746489487 746691055
1818.8 746691055 747561340 747910156 748635864 748785858 749737320 750082932 749057236 749219742 750001526
1827.5 750001526 750441818 748778992 746245041 747385025 749687347 750356674 750885315 751822357 752223587
1836.2 752223587 752207108 751845398 752670746 752443771 752290955 751728058 751210175 750650635 747359467 749648895
1845.8G49648895K112656R45282M90188O28434P73697k95563K29492n43137m52880
1854.5G53537064l66211l96576p6676j79596P33185M18854R23004L57666M44336J59760
1864.2G55554810q79441m6463p93228m74243j619949k48566J724243J075363J016693
1872.8G55309219K56119O61087K56577R5520j21384k21939p1793p48825R5063l45536
1882.5G55164108j01242K47421M07258Q73718P61490J280822m91180j339645M32052
1891.2G57234802M67301k91596m66003p40433m17938J326370N20783K42691N83114
1899.8G58459091N96466N34439j01242K9755q01544l79639l72543q15583j58386M2572
1909.5G57033386J46637N15824J427002K24456L54843L50037n71670N0430j868744
$$ plain form
1845.8 749648895 751761551 752706833 753197021 753825455 754599152 754303589 754533081 753989944 753537064
1854.5 753537064 753170853 752774277 752697601 752518005 753251190 753670044 754593048 754950714 755395050 755554810
1864.2 755554810 754675369 754628906 753835678 753361435 751741486 751492920 753217163 754292526 755309219
1872.8 755309219 755565338 756226425 756483002 756578522 756457138 756235199 756163406 755414581 755509644 755164108
1882.5 755164108 755062866 755310287 755717545 756591263 757352753 758633575 758142395 756802750 757234802
1891.2 757234802 757702103 757410507 756944504 756204071 755786133 757112503 757633286 757875977 758459091
1899.8 758459091 759055557 759589996 759488754 759518509 758716965 758337326 757964783 757149200 756990814 757033386
1909.5 757033386 757180023 757695847 759122849 759347305 759702148 760052185 759480515 759530945 757662201
1918.2G57662201m90952N27115k2812k823o36749M06952J386490J609421L28216k12021
1927.8G60555038m66918l96424m3335o80618o66504o04095L81164L79105L54385N97077
1937.5G59408875M11453P55081Q9569K61841j028900j775284K35443K13165j06277
1946.1G58464966j65787M68674M35791O38962Q68454Q90426J02234o70166n3024o26679
1955.8G60353851m57916n23300l01666L21960Q0719O35376O10199Q49152K76031R5368
1965.4G61939774L7307p97271l15018l11127k83356m10842K2354n3635Q163R90067
1975.1G60826416Q22220M91333j0529M85688p7591r02558n75180m53110r7961m49600
1984.7G60059128n4856Q1254N49163P69883L89328P52258l53317m69056p8430j08413
$$ plain form
1918.2 757662201 757171249 757698364 757675552 757672729 757035980 757442932 758829422 760438843 760767059 760555038
1927.8 760555038 760088120 759691696 759648361 758967743 758301239 757697144 758078308 758457413 758811798 759408875
1937.5 759408875 759820328 760575409 760664978 760926819 759897919 758122635 758358078 758571243 758464966
1946.1 758464966 758299179 758767853 759203644 759842606 760711060 761601486 761703720 761033554 760980530 760353851
1955.8 760353851 759895935 759372635 759070969 759392929 759473648 760109024 760719223 761568375 761844406 761939774
1965.4 761939774 761977081 761179810 760864792 760553665 760270309 759859467 759881821 759828186 759836349 760826416
1975.1 760826416 761648636 762139969 762129440 762615128 762537537 761634979 761059799 760606689 760508728 760059128
1984.7 760059128 760004272 760085526 760634689 761404572 761793900 762546158 762192841 761723785 761645355 761536942
1994.3G61536942l03803p05948k56500m2267L66135K54745N63584P52639L64228L4790
2004G62564545l89023m74014p62024l09296m57535m94385k09579r5825L72009M58450
2013.6G60203323Q40836J94626l50647p65076l37067K18888o21109p05261j068039
2022.3G57610474m18778L15933M11072L65143M9667M69513J79749K78168k50092p76062
2032G58234787r53674r26209k32696n84870Q5831M36783J81122L6087K37426O08368
2041.6G57122955J96610N9662j113816r26284n36042m19464j220l72544K20947J73722
2051.2G54404526M31976K46582M68674Q71048n1193j57166p46231l22113n39551p62558
2060.9G53843994m883K5483M56466J75095Q28018Q08258L90625M11758l06091n69382
$$ plain form
1994.3 761536942 761233139 760527191 760270691 760228424 760594559 760849304 761412888 762165527 762529755 762564545
2004 762564545 762175522 761701508 760939484 760630188 760172653 759678268 759468689 759372864 759744873 760203323
2013.6 760203323 761044159 761238785 760888138 760123062 759785995 760004883 759383774 758678513 757610474
2022.3 757610474 757191696 757507629 757918701 758283844 758333511 758803024 758982773 759260941 759010849 758234787
2032 758234787 757281113 756354904 756122208 755537338 755623169 756059952 756241074 756277161 756514587 757122955
2041.6 757122955 757319565 757379227 756265411 755339127 754803085 754383621 754382401 754009857 754230804 754404526
2051.2 754404526 754836502 755083084 755551758 756422806 756371613 756214447 755468216 755146103 754606552 753843994
2060.9 753843994 753839111 753864594 754321060 754496155 755324173 756132431 756523056 756934814 756628723 756059341
2070.5G56059341r62219p23495p34711k86865L53622N55420R82437N66635J72120J85623
2080.2G56167908P60116o103q23288q30612q75931J27716J09177k99302n9738N19715
2089.8G54789658O89315P82166P10144J52512j4496o65360k76184m48456n11627n2261
2099.5G55155411l34397L30506J96457N79071P95212O94961M90036m47082k49176k28425
2109.1G56982574j35955p41501n97534K5940P6522M86679L11356R46961P15332M40216
2118.7G58510590r7199p73315j76392m28696m29611p09762n00946l10440K44827Q79135
2128.4G56208191M59137J308670P38220j1978j30920o47507o72379p02743m09317j83716
2138G55955658L73764J09634M34189Q19321L44696N22156O2713j85165n30548m91791
$$ plain form
2070.5 756059341 755097122 754373627 753638916 753352051 753705673 754261093 755243530 755810165 755982285 756167908
2080.2 756167908 756928024 756921921 756098633 755268021 754392090 754519806 754628983 754329681 754269943 754789658
2089.8 754789658 755478973 756261139 756971283 757123795 757109299 756443939 756167755 755719299 755207672 755155411
2099.5 755155411 754821014 755151520 755347977 755927048 756722260 757417221 757907257 757460175 757210999 756982574
2109.1 756982574 756846619 756105118 755507584 755533524 755610046 756096725 756408081 757355042 758070374 758510590
2118.7 758510590 758413391 757640076 757463684 757034988 756605377 755895615 755394669 755084229 755329056 756208191
2128.4 756208191 756667328 757975998 758714218 758702240 758571320 757923813 757251434 756548691 756139374 755955658
2138 755955658 756329422 756439056 756873245 757692566 758037262 758559418 758622131 758436966 757906418 757414627
2147.7G57414627n87463m12140O8207l74833K49176M81949O72608P51877P57675O70547
2157.3G59692230l61404m11072m52270n16892p30667l18527K60238L96271O90765N78385
2167G58827057J077423O50787M70429K32773o26755n86548k87628K65961n73273m62494
2176.6G58987732L74908O69632Q75321K77252O67801P99332N16738j66244o67496m44794
2186.3G61890182l37829k93732j73874N62516L05328P42645Q07724K55661Q71735K25296
2195.9G64855652j54877l73764m44870k48489j78910k18734l23258L21579K46659P42797
2205.5G64223785J021882P51419M02908j37634N2642m21218n57785n69382l510L49884
2215.2G65112991N4627K98767N57785J024170M60205M83169J56785o8055k3651j100769
$$ plain form
2147.7 757414627 756827164 756415024 756483231 756108398 756357574 756839523 757512131 758264008 759021683 759692230
2157.3 759692230 759330826 758919754 758467484 757950592 757219925 756901398 757161636 757557907 758248672 758827057
2167 758827057 759904480 760555267 761025696 761258469 760631714 760045166 759757538 760023499 759450226 758987732
2176.6 758987732 759362640 760032272 760907593 761184845 761852646 762651978 763168716 763002472 762334976 761890182
2186.3 761890182 761552353 761258621 761084747 761647263 761952591 762695236 763502960 763758621 764630356 764855652
2195.9 764855652 764700775 764327011 763882141 763633652 763454742 763236008 762912750 763234329 763480988 764223785
2205.5 764223785 765245667 765997086 766399994 766262360 766315002 765893784 765335999 764766617 764763107 765112991
2215.2 765112991 765167618 765466385 766024170 767048340 767508545 767991714 768148499 768080444 768056793 766956024
2224.8G66956024o15768m66233l1890J44500L53928J153717O49567O51626K45362K54135
2234.5G69294968j22834o73370n57175o23855m07410n70145K76795K78702O07528J043320
2244.1G68546524K66647N50461K24228p6675l70026l39966o91147r68780l2883Q7357
2253.8G67195740P2403P0800Q32139Q47320N34515M08249k90603j15433o23627n52749
2263.4G68378754n36728o85654l83072K3728P19604L20358N77240J033097R34982o9962
2273G70312347o67266o33469q92563n7678l94974k70843M07028O31790N92270N39627
2282.7G69566269R68780L83912M62951n77163j302491q53424r94339o15692q56933
2291.4G66181870k19498k4872P30133Q35266L43170M49066o82144l22570j267167j214599
$$ plain form
2224.8 766956024 766340256 765874023 765842133 765986633 766340561 767494278 768143845 768795471 769040833 769294968
2234.5 769294968 769172134 768498764 767941589 767317734 766910324 766340179 766616974 766895676 767503204 768546524
2244.1 768546524 768813171 769363632 769587860 769511185 769141159 768801193 768110046 767141266 767108383 767195740
2253.8 767195740 767268143 767338943 768171082 769018402 769552917 769961166 769670563 769555130 768931503 768378754
2263.4 768378754 767842026 767156372 766773300 766797028 767516632 767836990 768414230 769447327 770382309 770312347
2273 770312347 769645081 769011612 768119049 768061371 767666397 767395554 767802582 768434372 769026642 769566269
2282.7 769566269 770535049 770918961 771381912 770804749 769502258 768648834 767654495 767038803 766181870
2291.4 766181870 765962372 765937500 766667633 767502899 767846069 768295135 767612991 767290421 766023254 764808655
2301G64808655r55353j565475O0958m3258q5297o46362m2267L69720l96194j62354
2310.7G61342773r70764n54886j482086j450729j466751j384506N2642r10720J525
2319.3G53176498n23605q76083p43866n42374L6469j208039p85599j618042j149597
2328G45765762j235962q22296k53143m94461J154709Q05969J115494k017517k249832
2336.7G41768723k24915q45795q71658j794510J32828p81937R33380J319199N28870
2345.4G40164185L207321L464279M402618P88880k757187l246231l819809l122635
2353.1G39081421k555390l150177l606033r68094L75443Q03680m06799j190262J994782
2361.8G30378571M98962m0360j114807j59988J614838R23538K137375K839889K944107
$$ plain form
2301 764808655 763853302 762287827 762348785 762305527 762220230 761573868 761531601 761901321 761505127 761342773
2310.7 761342773 760372009 759817123 758335037 756884308 755417557 754033051 754085693 753174973 753176498
2319.3 753176498 752652893 751776810 751032944 750490570 750527039 749319000 748533401 746915359 745765762
2328 745765762 744529800 743707504 743454361 742959900 744114609 744920578 746036072 744018555 741768723
2336.7 741768723 741543808 740698013 739826355 738031845 738164673 737382736 738316116 739635315 740164185
2345.4 740164185 743371506 746835785 751238403 752027283 749270096 746023865 742204056 739081421
2353.1 739081421 736526031 733375854 729769821 728801727 729177170 729980850 729574051 728383789 730378571
2361.8 730378571 730877533 730837173 729722366 729562378 731177216 732100754 734238129 737078018 740022125
2370.4G40022125J807404K706909K434082J690750J756439R11103R37423M86603O15082
2379.1G53367920N29556J487503K168045J915360K181320J057816O11419J32981k61078
2387.8G63190842l41950r75342q83178o96869l99170j09329O01577O97861P16477O67419
2397.4G62468338l5629r0637o98319p69501o68335o75888p73849o43158K46277J77841
2407.1G58537140L67203N06286O31485Q8043m41513n4855o39954q64105j056137r65042
2416.7G56108551o01883n9662J08567R3536Q14133J30844n0507k68249m76456k76184
2426.4G55522690q57392r67788j237335k81296K17056M5929J80893r9793K89002J61743
2436G52973709p4158m51736l75748o15692j217041p93838o33393l09448q9111K61764
$$ plain form
2370.4 740022125 741829529 744536438 746970520 748661270 750417709 751328812 752266235 752752838 753367920
2379.1 753367920 753897476 755384979 757553024 759468384 761649704 762707520 763318939 763451920 763190842
2387.8 763190842 762848892 761873550 760990372 760293503 759894333 759785004 760386581 761084442 761800919 762468338
2397.4 762468338 762432709 762342072 761643753 760874252 760205917 759530029 758756180 758113022 758359299 758537140
2407.1 758537140 758904343 759410629 760042114 760130157 759688644 759633789 758993835 758129730 757073593 756108551
2416.7 756108551 755506668 755447006 755555573 755649109 756463242 756594086 756543579 756275330 755798874 755522690
2426.4 755522690 754665298 753697510 752460175 752178879 752395935 752441864 752622757 752522964 752811966 752973709
2436 752973709 752899551 752447815 752072067 751456375 750239334 749445496 748812103 748502655 748413544 748675308
2445.7G48675308K3804K23083M03367m92249k23312n27573n35736p93610j148681m02069
2455.3G45202332l57056j52741j50528J81580J38855K289K62832o9122m46701r98840
2465G43612900n17960o20575j111145o60095L3646M73938J33514L61481J5411l81164
2474.6G41339951l74756l89328j63880q12301j079026q86001l98483K1667J21384K20108
2484.2G37599335K90985L91083j11313l45612o22101m78363l50647r02252o90079m23965
2493.9G34357071l052K25983R7275K11639J32217j17797j06278r2316n40924n98526
2503.5G33565292m22058n15899p91855m64859r5215M6081M55246M9057J55182K90757
2513.2G32271729p1717m10843p78198n81589n70907l41263o58417k47726O74514J92872
$$ plain form
2445.7 748675308 748699112 748922195 749325562 748833313 748610001 748082428 747546692 746753082 745604401 745202332
2455.3 745202332 744845276 744692535 744542007 744723587 744862442 744864731 745127563 745058441 744611740 743612900
2465 743612900 743094940 742474365 741363220 740703125 740736771 741210709 741344223 741705704 741721115 741339951
2474.6 741339951 740965195 740575867 740411987 739599686 738520660 737634659 737236176 737257843 737379227 737599335
2484.2 737599335 737890320 738281403 738170090 737824478 737202377 736724014 736373367 735471115 734781036 734357071
2493.9 734357071 734354019 734580002 734677277 734888916 735021133 734903336 734797058 734704742 734163818 733565292
2503.5 733565292 733143234 732627335 731835480 731370621 731275406 731321487 731776733 731825790 731980972 732271729
2513.2 732271729 732200012 731789169 731010971 730429382 729858475 729517212 728858795 728611069 729285583 729478455
2522.8G29478455P9269l8300j29394j92795l93753p28607q07572o82220q40912l16391
2532.5G25427780q6517K32620k060j33667L20587k20489l21503m39300l99628q07495
2542.1G23570328j021424n18722m07333O1874j53L13340R2163l50800n19257p59277
2551.7G20460739j8158l37601l21350l82995q47473m39835k93274k23312k06833K44293
2561.4G17634201M1809k42081m79278o85654m41437p50274k53449p6370k63138n84411
2571G13899918n24369P2861l40271k7847J51825j76392n03235m54559q1635l57818
2580.7G11658478n33600r17587m81339P0954R2086R6360j63880j52969m78668o93207
2590.3G08496628l58200K25677k54822p76214n68390n96771j40381k6245M52804L72773
$$ plain form
2522.8 729478455 729557724 729519424 729390030 729197235 728803482 728074875 727267303 726585083 725744171 725427780
2532.5 725427780 725341263 725573883 725571823 725438156 725758743 725538254 725216751 724777451 724377823 723570328
2542.1 723570328 722548904 722030182 721622849 721684723 721684570 721997910 722090073 721739273 721220016 720460739
2551.7 720460739 720442581 720104980 719783630 719400635 718553162 718113327 717820053 717596741 717389908 717634201
2561.4 717634201 717676010 717433929 716954651 716268997 715827560 715077286 714823837 714747467 714484329 713899918
2571 713899918 713375549 713448410 713108139 713080292 713232117 713055725 712552490 712097931 712016296 711658478
2580.7 711658478 711124878 710207291 709725952 709796906 709888992 709985352 709821472 709668503 709189835 708496628
2590.3 708496628 708138428 708364105 708109283 707333069 706764679 706167908 706027527 706001282 706454086 706826859
2600G06826859j74256j68228q13522p47528m11835k38648l14254n14603m68216k09732
2609.6G02766037m578l80935j59455j86081m7760j19781q41904p63016o33697o38809
2619.3F98990021r53064m99191k75956l89480N2795j24435j70441n78842n20325n11551
2628.9F95019531p99789m34647m30298n04913r77554q11920m29535k87400L968k86332
2638.5F90061111n08575n60226m41666q40836j066208p55996j91574r4681q64258o03943
2648.2F84133148m58298n49011m15954p1106J7242q26187o90308m70962o87332o90689
2657.8F79290543l00980l92227r90219n77240j78910j0528n60074q66318o97326o76423
2667.5F74040298j87835m68140m38461l23563m27627n22919p18231j21079j96228m82025
$$ plain form
2600 706826859 706652603 706484375 705670853 704923325 704511490 704272842 703958588 703443985 702975769 702766037
2609.6 702766037 702761459 702380524 702221069 702034988 701987228 701867447 701025543 700262527 699628830 698990021
2619.3 698990021 698036957 697537766 697261810 696872330 696925125 696800690 696630249 696051407 695531082 695019531
2628.9 695019531 694219742 693785095 693354797 692849884 691872330 691060410 690630875 690343475 690347443 690061111
2638.5 690061111 689552536 688992310 688550644 687709808 686643600 685887604 685696030 685601349 684737091 684133148
2648.2 684133148 683674850 683125839 682709885 682638779 682656021 681829834 681139526 680668564 679981232 679290543
2657.8 679290543 678989563 678597336 677607117 677029877 676850967 676840439 676280365 675414047 674716721 674040298
2667.5 674040298 673852463 673384323 672945862 672622299 672194672 671671753 670953522 670832443 670636215 670154190
2677.1F70154190l88107j01547l7385p87963j210022r34449k02407O3858k21100m45328
2686.8F65889740l78113k12173l85361p35397o21567m8599l06931p05871n08805k18658
2696.4F61768265m55094q19625l10364j02616m25491p60269p80106o18133l23715k17591
2706F56955261p16476p19528n33371k41089m92401p33719m73099o87027m09851m31442
2715.7F51517258m13590l87573l73764j70517n60150k56500m06189n71442l99857m41665
2725.3F47536011K8839l81928r71603p84760l33252j27868k00882l09067p9346n5618
2735F44320526m67529k51999n74188r00574o90079k53448l2196n08881l23563j40762
2744.6F40177307K45743K3727p39250m95262l22952k72331n30930n49622n60264m25720
$$ plain form
2677.1 670154190 669766083 669664536 669627151 668839188 667629166 666694717 666492310 666556168 666335068 665889740
2686.8 665889740 665511627 665299454 664914093 664178696 663557129 663508530 663201599 662495728 661986923 661768265
2696.4 661768265 661313171 660493546 660183182 660080566 659655075 658894806 658114700 657496567 657172852 656955261
2706 656955261 656238785 655519257 654985886 654744797 654252396 653518677 653045578 652358551 651948700 651517258
2715.7 651517258 651103668 650716095 650342331 650171814 649611664 649355164 648948975 648377533 647977676 647536011
2725.3 647536011 647564850 647182922 646211319 645426559 645093307 644965439 644764557 644455490 644376144 644320526
2735 644320526 643852997 643600998 643026810 642126236 641436157 641182709 641150513 640641632 640318069 640177307
2744.6 640177307 640423050 640446777 639707527 639212265 638889313 638616982 638086052 637536430 636976166 636550446
2754.3F36550446j50795l90130k47077k52762j25237k96058m38271k61726l74756k60392
2763.9F33753242l43894k91443m19617k20261k44407n15480r54j15814k64931m72946
2773.5F30863495p18155n65491m16336m44717m30870k10305n93147n87044j65672k34985
2783.2F26496773r64585p03010Q4114n00069n79109p26356m18511J0147n14488q03032
2792.8F21381874j075630n54733n80979p11365m69093m94079m21753r28193q18061
2801.5F15327988p32956r10111j155891j188851p30400o35337l40882l38020o27213
2810.2F08668327j065902r99604j016845j169663r14001j224022q80013r62066j041260
2818.9E99394951q17909q42209n61562q27217q03833j513634j374397p64198j398125
$$ plain form
2754.3 636550446 636399651 636009521 635762444 635509682 635384445 635088387 634650116 634388390 634013634 633753242
2763.9 633753242 633409348 633117905 632698288 632478027 632233620 631718140 631717186 631601372 631336441 630863495
2773.5 630863495 630145340 629579849 629163513 628718796 628287926 628077621 627484474 626897430 626731758 626496773
2783.2 626496773 625532188 624829178 624913292 624413223 623834114 623107758 622689247 622699394 622184906 621381874
2792.8 621381874 620306244 619751511 619170532 618459167 617990074 617495995 617074242 616146049 615327988
2801.5 615327988 614595032 613684921 612529030 611340179 610609779 609974442 609633560 609295540 608668327
2810.2 608668327 607602425 606602821 605585976 604416313 603502312 602278290 601398277 600436211 599394951
2818.9 599394951 598577042 597734833 597173271 596346054 595542221 594028587 592654190 591889992 590491867
2827.6E90491867j386986j343612q44956j006355j220627r13734j267205j058654r03550
2836.2E80546188r78241j545868j845016j579514j694984j847382j778259j727829
2843.9E67549095j852646j498375j779861k128334k246246k128449j440620j470223
2851.7E53004341j301269j695786j509399q91800p63893l37677j170159r29870n67322
2860.3E43837166j259079j289978j128197j173363j798553j639710j691284k136459
2868.1E31720543k011910j735572j398926j895218k348518k499199k244950k015114
2875.8E15571136k297096k236938k250519k227173j872024j429253j196976j075287
2883.5E00985870j254005j259995j124153j149330m26178m44259r72062q56056n85480
$$ plain form
2827.6 590491867 589104881 587761269 586916313 585909958 584689331 583775597 582508392 581449738 580546188
2836.2 580546188 579567947 578022079 576177063 574597549 572902565 571055183 569276924 567549095
2843.9 567549095 565696449 564198074 562418213 560289879 558043633 555915184 554474564 553004341
2851.7 553004341 551703072 550007286 548497887 547606087 546842194 546504517 545334358 544404488 543837166
2860.3 543837166 542578087 541288109 540159912 538986549 537187996 535548286 533857002 531720543
2868.1 531720543 529708633 527973061 526574135 524678917 522330399 519831200 517586250 515571136
2875.8 515571136 513274040 511037102 508786583 506559410 504687386 503258133 502061157 500985870
2883.5 500985870 499731865 498471870 497347717 496198387 495772209 495327950 494355888 493499832 492914352
2892.2D92914352n33142n20668j03111p4921j46827o04172m26941m3793q25767r44863
2901.8D88690147o81343l09944p67975j053810p07931p95975l33710r18197j145974
2910.5D81975288p67250j190033j675224k130661j989098j874008j799431k384719
2918.2D68164864k340813j380997j151657r82704j582336j377755n81436p19948r63592
2926.9D57083626q58689m36210l19939K38457P31964O54793J26266O64406J979790
2935.6D59864464J779213J863136J832008J412735J962548K564163K466850K369576
2943.3D76114693K460632K196198K359924K414741K772103K908897K337074K470436
2951D96034698K490311K601128K358055J707649J653481K103920K357254K170944K017441
$$ plain form
2892.2 492914352 492381210 491860542 491757431 491682510 491535683 490931511 490504570 490460777 489635010 488690147
2901.8 488690147 488008804 487698860 486930885 485877075 485169144 484373169 484039459 483121262 481975288
2910.5 481975288 481208038 480018005 478342781 476212120 474223022 472349014 470549583 468164864
2918.2 468164864 465824051 464443054 463291397 462308693 460726357 459348602 458767166 458047218 457083626
2926.9 457083626 456224937 455788727 455468788 455707245 456439209 457094002 457220268 457884674 459864464
2935.6 459864464 461643677 463506813 465338821 466751556 468714104 471278267 473745117 476114693
2943.3 476114693 478575325 480771523 483131447 485546188 488318291 491227188 493564262 496034698
2951 496034698 498525009 501126137 503484192 505191841 506845322 508949242 511306496 513477440 515494881
2959.7E15494881K194214K775993K011948J474075J938019J751785J218109Q85506
2967.4E29744530J522407J426087J503830J921119J530838J622658J415367J158905
2975.1E41845741J176186J728935J871910J403733J353874J179619J234970J022682
2982.8E52817650J115837J321144J511650J608849J241455J392669R71184Q28057P91397
2991.5E63599892M36706O04248N18418O38733O16416M70772M12674L39699M54636O33087
3001.1E68725281L14903m55093m52233j94053j30997j22795P6866K70462J02386k21366
3010.8E67913361o09551n45273m77791n19981p20520p58667p92808p87125n63088r48677
3020.4E61189880n58815n33790r75342q12950p98187l79105p12204j099091j076812
$$ plain form
2959.7 515494881 517689095 520465088 522477036 523951111 525889130 527640915 528859024 529744530
2967.4 529744530 531266937 532693024 534196854 536117973 537648811 539271469 540686836 541845741
2975.1 541845741 543021927 544750862 546622772 548026505 549380379 550559998 551794968 552817650
2982.8 552817650 553933487 555254631 556766281 558375130 559616585 561009254 561980438 562808495 563599892
2991.5 563599892 564036598 564640846 565159264 565797997 566414413 566885185 567297859 567637558 568092194 568725281
3001.1 568725281 569040184 568585091 568132858 567938805 567807808 567685013 567761879 568032341 568134727 567913361
3010.8 567913361 567303810 566758537 566280746 565760765 565040245 564281578 563488770 562701645 562138557 561189880
3020.4 561189880 560631065 560097275 559121933 558308983 557510796 557131691 556419487 555320396 554243584
3029.1E54243584q96607r32770j669921j317864p14912n04074m94996n95359j077309
3037.8E46039772j431274r45321q19969p99942j017570j235695j515083j550103p70416
3046.5E35954399n15823j044655j372757n51758q94699j663055j203919j314506j194268
3055.1E26198959j137466j469536j236725o29005q17185j125908j016006j230965q26797
3063.8E16709366j094933j140098j010590j453705j011276j067734j064338j016617
3071.5E07850075q65479r61456j367798q76884p41578p94601j072464j160507j389656
3080.2D98619652j459084j021995j142388q66890j043510j011925j316376j799430
3087.9D88958054p34559l27339q71887j590881j373406j199646j448402j059036j149483
$$ plain form
3029.1 554243584 553346977 552414207 550744286 549426422 548711510 548207436 547712440 547117081 546039772
3037.8 546039772 544608498 543663177 542843208 542043266 541025696 539790001 538274918 536724815 535954399
3046.5 535954399 535438576 534393921 533021164 532469406 531574707 529911652 528707733 527393227 526198959
3055.1 526198959 525061493 523591957 522355232 521726227 520909042 519783134 518767128 517536163 516709366
3063.8 516709366 515614433 514474335 513463745 512010040 510998764 509931030 508866692 507850075
3071.5 507850075 506984596 506023140 504655342 503778458 503036880 502242279 501169815 500009308 498619652
3080.2 498619652 497160568 496138573 494996185 494129295 493085785 492073860 490757484 488958054
3087.9 488958054 488223495 487896156 487024269 485433388 484059982 482860336 481411934 480352898 479203415
3096.6D79203415q16307l65868o42814j117096j153641j169663j484298j606446j489982
3105.3D69357300q66585r37462j100578r35936j017609r61189j170769j111984p04231
3114D60550957m93050j240692j315651j044273j739807j314469r64546q42056o67992
3122.6D50928421r62677j299248j485939r57603r00612r26628r96399j186142j166039
3131.3D41047134j208458j047134j266708j139679r67713q17184p63550r63364q24966
3140D32048378j318092j580735j163368r06792r78355q05969q85887j283608j173668
3148.7D21951904j433181j057053n56068o54488q38394j138497j038017j251411j133614
3157.4D12851181r94148q67272q16879j376648j133118p74231q52622r90067o19965
$$ plain form
3096.6 479203415 478387108 478021240 477378426 476261330 475107689 473938026 472453728 470847282 469357300
3105.3 469357300 468490715 467553253 466452675 465516739 464499130 463537941 462367172 461255188 460550957
3114 460550957 460057907 458817215 457501564 456457291 454717484 453403015 452438469 451596413 450928421
3122.6 450928421 449965744 448666496 447180557 446222954 445322342 444395714 443399315 442213173 441047134
3131.3 441047134 439838676 438791542 437524834 436385155 435417442 434600258 433836708 432873344 432048378
3140 432048378 430730286 429149551 427986183 427079391 426101036 425295067 424409180 423125572 421951904
3148.7 421951904 420518723 419461670 418905602 418251114 417412720 416274223 415236206 413984795 412851181
3157.4 412851181 411857033 410989761 410172882 408796234 407663116 406888885 406036263 405046196 404426231
3166D04426231o67572j246528j111336r68552p27195r25484r03015r21097j613731
3174.7C95341721j201554l68118l94898j066284j145019j091423j084366q88672j070862
3183.4C87030525q25462p30896q43659o46743m64554p92237j184730j006088q56209
3192.1C79679947p53441q73375p69348p57332q93936p44400p13234q38280j020050
3200.8C72316551n71747m86526m29421q28704j531182p32116m38881n73998j056747
3209.4C65667229r56650l28217r57412o22750j25198p31354j465416j039009j39961
3218.1C59301262m61235q92716o83593k36245p14340j057930q97712m91028j24359
3226.8C53742104o80848m31442m37393p56455o22444q50753r46274o32782j44959m01230
$$ plain form
3166 404426231 403758659 402512131 401400795 400432243 399705048 398779564 397876549 396955452 395341721
3174.7 395341721 394140167 393772049 393377151 392310867 391165848 390074425 388990059 388101387 387030525
3183.4 387030525 386205063 385474167 384630508 383983765 383519211 382726974 381542244 380536156 379679947
3192.1 379679947 378926506 378053131 377283783 376526451 375632515 374888115 374174881 373336601 372316551
3200.8 372316551 371744804 371258278 370828857 370000153 368468971 367736855 367297974 366723976 365667229
3209.4 365667229 364710579 364382362 363424950 362802200 362677002 361945648 360480232 359441223 359301262
3218.1 359301262 358840027 357947311 357263718 357027473 356313133 355255203 354357491 353866463 353742104
3226.8 353742104 353061256 352629814 352192421 351435966 350813522 349962769 349016495 348383713 348238754 347837524
3236.4C47837524o52389q65402l55072q4038r40972m81414o43502j193389j133957
3245.1C41487389o93169J25198q4190m68216j001129r16710l27797q0605m1160o25267
3254.8C37374344o31981n76363p81593m26254J4763k23580p49969j155892j257400
3263.4C31586075l54653R385k91405j25542j18522o60592p45430k32849k38571l25699
3273.1C28502197o31942m57268j53618o77414n30663o1760j12915o18400m77715k56653
3282.7C24523849p57675k79693K59132m69017p95822m30756o61621m63257k86636o78272
3292.4C19960232o05965l14503Q2131j87760k76718j84040l28884l65696o88972m52671
3302C16637154k90299j14288m76132q66012j2551Q6442q26188j137466J49136M47731
$$ plain form
3236.4 347837524 347185135 346319733 345964661 345880623 344939651 344458237 343814735 342621346 341487389
3245.1 341487389 340794220 340919418 340835228 340367012 339365883 338449173 338121376 338040771 337999611 337374344
3254.8 337374344 336742363 336166000 335384407 334958153 334972916 334749336 333999367 332843475 331586075
3263.4 331586075 331231422 331240807 330949402 330823860 330705338 330044746 329299316 329066467 328827896 328502197
3273.1 328502197 327870255 327412987 327259369 326581955 326051292 325989532 325876617 325258217 324780502 324523849
3282.7 324523849 323766174 323486481 323745613 323276596 322480774 322050018 321388397 320925140 320638504 319960232
3292.4 319960232 319354267 319039764 319121895 318934135 318657417 318473377 318144493 317778797 317089825 316637154
3302 316637154 316346855 316232567 315756435 314890423 314877872 314964314 314138126 313000660 313149796 313597527
3311.7C13597527m76494o04763m19159n25360q36907j70631k43721l69034q2607n25360
3321.3C09343491m26541n95474l71647o58264n82638k4052o48288k77004k31209m19159
3330.9C05109215n47180m60339j57433n85022k51998j79291j62258n54600q55255k30236
3340.6C01125603l81928o20517r08318o14986j20183j91783k95506n99518o12278k51674
3350.2B96528912M6157k85911l43247n90591r07459l94898m93450n12333n5446J2817
3359.9B93004551p48177q98323j25808k86751l04947k79923o77223l93829l45707p05338
3369.5B88238525j79557n6496l27988k40917r15813o07338J50089K11487J16100m45175
3379.2B85942917o52428o86264r8018j6518m57611j32981l56235k73190j92146m27208
$$ plain form
3311.7 313597527 313121033 312516270 312097111 311571751 310734844 310564213 310320492 309951458 309868851 309343491
3321.3 309343491 308916950 308321476 307949829 307291565 306708927 306684875 306036587 305759583 305528374 305109215
3330.9 305109215 304562035 304101696 303944263 303359241 303107243 302927952 302765694 302211094 301355839 301125603
3340.6 301125603 300743675 300123158 299214840 298599854 298479671 298287888 297992382 297392864 296780586 296528912
3350.2 296528912 296575069 296289158 295945911 295355320 294447861 294052963 293559513 293047180 292991734 293004551
3359.9 293004551 292256374 291358051 291232243 290945492 290640545 290360622 289683399 289289570 288943863 288238525
3369.5 288238525 288058968 288002472 287674484 287433567 286517754 285910416 286060505 286271992 286388092 285942917
3379.2 285942917 285290489 284604225 284506207 284489689 284032078 283899097 283542862 283269672 283077526 282650318
3388.8B82650318K9793L12710j24913n35697k63939j56556j95446J91117M7798m18186
3398.4B81536999k83928l53451J8978K32678l00503k25907n60798j99967K92530k52304
3408.1B79904327k33440j1501M39720J02596l54195N7717L06930J26019m42963j56040
3417.7B79739170J83201j57967m78229n7N77449O5899j23501K66095K32124m62761
3427.4B79841423m34246K76680O17447M32854p3719J90887J19667J54381M98485K38552
3437B81862411m1580j00136L34569N87444L53241k69032K58923N29308M61769R44367
3446.7B84921284n74589K3155R26190J20163K20336L21560O48079N2414N417R53465
3456.3B87617474R33055J98899p1564N13573M11625N64804J67904M11472J351814P76654
$$ plain form
3388.8 282650318 282680111 282992821 282867908 282332211 282068272 281911716 281716270 281907387 281955185 281536999
3398.4 281536999 281253071 280899620 280918598 281151276 280850773 280624866 280064068 279864101 280156631 279904327
3408.1 279904327 279670887 279659386 280099106 280201702 279847507 279905224 280212154 280338173 279895210 279739170
3417.7 279739170 279922371 279764404 279286175 279286118 279863567 279929466 279805965 280072060 280304184 279841423
3427.4 279841423 279407177 279683857 280301304 280734158 280660439 280851326 280970993 281125374 281623859 281862411
3437 281862411 281820831 281720695 282055264 282642708 282995949 282726917 282985840 283515148 283976917 284921284
3446.7 284921284 284346695 284369850 285296040 285416203 285636539 285958099 286606178 286658592 286664009 287617474
3456.3 287617474 288550529 288749428 288677864 289191437 289603062 290167866 290335770 290747242 292099056 292875710
3466B92875710J70497j69181N13897O37054M19807K62814P0095J044788N70336K90012
3475.6B96685829P11937L77083K30331L91312Q07877P95745N85633M29172Q85353L09620
3485.2C02209892P7248J055870M82712L05633O54164J149635J149425L79353L21465
3493.9C07785397M67720O42051O68240J067142Q15411M66995N80368O11859O89067
3502.6C13794250N61257J305599R32350M16718Q00819J157551N62058l31326J023350
3511.3C20222626J022644M75120P13616J110344J420822P71980O66580L66555P56263
3520C27526550J118813Q31222L11127l42293J143036J527443J196289Q78601O93360
3528.6C34884148R03892N39551O80695J091918J283074Q00896J326904Q15048M77295
$$ plain form
3466 292875710 293046207 292877026 293390923 294027977 294447784 294710598 294780693 295825481 296395817 296685829
3475.6 296685829 297397766 297774849 298005180 298396492 299204369 300000114 300585747 301014919 301900272 302209892
3485.2 302209892 302287140 303343010 303825722 304131355 304785519 305935154 307084579 307463932 307785397
3493.9 307785397 308253117 308895168 309563408 310630550 311445961 311912956 312493324 313105183 313794250
3502.6 313794250 314355507 315661106 316593456 317010174 317810993 318968544 319530602 319199276 320222626
3511.3 320222626 321245270 321720390 322434006 323544350 324965172 325737152 326403732 326770287 327526550
3520 327526550 328645363 329476585 329787712 329445419 330588455 332115898 333312187 334190788 334884148
3528.6 334884148 335788040 336327591 337008286 338100204 339383278 340184174 341511078 342326126 342803421
3537.3C42803421J756668O52123Q57353J360245Q11004O09703J221237J245461l7308
3546C51279907Q78678N82122J799965K156983J545639J187858q24012J703453J836395
3554.7C62146988J276932J446418Q74520J819992J036606J202049O42281J903266K030831
3563.4C74379883J314239L648300p99369J42975J539726O48346M033622J764832J487465
3572C88160019K087974J765976J332283J479454J918068R59053L061982J694564K22626
3580.7D02681999K087593K425118K176780J486512L621635J105652j766319K196884
3588.4D16015854J499443L756599L300019K926407J808738J166535K931785p63054
3596.1D32642326K762032M082985J338577K748985Q74558J729813K951583J849442
$$ plain form
3537.3 342803421 344560089 345212212 346069565 347429810 348240814 348850517 350071754 351317215 351279907
3546 351279907 352158585 352740707 354540672 356697655 358243294 359431152 358607140 360310593 362146988
3554.7 362146988 363423920 364870338 365744858 367564850 368601456 369803505 370445786 372349052 374379883
3563.4 374379883 375694122 379342422 378543053 378686028 380225754 380874100 384907722 386672554 388160019
3572 388160019 390247993 392013969 393346252 394825706 396743774 397702827 400764809 402459373 402681999
3580.7 402681999 404769592 407194710 409371490 410858002 414479637 415585289 413818970 416015854
3588.4 416015854 417515297 421271896 424571915 427498322 429307060 430473595 433405380 432642326
3596.1 432642326 435404358 439487343 440825920 443574905 444449463 446179276 449130859 450980301
3603.9D50980301K065964L013954K911644J80511L151398L23601J055794O869926R01375
3612.5D71454468m27551L785552l68995M175224L762932l60298K292290M02297J649018
3621.2D86364937L168640K783279K986985K395362J354065K224884O674080o77528
3628.9E07274704j0272827O263199O185226N368576J223335j047401L405724L483543
3636.6E21884079K236214J411094J991387J875000K229995J551133J106681K781640
3644.4E37067223K543182L892059j536445l025551N015488R32006j198005N26886N988044
3653E50204887M675599M046020M253197p850838J870384N029831J410103J283798Q63953
3661.7E65786934K699928J637078J815910J699943Q01926L859520J512985j753845
$$ plain form
3603.9 450980301 453046265 456060219 458971863 459152374 462303772 462627373 463683167 470553093 471454468
3612.5 471454468 471026917 474812469 474443474 478618698 482381630 482021332 484313622 484715919 486364937
3621.2 486364937 489533577 492316856 495303841 497699203 499053268 501278152 507952232 507274704
3628.9 507274704 497001877 503265076 509450302 514818878 516042213 514994812 518400536 521884079
3636.6 521884079 524120293 525531387 527522774 529397774 531627769 533178902 534285583 537067223
3644.4 537067223 539610405 543502464 541966019 538940468 543955956 544887962 543689957 544216843 550204887
3653 550204887 554880486 558926506 563179703 555328865 557199249 562229080 563639183 564922981 565786934
3661.7 565786934 568486862 570123940 571939850 573639793 574441719 578301239 579814224 578060379
3669.4E78060379j156082l993073M302826Q014870P266197l939018j5699692O248551
3677.1E79104958Q894119M203453k183457J182099K934112J588021J614036K68021
3684.9E97605362M43420L861122M584389q700905j957931P479591m289436J363029
3692.6F00388641N692406J139832J750297J02120k35978J766663J138115K643013R77287
3701.3F15362396o043854K77787N530739J576652J10436M97016K643357L037147p298431
3709.9F15693245M136848L260842j1118317O277924M546280L92685J141090K633705
3717.7F26964302J263161l555184J210366M505081m209519l157272M979591J476746
3725.4F29477272j034965k480469J514015L528748R92584N051079k693863n395012
$$ plain form
3669.4 578060379 576904297 572911224 577214050 585228920 592495117 588556099 572856407 579104958
3677.1 579104958 587999077 592202530 590019073 591201172 594135284 595723305 597337341 597605362
3684.9 597605362 598048782 601909904 606494293 597793388 595835457 603315048 599025612 600388641
3692.6 600388641 606081047 607220879 608971176 609073296 608837318 610603981 611742096 614385109 615362396
3701.3 615362396 609318542 609596329 615127068 616703720 616814156 617311172 619954529 622991676 615693245
3709.9 615693245 619830093 623090935 611972618 618250542 622796822 623189507 624330597 626964302
3717.7 626964302 628227463 624672279 625882645 630387726 626178207 623020935 628000526 629477272
3725.4 629477272 628442307 625961838 627475853 631004601 631997185 637048264 634354401 628959389
3733.1F28959389P362442j817513q037719J423149K943992K219353L853111K628594
3740.8F39534798l601952M006310J1052513j1724625j4372177J0079269N961991N094070
3748.5F46030197n201034p636910J0729942n656929m452209O306648N145188L756103
3756.2F49020996m249115K119064L549958q276062J47476M781876J642150J191254
3763.9F49927597L427429l053818m169006L408966M550705j049347q393020L397140
3771.7F48046646M248734R25674O26450p48520R64279O18210K096863n65033o414566
3780.3F49798737L186645K754898J910706J978225m213028o84204J531296N58548J018753
3789F57840576N67169J175690j4114j9532K9145J154327K437134l983994l057174K314834
$$ plain form
3733.1 628959389 636321831 634504318 626466599 627889748 630833740 633053093 636906204 639534798
3740.8 639534798 635932846 639939156 650991669 639267044 624894867 634974136 640936127 646030197
3748.5 646030197 640829163 633192253 643922195 638265266 633813057 640119705 645264893 649020996
3756.2 649020996 644771881 646890945 650440903 642164841 642312317 647094193 648736343 649927597
3763.9 649927597 653355026 650301208 646132202 649541168 654091873 653042526 644649506 648046646
3771.7 648046646 652295380 653221054 653847504 653098984 654063263 654681473 656778336 656213303 649798737
3780.3 649798737 652985382 655740280 657650986 659629211 655416183 654731979 656263275 656821823 657840576
3789 657840576 658407745 659583435 659569321 659549789 659578934 660733261 663170395 659186401 656129227 658444061
3798.7F58444061M329987M891510q649292q320999M888763M285889N093231L974762
3806.4F68937912r876556k392197N658188K371292L42026k95639N0659K027740M755326
3815.1F71578751m214402j2652282O989822N769196L665771M88892j6975937M088440
3822.8F58738251O487350K137680J911621j029129m121627J153030K809143L204956
3830.5F71291275o0425p999725M643402O899033o569748k11258O586456r487686k335739
3839.2F62755585Q038711m897384J719360P245941l395462l370514K765274J481247
3846.9F72342758M53263J638031o96488J536560K905655r309540J736908j0378113
3854.6F60229034K639237J0047989O6986o24695J748352J878815J959305n787049J41297
$$ plain form
3798.7 658444061 662774048 667665558 659016266 650695267 655584030 659869919 664963150 668937912
3806.4 668937912 659061356 656669159 662327347 664698639 665040665 664745026 664795685 666823425 671578751
3815.1 671578751 667364349 654712067 661701889 667471085 671136856 671625748 654649811 658738251
3822.8 658738251 665225601 667363281 669274902 668245773 664124146 665277176 668086319 671291275
3830.5 671291275 671230850 663231125 667874527 674773560 668203812 667992554 674579010 665091324 662755585
3839.2 662755585 670794296 665896912 667616272 674862213 671466751 668096237 670861511 672342758
3846.9 672342758 672796021 674434052 673737564 675274124 678179779 668870239 670607147 660229034
3854.6 660229034 662868271 672916260 672983246 672358551 674106903 675985718 677945023 672157974 672299271
3863.3F72299271N671997n451126k722245M917527M720459M009780r944763o870727
3871F66630173N670318O817627K431412j0647278J924362N044403N31617K101669L097305
3879.7F83601608q037033n923767P382202K121353K565003L861008j2982941K198028
3887.4F74785461L999711J031723L940277j764985p977752K025070L567429j933518
3895.1F77673416R44824K029648K710495P56684q861084N218658P53174n672302M227600
3903.8F79781113k514649l85132J026078J500396K339631o84205J31607J57929J10168
3912.5F81462936J003876P62634Q54798M37469l808670k047577M436341k5025l153000
3921.1F79923782J635361P74612M86908j537704j251678K595825J404190K62985j614380
$$ plain form
3863.3 672299271 677971268 672520142 669797897 674715424 679435883 683445663 673500900 666630173
3871 666630173 672300491 679118118 681549530 670902252 672826614 677871017 678402634 680504303 683601608
3879.7 683601608 675564575 669640808 677023010 679144363 681709366 685570374 672587433 674785461
3887.4 674785461 678785172 679816895 683757172 681992187 674014435 676039505 679606934 677673416
3895.1 677673416 678618240 680647888 683358383 684115067 675253983 680472641 681225815 675553513 679781113
3903.8 679781113 677266464 676881332 677907410 679407806 681747437 681063232 681194839 681352768 681462936
3912.5 681462936 682466812 683229446 684084244 684521713 680713043 678665466 683101807 683076782 679923782
3921.1 679923782 681559143 682333755 682820663 681282959 680031281 682627106 684031296 684294281 682679901
3929.8F82679901q18176J417084k351532n03922K016907J91955L54691N20096M25949
3938.5F83932953L43780l28674J378403Q58002l783799l42636J537399J031571J534042
3947.2F86161041j318817K34680r13391j796951K752609O19431r30405K51236O95343
3955.8F85754776N417l85285M63944j042328O99081O78406j585235L82995O70700J70517
3965.5F85812988K35977J71891l46985N1422P99332L63540l07159q41599L69110O87638
3975.1F86996155K73208l84063r88236K0676M04434J59454k79541j70135j450l7918
3984.8F85992584P2708M93088J077042J74637j85318j97602K60468M47693n03083j79443
3994.4F87452774m06494j73264M52729J5258j1367J44653
$$ plain form
3929.8 682679901 681861725 683278809 680927277 680423355 682440262 682632217 682986908 683507004 683932953
3938.5 683932953 684276733 683948059 685326462 686184464 682400665 682058029 683595428 684626999 686161041
3947.2 686161041 684842224 685076904 684163513 682366562 685119171 685738602 684808197 685059433 685754776
3955.8 685754776 685760193 685374908 685838852 684796524 685495605 686174011 684588776 684971771 685642471 685812988
3965.5 685812988 686048965 686220856 685873871 685925293 686724625 687088165 686781006 685939407 686308517 686996155
3975.1 686996155 687269363 686885300 685897064 685917740 686322174 686481628 686202087 686031952 686030502 685992584
3984.8 685992584 686065292 686558380 687635422 687810059 687624741 687427139 687687607 688135300 687632217 687452774
3994.4 687452774 687046280 686873016 687325745 687341003 687329636 687474289
4000.2F87474289
$$ plain form
4000.2 687474289
##END=$$ End of the data block
