##TITLE=$$ Begin of the data block
##JCAMP-DX=5.00 $$ ACD/SpecManager v 10.08
##SPECTROMETER/DATA SYSTEM=Varian
##DATE=20 Nov 2012 09:53:16
##DATA TYPE=INFRARED SPECTRUM
##DATA CLASS=XYDATA
##ORIGIN=
##OWNER=
##NPOINTS=3735
##FIRSTX=399.26403809
##LASTX=4000.35498047
##MAXX=4000.35498047
##MINX=399.26403809
##MAXY=78.43886566
##MINY=17.22787094
##XFACTOR=1.0000000000
##YFACTOR=0.000000100000000
##FIRSTY=46.37439728
##DELTAX=0.96440572
##XUNITS=1/CM
##YUNITS=TRANSMITTANCE
##XYDATA=(X++(Y..Y))
$$ plain form
399.3 463743973 466799736 458649025 455532265 457521935 446024055 444112740 452074776 451709061
407 451709061 450942154 447822304 447085571 451941490 451605377 449264336 453325310 457940750 463637733
415.7 463637733 470893822 467317619 450699844 463310242 466699791 458519745 454146919 454540672
423.4 454540672 454358101 452484512 453248863 452139511 445309982 443872871 447088585 444176750 442502518
432.1 442502518 443599586 439791107 435376854 436178513 435760994 433397484 433348694 434448586 438773155
440.7 438773155 445256310 450063400 448900719 448191338 452966499 456637115 455421906 453452568 455989723
449.4 455989723 458079491 459097023 465018425 466961555 461743507 458597679 459141731 457984200 455761375
458.1 455761375 457253380 457499084 460151939 463791084 462820930 455478477 447700157 445158386 445682564
$$ packed form
399.3D63743973L055763q150711l116760J989670j1497880j911315P962036l65715
407D51709061p66907l119850p36733M855919l36113k341041M060974M615440N696983
415.7D63637733P256089l576203j6617775J2610398L389549q180046m372826L93753
423.4D54540672j82571j873589P64351j109352o829529j437111L215714k911835j674232
432.1D42502518J097068l808479m414253Q01659m17519k363510m8790J099892M324569
440.7D38773155O483155M807090j162681p09381M775161L670616j215209j969338K537155
449.4D55989723K089768J017532N921402J943130n218048l145828N44052j157531k222825
458.1D55761375J492005K45704K652855L639145r70154p342453p778320k541771N24178
$$ plain form
466.8 445682564 447186165 445326576 441961823 438825760 437472992 435292053 434317245 436727943 434183426
475.5 434183426 432595062 432364349 431340370 434138985 437410431 434869728 429345703 430516014 433074799
484.1 433074799 431712379 429188728 430819664 432508698 428368797 426422386 422581558 422880783 428495598
492.8 428495598 427841682 426224365 425692825 425595551 423375053 422567291 422680931 423053780 422488594 417277718
502.5 417277718 417670441 418184624 416155128 413743362 412212296 410035744 406838264 407407112 406595154
511.1 406595154 404856339 402326660 401088715 398639069 392598114 392499313 392949219 391556702 389356194
519.8 389356194 385510635 382274323 380989037 380110970 377463226 376736603 376482658 378946495 379833717
528.5 379833717 380164375 381737633 379971161 380205002 380984001 383121681 384832230 385371704 388159294
$$ packed form
466.8D45682564J503601j859589l364753l136063j352768k180939r74808K410698k544517
475.5D34183426j588364k30713j023979K798615L271446k540703n524025J170311K558785
484.1D33074799j362420k523651J630936J689034m139901j946411l840828K99225N614815
492.8D28495598o53916j617317n31540r7274k220498q07762J13640L72849n65186n210876
502.5D17277718L92723N14183k029496k411766j531066k176552l197480N68848q11958
511.1D06595154j738815k529679j237945k449646o040955r8801M49906j392517k200508
519.8C89356194l845559l236312j285286q78067k647744p26623k53945K463837Q87222
528.5C79833717L30658J573258j766472K33841P78999K137680J710549N39474K787590
$$ plain form
537.2 388159294 389562149 391326523 393949242 397535324 399676933 399879799 401701660 403976288 405682182
545.9 405682182 406025696 406229744 406834106 406876144 405791779 404484634 403195724 401414680 400035858
554.5 400035858 398194656 398248177 397877846 395278244 394003448 393958664 393329277 391148453 390158081
563.2 390158081 387385368 382922440 378946686 374756737 371824570 367841110 366168442 363884926
570.9 363884926 360897903 358505325 356011086 356590958 357310867 359509277 359807930 360678482 363665085
579.6 363665085 366077614 369140434 371308823 374927025 379251556 383712425 386760826 389266739
587.3 389266739 392231674 393627167 395321083 396847038 397222061 397330818 399017487 400333862 399821358
596 399821358 398970032 398700600 400152092 400286102 399871140 399736748 399914284 400038795 398297997 397703514
$$ packed form
537.2C88159294J402855J764374K622719L586082K141609K02866J821861K274628J705894
545.9D05682182L43514K04048O04362M2038j084365j307145j288910j781044j378822
554.5D00035858j841202N3521l70331k599602j274796m4784o29387k180824r90372
563.2C90158081k772713m462928l975754m189949k932167l983460j672668k283516
570.9C63884926k987023k392578k494239N79872P19909K198410K98653Q70552K986603
579.6C63665085K412529L062820K168389L618202M324531M460869L048401K505913
587.3C89266739K964935J395493J693916J525955L75023J08757J686669J316375n12504
596C99821358q51326k69432J451492J34010m14962j34392J77536J24511j740798n94483
$$ plain form
605.6 397703514 398081665 398934059 398760414 398968773 400804901 402330666 404833717 405211487 405112038
614.3 405112038 405974159 406048813 407212715 408948326 409965248 410770798 413404465 415599670 416408234
623 416408234 417573128 419784164 422926826 424455643 425371933 426830864 427992058 429287491 431048546
631.7 431048546 432091713 432665939 433538132 434652290 436117744 436951218 437589951 437425423 437451401
640.4 437451401 438860588 439825630 440141296 439832954 440811119 442749634 444283333 445551910 446413040
649 446413040 447428665 447705841 448191833 448986511 449711037 450322990 450533943 450362511 449762039 451155663
658.7 451155663 452449837 452539749 453625565 454745293 455590973 455162888 455071335 457004509 458980370
667.4 458980370 457421303 457218475 458495712 459732170 460459442 461450996 463335762 463960915 463896828
$$ packed form
605.6C97703514L78151Q52394j73645K08359J836128J525765K503051L77770r9449
614.3D05112038Q62121P4654J163902J735611J016922Q05550K633667K195205Q08564
623D16408234J164894K211036L142662J528817R16290J458931J161194J295433J761055
631.7D31048546J043167N74226Q72193J114158J465454Q33474O38733j64528K5978
640.4D37451401J409187R65042L15666l08342R78165J938515J533699J268577Q61130
649D46413040J015625K77176M85992P94678P24526O11953K10953j71432o00472J393624
658.7D51155663J294174Q9912J085816J119728Q45680m28085r1553J933174J975861
667.4D58980370j559067k02828J277237J236458P27272R91554J884766O25153o4087
$$ plain form
676.1 463896828 463980522 464492264 466098366 466621513 467122154 467823715 468066254 468932571 469516678 470905800
685.7 470905800 472633209 472833633 472421379 471730957 471424522 471362724 470815773 471131248 471049004 469857979
695.3 469857979 469615479 469162483 467893982 466527405 465608559 464927483 462724228 460679855 459979744
704 459979744 459068718 457787170 456587563 456036682 456176910 456225700 456528549 458468475 459865837 460477104
713.7 460477104 462367783 463847771 465431824 468204689 470961189 473300285 475900383 479611168
721.4 479611168 484831467 488936729 491019020 493523140 495547829 497868919 501156120 504316292
729.1 504316292 506427574 507603340 509806862 512123871 514269218 516668625 518211632 519222832
736.8 519222832 520815125 521880455 522342606 523486328 524222832 524803925 524927940 524219780 523745804
$$ packed form
676.1D63896828Q3694N11742J606102N23147N00641P01561K42539Q66317N84107J389122
685.7D70905800J727409K00424m12254o90422l06435o1798n46951L15475q2244j191025
695.3D69857979k42500m52996j268501j366577r18846o81076k203255k044373p00111
704D59979744r11026j281548j199607n50881J40228M8790L02849J939926J397362O11267
713.7D60477104J890679J479988J584053K772865K756500K339096K600098L710785
721.4D79611168N220299M105262K082291K504120K024689K321090L287201L160172
729.1E04316292K111282J175766K203522K317009K145347K399407J543007J011200
736.8E19222832J592293J065330M62151J143722P36504N81093J24015p08160m73976
$$ plain form
745.5 523745804 523747978 523856850 522753258 521089363 519444656 517227859 514695244 512180595 510578957
754.2 510578957 509013214 506780357 504850121 502585754 500200768 497828674 495462341 493532448
761.9 493532448 491762466 490670013 489780045 489404793 489707069 490100517 491358223 493403549 495677834
770.6 495677834 497877235 500708542 504881058 508898735 512797394 517820969 523120956 527361946
778.3 527361946 531022377 535516205 539468803 543179855 547153320 550748558 554108734 556504250
786 556504250 559228439 562485542 565681686 568225746 570230408 572114258 574586411 577383347 578758049
794.7 578758049 580938034 583104095 584599113 586283112 588162651 590271835 591752548 594487534
802.4 594487534 596652641 597432823 597591248 598378639 600175858 600957146 601647568 601418915 601720581
$$ packed form
745.5E23745804K174J08872j103592j663895j644707k216797k532615k514649j601638
754.2E10578957j565743k232857j930236k264367k384986k372094k366333j929893
761.9D93532448j769982j092453q89968l75252L02276L93448J257706K045326K274285
770.6D95677834K199401K831307M172516M017677L898659N023575N299987M240990
778.3E27361946L660431M493828L952598L711052L973465L595238L360176K395516
786E56504250K724189L257103L196144K544060K004662J883850K472153K796936J374702
794.7E78758049K179985K166061J495018J683999J879539K109184J480713K734986
802.4E94487534K165107P80182J58425P87391J797219P81288O90422k28653L01666
$$ plain form
811.1 601720581 601565971 600683327 600465927 600230942 601251755 601072960 600068283 598637543 597733231
819.7 597733231 598151054 598133888 597946320 596524506 595207176 593621864 591840744 590363541 588715134
828.4 588715134 587110519 584541931 581641426 578323097 575532608 573046799 571144524 569400177
836.1 569400177 567547226 566547737 564318695 561999092 559552231 557748451 555951042 552846260 550742149
844.8 550742149 548203468 546553726 545701523 543995399 541827316 539189415 537359962 535457535 532434196
853.5 532434196 528827400 526227112 523546371 520022354 516774368 514096603 512750130 512022514 512562637
862.2 512562637 514285698 517306519 522273521 527546310 533274040 537754898 542947731 550221443
869.9 550221443 556810646 563516655 570183983 576423645 581217575 585518532 589483604 592437401
$$ packed form
811.1F01720581j54610q82644k17400k34985J020813j78795j004677j430740r04312
819.7E97733231M17823j7166j87568j421814j317330j585312j781120j477203j648407
828.4E88715134j604615k568588k900505l318329k790489k485809j902275j744347
836.1E69400177j852951r99489k229042k319603k446861j803780j797409l104782k104111
844.8E50742149k538681j649742q52203j706124k168083k637901j829453j902427l023339
853.5E32434196l606796k600288k680741l524017l247986k677765j346473p27616N40123
862.2E12562637J723061L020821M967002N272789N727730M480858N192833P273712
869.9E50221443O589203O706009O667328O239662M793930M300957L965072K953797
$$ plain form
877.6 592437401 593817863 594360161 595114098 594760132 595179062 594090042 591010284 588061295 585143623
886.3 585143623 581860504 577458420 573922882 571160164 568642311 565091782 560463486 556742210
894 556742210 553848686 550853386 547377319 544786682 541531334 537504463 534480858 531718521 528790932
902.7 528790932 525012131 520898743 517077980 513729401 510124321 504810295 498861694 493730278
910.4 493730278 488850975 483358307 477987442 472705841 466539459 460790596 455316811 449583664
918.1 449583664 445009308 440651741 436721115 433561287 431287842 429216957 427099190 427297554 428343544
926.8 428343544 428792877 429076042 429992828 430357285 430498009 432070389 433277016 434798279 436541328
935.5 436541328 438158836 440685158 443846359 446405525 448387909 451403770 454271736 456870155
$$ packed form
877.6E92437401J380462N42298P53937l53966M18930j089020l079758k948989k917672
886.3E85143623l283119m402084l535538k762718k517853l550529m628296l721276
894E56742210k893524k995300l476067k590637l255348m026871l023605k762337k927589
902.7E28790932l778801m113388l820763l348579l605080n314026n948601n131416
910.4D93730278m879303n492668n370865n281601o166382n748863n473785n733147
918.1D49583664m574356m357567l930626l159828k273445k070885k117767J98364J045990
926.8D28343544M49333K83165R16786L64457J40724J572380J206627J521263J743049
935.5D36541328J617508K526322L161201K559166J982384L015861K867966K598419
$$ plain form
943.2 456870155 459754448 462158356 463347015 463180122 462312469 460044937 456551247 452332993 447472878
951.9 447472878 442357788 436208649 429684219 423099556 416554985 409619598 401819496 393886108
959.6 393886108 385784302 377355843 368693619 360957336 352769241 344134026 334954681 325723076
967.3 325723076 317078419 307244320 298478985 289319668 280261993 270856686 260961323 252509785
975 252509785 243419685 235742950 228201027 221262913 214301605 207727661 202173538 196735744 192889786
983.7 192889786 187903824 184827251 181744385 178992062 177279758 175381107 174882469 173065548 172995090
992.4 172995090 172278709 172432957 173011093 172679253 173469429 172457390 173126106 173721027 175022316
1001.1 175022316 175256271 174949894 175919724 175535564 176842861 176049652 175839596 175860577 175624714 175814495
$$ packed form
943.2D56870155K884293K403908J188659j66893q67653k267532l493690m218254m860115
951.9D47472878n115090o149139o524430o584663o544571o935387p800102p933388
959.6C93886108q101806q428459q662224p736283q188095q635215r179345r231605
967.3C25723076q644657r834099q765335r159317r057675r405307r895363q451538
975B52509785r090100p676735p541923o938114o961308o573944n554123n437794l845958
983.7A92889786m985962l076573l082866k752323j712304j898651m98638j816921p0458
992.4A72995090p16381J54248N78136l31840P90176j012039O68716N94921J301289
1001.1A75022316K33955l06377R69830l84160J307297p93209k10056K0981k35863J89781
$$ plain form
1010.7 175814495 174477444 174738312 173677502 174107208 174474792 174618607 174892578 174675503 176086750
1019.4 176086750 176094360 177709293 177734032 178176880 180050373 181601181 183779869 184101334 186246719
1028.1 186246719 187901440 189739513 190766792 191879005 193384762 193337593 195527077 195946331 197407131
1036.7 197407131 198436279 197728958 196837940 195775909 196632347 196504002 197731743 197122612 196980591
1045.4 196980591 197674294 197480564 198527985 198190136 199162407 198991451 200899200 203046360 204228401
1054.1 204228401 207196407 209533272 213213043 215683613 220099735 223992901 227400284 231470261
1061.8 231470261 235005302 239960575 242872009 247027988 249976616 252861423 255291138 254743042
1069.5 254743042 252656937 247585201 243849850 238580685 233929768 230232525 227349987 226250038
$$ packed form
1010.7A75814495j337051K60868j060810M29706L67584J43815K73971k17075J411247
1019.4A76086750P610J614933K4739M42848J873493J550808K178688L21465K145385
1028.1A86246719J654721J838073J027279J112213J505757m7169K189484M19254J460800
1036.7A97407131J029148p07321q91018j062031Q56438j28345J227741o09131j42021
1045.4A96980591O93703j93730J047421l37849R72271j70956J907749K147160J182041
1054.1B04228401K968006K336865L679771K470570M416122L893166L407383M069977
1061.8B31470261L535041M955273K911434M155979K948628K884807K429715n48096
1069.5B54743042k086105n071736l735351n269165m650917l697243k882538j099949
$$ plain form
1077.2 226250038 223774357 224385986 224208145 224795246 225370655 226337032 228759689 230905056 234784184
1085.9 234784184 235923138 238347931 241231670 245313320 249323521 251451874 255170975 257501011
1093.6 257501011 261016064 263270931 265432491 266691093 267143669 269082127 269127636 269543171 268827686
1102.3 268827686 269674625 269419136 268749714 270409889 271071205 272972050 273444176 275105476 276756859
1111 276756859 278491344 280946445 282520065 284915047 286090679 288631115 289936028 291647530 293592911
1119.7 293592911 294336243 295999527 296339588 297980843 298280392 298607407 299347630 300159512 302085247
1128.4 302085247 303337307 305963936 307783833 310381603 311533070 312333126 314435558 315171356 316166477
1137 316166477 314712124 312888355 310358448 307972546 305818729 302440510 299775238 295930576 293614521
$$ packed form
1077.2B26250038k475681O11629j77841N87101N75409R66377K422657K145367L879128
1085.9B34784184J138954K424793K883739M081650M010201K128353L719101K330036
1093.6B57501011L515053K254867K161560J258602M52576J938458M5509M15535p15485
1102.3B68827686Q46939k55489o69422J660175O61316J900845M72126J661300J651383
1111B76756859J734485K455101J573620K394982J175632K540436J304913J711502J945381
1119.7B93592911P43332J663284L40061J641255K99549L27015P40223Q11882J925735
1128.4C02085247J252060K626629J819897K597770J151467Q00056K102432P35798R95121
1137C16166477j454353j823769k529907k385902k153817l378219k665272l844662k316055
$$ plain form
1145.7 293614521 290520706 287705173 285337372 282279854 280697498 278315430 277256126 275462379
1153.4 275462379 274749870 274282837 273413811 273593082 273005733 274253006 275064182 276842899 278355865
1162.1 278355865 280463943 283362389 285919209 290905628 294984760 299972363 305218277 311024933
1169.8 311024933 317164001 323472252 330655785 336768646 343941879 350469742 357659149 364804459
1177.5 364804459 371273613 377949333 383934746 390911179 397508545 403794289 409610863 415206795
1185.3 415206795 420096397 424612083 429778404 433947182 437608490 440689583 443789597 446306343
1193 446306343 447831573 449260025 450368881 451768150 452941704 453938408 454617767 454912148 455265770
1201.6 455265770 456189499 457416229 457678757 458423538 459787750 461441612 463263512 464793739 466555328
$$ packed form
1145.7B93614521l093815k815533k367801l057518j582356k382068j059304j793747
1153.4B75462379p12509m67033q69026J79271n87349J247273Q11176J778717J512966
1162.1B78355865K108078K898446K556820M986419M079132M987603N245914N806656
1169.8C11024933O139068O308251P183533O112861P173233O527863P189407P145310
1177.5C64804459O469154O675720N985413O976433O597366O285744N816574N595932
1185.3D15206795M889602M515686N166321M168778L661308L081093L100014K516746
1193D46306343J525230J428452J108856J399269J173554R96704O79359K94381L53622
1201.6D55265770R23729J226730K62528P44781J364212J653862J821900J530227J761589
$$ plain form
1210.3 466555328 468545532 470971375 473086662 475323830 477972336 480430031 482840919 485066643
1218 485066643 487138100 489065361 490510292 491292152 491586571 491765442 492116661 491993904 491418266
1226.7 491418266 490716400 489828911 488883667 488040009 487292938 486168175 484905586 483752403 482832527
1235.4 482832527 482215080 481451225 480620880 479557533 478632469 477923965 477150230 477177696 477329445 477363091
1245 477363091 477769203 478316383 478838654 479269829 480316315 481347389 482078209 483141022 484396095
1253.7 484396095 485399742 485867767 486239700 486903877 487452011 487664261 488014717 488456993 488836823
1262.4 488836823 489018402 489654465 490706139 491277046 492072220 493070068 494456406 496053581 497307549
1271.1 497307549 498411102 499261055 500147552 500814247 501587181 502114639 502249031 502167549 501929474 501572418
$$ packed form
1210.3D66555328J990204K425843K115287K237168K648506K457695K410888K225724
1218D85066643K071457J927261J444931P81860K94419J78871L51219j22757n75638
1226.7D91418266p01866q87489r45244q43658p47071j124763j262589j153183r19876
1235.4D82832527o17447p63855q30345j063347r25064p08504p73735K7466J51749L3646
1245D77363091M06112N47180N22271M31175J046486J031074P30820J062813J255073
1253.7D84396095J003647M68025L71933O64177N48134K12250L50456M42276L79830
1262.4D88836823J81579O36063J051674N70907P95174R97848J386338J597175J253968
1271.1D97307549J103553Q49953Q86497O66695P72934N27458J34392q1482k38075l57056
$$ plain form
1280.7 501572418 501025810 500945396 500630074 500637589 500739594 500369720 500548706 500704536 500549698 500110321
1290.4 500110321 499776917 499028053 497914314 497111320 496251373 495281487 493882141 492645302 491650620
1299 491650620 490487328 488939362 487442245 486369019 485429001 484547501 482964249 481376152 479752579
1307.7 479752579 478113365 477230148 476256218 475488358 474721680 473980484 473230782 472060318 471110573
1316.4 471110573 469871902 468830566 467998734 467036781 466179390 465267258 464403114 462904129 461214790
1325.1 461214790 459102211 456357346 453805008 451094398 448397789 445352554 442642746 440539589
1332.8 440539589 438098831 435980301 434079323 432932549 431976814 431444893 430998878 430196114 430190887
1341.5 430190887 429898262 430189552 430380096 430824356 431348953 431614532 432268105 432690620 433195763 432858238
$$ packed form
1280.7E01572418n46608q0414l15322P515J02005l69874J78986J55830j54838m39377
1290.4E00110321l33404p48864j113739q02994q59947r69886j399346j236839r94682
1299D91650620j163292j547966j497117j073226r40018q81500j583252j588097j623573
1307.7D79752579j639214q83217r73930p67860p66678p41196p49702j170464r49745
1316.4D71110573j238671j041336q31832r61953q57391r12132q64144j498985j689339
1325.1D61214790k112579k744865k552338k710610k696609l045235k709808k103157
1332.8D40539589k440758k118530j900978j146774r55735n31921m46015q02764n227
1341.5D30190887k92625K91290J90544M44260N24597K65579O53573M22515N05143l37525
$$ plain form
1351.1 432858238 432672997 432332802 431951027 431904144 431398582 431169357 430328178 430018959 429620056 428944206
1360.8 428944206 428803329 428497353 428092690 427415085 427589264 427266121 427233086 427097092 426908569 427674866
1370.4 427674866 427705421 428519516 428832169 429184074 429668465 430564117 432040749 432231827 432998734 433538551
1380.1 433538551 434545364 435151749 435786743 437278557 438544044 440765533 442562523 444856339 446239662
1388.7 446239662 448163261 450202446 451631050 453459969 454226875 454539719 453936119 454437256 453959465
1397.4 453959465 453220215 452149277 450461426 450639687 449833870 449234085 447970772 446063080 445667114
1406.1 445667114 444962158 444064674 442140503 441054077 439919090 439015350 438170166 436858826 436253891
1414.8 436253891 435269623 435351791 435225525 435626945 433089943 431864090 433153305 432921104 433452301
$$ packed form
1351.1D32858238j85241l40195l81775m6883n05562k29225q41179l09219l98903o75850
1360.8D28944206j40877l05976m04663o77605J74179l23143l3035j35994j88523P66297
1370.4D27674866L0555Q14095L12653L51905M84391Q95652J476632J91078P66907N39817
1380.1D33538551J006813O06385O34994J491814J265487K221489J796990K293816J383323
1388.7D46239662J923599K039185J428604J828919P66906L12844o03600N01137m77791
1397.4D53959465p39250j070938j687851J78261q05817n99785j263313j907692l95966
1406.1D45667114p04956q97484j924171j086426j134987r03740q45184j311340o04935
1414.8D36253891r84268Q2168j26266M01420k537002j225853J289215k32201N31197
$$ plain form
1423.4 433452301 432639885 433473473 434435463 434578896 435660400 435592880 436329994 436499825 438187447
1432.1 438187447 439087410 439544640 441442528 441609573 441592484 441356087 443661003 444959908 445917740
1440.8 445917740 447410088 447667274 448876419 448988800 450080948 450560188 450431633 449243317 448682480
1449.5 448682480 449487572 448674393 449167328 448104668 448215103 448145142 446205559 444650688 440433044
1458.2 440433044 442986794 442234154 444092827 444667206 445518494 447905617 448023872 451808167 452965546
1466.8 452965546 456505775 459228325 462601013 466911240 469759941 477005005 479686012 486809959
1474.6 486809959 490654831 495696220 500565147 504557266 509998169 513526573 518621864 521098061
1482.3 521098061 525278816 529075432 532085838 536196098 538433800 543671570 545785179 549276466
$$ packed form
1423.4D33452301q12416Q33588R61990J43433J081504o7520P37114J69831J687622
1432.1D38187447Q99963M57230J897888J67045j7089k36397K304916J298905R57832
1440.8D45917740J492348K57186J209145J12381J092148M79240j28555j188316n60837
1449.5D48682480Q05092q13179M92935j062660J10435o9961j939583j554871m217644
1458.2D40433044K553750p52640J858673N74379Q51288K387123J18255L784295J157379
1466.8D52965546L540229K722550L372688M310227K848701P245064K681007P123947
1474.6D86809959L844872N041389M868927L992119N440903L528404N095291K476197
1482.3E21098061M180755L796616L010406M110260K237702N237770K113609L491287
$$ plain form
1490 549276466 551348038 554348145 558123283 560218811 563719444 564570694 565862770 568323746 571012383
1498.7 571012383 573289757 575414810 578386879 579697151 582360039 584123001 588333817 587625694
1506.4 587625694 581256676 587499352 588339272 591699219 592918892 594887581 595224380 596907578 599229279
1515.1 599229279 599313660 601289139 599056015 603080521 605993347 607022705 607116547 604114113 608194771
1523.7 608194771 610132523 611197968 611463890 612844048 613299408 613549271 615273819 615704803 617781219
1532.4 617781219 616726799 615588875 617593269 619015617 621081810 621855659 621830635 615958405 621507683
1541.1 621507683 622394829 621495514 624142799 623317947 622958221 623677406 624985886 625839310 625140495
1549.8 625140495 623771362 624472961 626308098 627055740 626283302 625989761 629183426 632978210 627394791
$$ packed form
1490E49276466K071572L000107L775138K095528L500633Q51250J292076K460976K688637
1498.7E71012383K277374K125053K972069J310272K662888J762962M210816p08123
1506.4E87625694o369018O242676Q39920L359947J219673J968689L36799J683198K321701
1515.1E99229279Q4381J975479k233124M024506K912826J029358R3842l002434M080658
1523.7F08194771J937752J065445K65922J380158M55360K49863J724548M30984K076416
1532.4F17781219j054420j137924K004394J422348K066193P73849k5024n872230N549278
1541.1F21507683Q87146q99315K647285q24852l59726P19185J308480Q53424o98815
1549.8F25140495j369133P01599J835137P47642p72438k93541L193665L794784n583419
$$ plain form
1558.5 627394791 622715645 619721031 623940277 625464249 626174278 626379356 624394951 623829803 624247131
1567.1 624247131 625400505 625827255 622255402 621516190 621970100 621832199 621434517 622248726 621391869
1575.8 621391869 615921898 617354088 618417168 618271294 617636147 616755562 616025963 615427399 614751701
1584.5 614751701 613567772 612283249 611058731 610099754 609382362 608198357 607315407 606183815 605262184
1593.2 605262184 603941879 602279434 601227379 599396820 597901192 596016769 594327126 592725677
1600.9 592725677 591278152 590264511 588421974 586953964 585164375 583861275 581669769 579690933
1608.6 579690933 577621269 574256783 572521973 570331650 568887177 567197723 566689453 565726509 558219261
1617.3 558219261 557850113 556352272 554814110 553092194 552786217 551085358 545797310 545467224 544668274
$$ packed form
1558.5F27394791m679146k994614M219246J523972P10029K05078j984405n65148M17328
1567.1F24247131J153374M26750l571853p39212M53910j37901l97682Q14209q56857
1575.8F21391869n469971J432190J063080j45874o35147q80585p29599n98564o75698
1584.5F14751701j183929j284523j224518r58977p17392j184005q82950j131592r21631
1593.2F05262184j320305j662445j052055j830559j495628j884423j689643j601449
1600.9E92725677j447525j013641j842537j468010j789589j303100k191506j978836
1608.6E79690933k069664l364486j734810k190323j444473j689454n08270r62944p507248
1617.3E58219261l69148j497841j538162j721916l05977j700859n288048l30086p98950
$$ plain form
1626 544668274 544243431 541372070 539546776 539040375 538330612 537702217 535840645 535823250 535723381 531952095
1635.6 531952095 530063629 530964851 530784149 530886536 531368675 530647774 531522713 531391258 532762108
1644.3 532762108 534305763 533256645 534508553 533423462 534985466 536873093 540095940 542812042
1652 542812042 541679344 538418121 540635948 544423141 546058693 547530518 548536987 550412979 552831573
1660.7 552831573 555184975 557723923 558333359 560878372 562914810 565160103 568080940 570988350
1668.4 570988350 571819000 573291855 577149506 579322701 582464294 585836754 587698746 588535614 591766815
1677.1 591766815 595322952 598599129 602239761 604322929 607739868 612222061 614711494 610492134
1684.8 610492134 616265564 621952019 625369415 627841148 630578995 633350792 636197205 639229622
$$ packed form
1626E44668274m24843k871361j825294n06401p09763o28395j861572j7395r9869l771286
1635.6E31952095j888466R01222j80702J02387M82139p20901Q74939j31455J370850
1644.3E32762108J543655j049118J251908j085091J562004J887627L222847K716102
1652E42812042j132698l261223K217827L787193J635552J471825J006469J875992K418594
1660.7E52831573K353402K538948O09436K545013K036438K245293K920837K907410
1668.4E70988350Q30650J472855L857651K173195L141593L372460J861992Q36868L231201
1677.1E91766815L556137L276177L640632K083168L416939M482193K489433m219360
1684.8F10492134N773430N686455L417396K471733K737847K771797K846413L032417
$$ plain form
1692.5 639229622 642000885 645505829 648698425 647867126 651689148 655265427 659416733 658619690 655959549
1701.2 655959549 661075439 664449768 666906052 667870636 669762344 669595566 670585632 672940445 674072952
1709.9 674072952 674889297 676028976 677563705 679153137 679748688 679560318 682396469 683526611 677774582
1718.5 677774582 680774307 683297806 684486160 684881668 685216675 685432205 685905838 686626129 687378693
1727.2 687378693 688912659 689992523 689616547 689893341 692737045 695587540 692070847 687988968 691323318
1735.9 691323318 694180679 695372086 696996307 696335983 694946136 697948685 699510880 699468918 700010834
1744.6 700010834 701876907 703436508 704652481 705801697 706355667 709508286 709421768 709294205 712243729
1753.3 712243729 714082565 716497574 718617783 718675308 719677200 721356812 722779236 725133896 725013199
$$ packed form
1692.5F39229622K771263L504944L192596q31299L822022L576279M151306p97043k660141
1701.2F55959549N115890L374329K456284R64584J891708j66778R90066K354813J132507
1709.9F74072952Q16345J139679J534729J589432N95551j88370K836151J130142n752029
1718.5F77774582K999725K523499J188354L95508L35007K15530M73633P20291P52564
1727.2F87378693J533966J079864l75976K76794K843704K850495l516693m081879L334350
1735.9F91323318K857361J191407J624221o60324j389847L002549J562195m1962N41916
1744.6G00010834J866073J559601J215973J149216N53970L152619q6518j27563K949524
1753.3G12243729J838836K415009K120209N7525J001892J679612J422424K354660j20697
$$ plain form
1761.9 725013199 724511948 726684036 727995224 729099960 730388184 731587601 730537567 731990356
1769.7 731990356 734893417 735376892 733771667 732118225 735294647 736676331 735942993 737485199 738192749
1778.3 738192749 739267883 739397202 739167328 739861298 740864792 741998062 741635971 741628571 742269135
1787 742269135 743128738 743315506 744022751 744990082 745133438 743821182 743459625 746001434 746716690 746323471
1796.7 746323471 747303467 748761292 748860321 747607651 748679199 748299255 748587341 749702148 750409546
1805.3 750409546 751312714 751552734 751844177 752276993 752801132 751545563 751926804 753009033 753082428
1814 753082428 753809891 754063110 754723434 754392014 754654922 755193939 755076675 755957565 755936279 756819534
1823.7 756819534 757193527 755343170 755833359 757843933 759726028 759314423 756308823 756520538 758286285
$$ packed form
1761.9G25013199n01251K172088J311188J104736J288224J199417j050034J452789
1769.7G31990356K903061M83475j605225j653442L176422J381684p33338J542206P07550
1778.3G38192749J075134J29319k29874O93970J003494J133270l62091p400O40564
1787G42269135Q59603J86768P07245R67331J43356j312256l61557K541809P15256l93219
1796.7G46323471R79996J457825R9029j252670J071548l79944K88086J114807P07398
1805.3G50409546R03168K40020K91443M32816N24139j255569L81241J082229P3395
1814G53082428P27463K53219O60324l31420K62908N39017j17264Q80890k1286Q83255
1823.7G56819534L73993j850357M90189K010574J882095m11605l005600K11715J765747
$$ plain form
1832.3 758286285 758635330 759055328 759321976 759323883 759681396 758991547 759374695 759518051 759901657 760436478
1842 760436478 761426010 761786118 757825623 759181595 760795746 761017380 760327682 760273819 760906754 760691376
1851.6 760691376 761074600 761004181 761345062 761405716 761459732 761898499 761686935 761793289 761606140 762245407
1861.3 762245407 762042389 762078323 762386322 762241211 763195724 763083649 763607635 762821960 761782837 762442017
1870.9 762442017 762701187 763192902 763011551 763176727 763126678 763465042 763932419 764308014 764856949 764480667
1880.6 764480667 764440765 764147339 764495468 764616776 764549942 764983902 765096512 766274109 766623993 765662613
1890.2 765662613 765485306 765721130 765650101 766390610 767064896 766070404 766512680 766793900 766986160 766985397
1899.8 766985397 766796722 767395248 767259674 767468185 767414627 767160950 766844711 766882172 767223206 767009735
$$ packed form
1832.3G58286285L49045M19998K66648J907L57513o89849L83148J43356L83606N34821
1842G60436478R89532L60108l960495J355972J614151K21634o89698n3863O32935k15378
1851.6G60691376L83224p0419L40881O0654N4016M38767k11564J06354j87149O39267
1861.3G62245407k03018L5934L07999j45111R54513j12075N23986p85675j039123O59180
1870.9G62442017K59170M91715j81351J65176n0049L38364M67377L75595N48935l76282
1880.6G64480667l9902k93426L48129J21308o6834M33960J12610J177597L49884r61380
1890.2G65662613j77307K35824p1029P40509O74286r94492M42276K81220J92260p63
1899.8G66985397j88675N98526j35574K08511n3558k53677l16239L7461L41034k13471
$$ plain form
1909.5 767009735 767058716 766936417 767543335 767537918 767494125 767600708 767784500 768724899 767056198 766498489
1919.1 766498489 767589340 768487167 769019394 768016052 767351913 767685699 768073273 767979202 768394699
1927.8 768394699 768045883 767736053 768398972 768471375 768350754 767801285 768233948 768424530 768250580 768247452
1937.5 768247452 767862625 768037491 767830200 768528061 768591537 767719421 768203354 768411102 768540115 768649139
1947.1 768649139 769160461 769216614 769146347 768818436 768313065 768453064 768409576 768721390 768838272 769024277
1956.7 769024277 769216766 769428101 769765472 769788971 769615250 769382858 769929504 769701233 769785919 770055008
1966.4 770055008 769390793 769750214 770136032 770673599 770662842 770569458 770733414 770680313 770539093 769809952
1976 769809952 769862366 770048218 770074997 770001984 770072327 770619049 771119995 771484909 771187592 771182632 770813293
$$ packed form
1909.5G67009735M8981j22299O06918n417m3793J06583J83792R40399j668701n57709
1919.1G66498489J090851Q97827N32227j003342o64139L33786L87574r4071M15497
1927.8G68394699l48816l09830O62919P2403j20621n49469M32663J90582j73950l128
1937.5G68247452l84827J74866k07291O97861O3476q72116M83933K07748J29013J09024
1947.1G68649139N11322N6153p0267l27911n05371J39999m3488L11814J16882J86005
1956.7G69024277J92489K11335L37371K3499j73721k32392N46646k28271Q4686K69089
1966.4G70055008o64215L59421L85818N37567j0757r3384J63956n3101j41220p29141
1976G69809952N2414J85852K6779p3013P0343N46722N00946L64914k97317m960l69339
$$ plain form
1986.6 770813293 770603409 770388184 769586639 769998703 770423889 770241318 770341034 771353912 771685486 771483459
1996.3 771483459 771623230 771155090 770932159 770081558 769780884 769967957 769820328 770247421 770274429 770193787
2005.9 770193787 770096970 770238876 770213165 770118713 769731979 769006729 768835754 768369217 768333511 768541794
2015.6 768541794 768757553 768696747 768628082 768916016 768525925 768159714 767390900 766755371 766296234 766016159
2025.2 766016159 765948105 765545197 765764008 765988770 766344299 766391678 766199570 765823059 765344391 765238724
2034.9 765238724 764517517 764110794 763446274 762914352 762889633 763153000 763659134 763556976 763994370 763712769
2044.5 763712769 763137054 762777634 762521973 762435074 761832886 761987915 761919479 762076569 762185974 762062988
2054.1 762062988 762477646 762616425 762821503 762328720 761885605 761353073 761092072 761370544 761494827 761957779
$$ packed form
1986.6G70813293k09884k15225q01545M12064M25186j82571R9716J012878L31574k02027
1996.3G71483459J39771m68140k22931q50601l00674J87073j47629M27093K7008q0642
2005.9G70193787r6817J41906k5711r4452l86734p25250j70975m66537l5706K08283
2015.6G68541794K15759o0806o8665K87934l90091l66211p68814o35529m59137k80075
2025.2G66016159o8054m02908K18811K24762L55529M7379j92108l76511m78668j05667
2034.9G65238724p21207m06723o64520n31922k4719K63367N06134j02158M37394k81601
2044.5G63712769n75715l59420k55661q6899o02188J55029o8436J57090J09405j22986
2054.1G62062988M14658J38779K05078m92783m43115n32532k61001K78472J24283M62952
$$ plain form
2063.8 761957779 761785507 761935501 762118759 762342300 762526016 762223511 762212601 761996536 762010040 761575699
2073.4 761575699 761600037 761839218 762029419 762749329 762490616 762395782 762226257 762032166 761969681 761894379
2083.1 761894379 762092819 762052994 762298813 762215118 762091904 762108383 762708282 763147354 762952271 763190613
2092.7 763190613 762891006 762616272 762298889 762482300 762699661 762155609 762188263 762565536 763099136 762931366
2102.4 762931366 762791138 762996597 763216095 763366623 763210678 763480682 763363419 763434143 763495255 763432312
2112 763432312 763442230 763638916 764141998 763636780 763508987 763363037 763154068 763299255 763342590 763638077
2121.6 763638077 763551636 763756256 763814697 764228210 764328461 763765030 763931503 763648300 763195038 763155670
2131.3 763155670 763945007 764338379 764212036 764340591 764141083 764196777 763806915 763756638 763938980 763933563
$$ packed form
2063.8G61957779j72272J49994J83258K23541J83716l02505j0910k16065J3504m34341
2073.4G61575699K4338K39181J90201P19910k58713r4834j69525j94091o2485p5302
2083.1G61894379J98440l9825K45819q3695j23214J6479N99899M39072j95083K38342
2092.7G63190613k99607k74734l17383J83411K17361n44052L2654L77273N33600j67770
2102.4G62931366j40228K05459K19498J50528j55945K70004j17263P0724O1112o2943
2112G63432312R918J96686N03082n05218j27793j45950k08969J45187M3335K95487
2121.6G63638077q6441K04620N8441M13513J00251n63431J66473k83203m53262l9368
2131.3G63155670P89337L93372j26343J28555j99508N5694l89862n0277J82342n417
$$ plain form
2140.9 763933563 764053116 763839264 763655853 763367767 763703156 764197693 764488907 764303741 764085007 764166489
2150.6 764166489 763780136 764282074 764796066 764702148 764117737 763717041 764311371 764831161 765169678 765048370
2160.2 765048370 765363541 765700912 765533218 765379639 765307312 765561371 765578842 765857162 766004944 766427917
2169.9 766427917 766690521 766453247 766711197 766923599 767567596 767737656 767941132 768431168 768381653 768291016
2179.5 768291016 768238602 768836975 769180603 769383011 769373550 769429932 769940414 769893799 769778900 770014725
2189.1 770014725 770879440 771132050 771379623 771656189 771167831 771429443 771872864 772184601 771985626 772009277
2198.8 772009277 772396927 772698364 772978668 772757874 773231430 773271866 773018494 773177795 773385620 773766251
2208.4 773766251 773992462 774395142 774166641 774420700 775159683 775545120 775453186 774983521 775493164 775645599
$$ packed form
2140.9G63933563J19553k13852j83411k88086L35389M94537K91214j85166k18734Q1482
2150.6G64166489l86353N01938N13992r3918n84411m00696N94330N19790L38517j21308
2160.2G65048370L15171L37371j67694j53579p2327K54059J7471K78320J47782M22973
2169.9G66427917K62604k37274K57950K12402O43997J70060K03476M90036m9515r0637
2179.5G68291016n2414N98373L43628K02408r461N6382N10482m6615j14899K35825
2189.1G70014725Q64715K52610K47573K76566m88358K61612M43421L11737j98975K3651
2198.8G72009277L87650L01437K80304k20794M73556M0436k53372J59301K07825L80631
2208.4G73766251K26211M02680k28501K54059P38983L85437r1934m69665N09643J52435
$$ plain form
2218.1 775645599 775598679 775840454 776107559 776493988 776670761 776796265 776624603 776741562 776689072 776699371
2227.7 776699371 776890488 777144623 777320023 776953049 777153244 777098694 777070312 777222824 777370758 777890930
2237.4 777890930 778142776 778553009 778461227 778263016 778266525 778367310 778583450 778568344 778703308 778800430
2247 778800430 779031372 778720016 778699875 779350739 779593353 779515533 779211807 779123154 779002457 779163437
2256.7 779163437 779155655 779264832 779438248 779160233 779583206 779741821 779721909 779733658 779849472 780183487
2266.3 780183487 780422745 780531464 780116577 780167007 780080872 780119858 780243454 780414963 781163254 781404343
2275.9 781404343 781472702 780969925 781089554 781440277 781209183 781174240 780904388 781143646 780945740 781070404
2285.6 781070404 781568985 781606216 781686401 781533356 781773453 781818695 782088852 781947174 781547546 781308594
$$ packed form
2218.1G75645599m6920K41775K67105L86429J76773J25504j71662J16959n2490J0299
2227.7G76699371J91117K54135J75400l66974K00195n4550k8382J52512J47934N20172
2237.4G77890930K51846M10233r1782j98211L509J00785K16140j5106J34964R7122
2247G78800430K30942l11356k0141O50864K42614p7820l03726q8653j20697J60980
2256.7G79163437p782J09177J73416k78015M22973J58615j9912J1749J15814L34015
2266.3G80183487K39258J08719m14887N0430q6135L8986J23596J71509P48291K41089
2275.9G81404343O8359n02777J19629L50723k31094l4943k69852K39258j97906J24664
2285.6G81070404M98581L7231Q0185j53045K40097M5242K70157j41678l99628k38952
$$ plain form
2295.2 781308594 780799942 781317978 781549683 781822128 781957397 781962509 782328262 782014084 782306442 782779770
2304.9 782779770 782933044 782720566 782630768 782760773 782425537 782257004 782445221 783145523 783286819 783326874
2314.5 783326874 783317184 783412094 783531036 782718964 782484818 782301941 782795639 783176956 782630463 782481155
2324.2 782481155 782455978 783454437 784388657 784082565 782837143 781966629 781497192 781699295 781508560 780502090
2333.8 780502090 781506805 782531586 783008728 782503662 782248001 782858658 783179321 783361664 782004623
2342.5 782004623 781998444 781389389 779610443 778990555 779034882 779842300 780559921 781694489 781859970 782246094
2352.1 782246094 782842178 781935196 781556625 781075058 781565094 780450058 779533920 779290161 779262772 780823746
2361.8 780823746 781082153 781260147 780075531 779750443 779257431 778603516 777996750 776591797 777143097
$$ packed form
2295.2G81308594n08652N18036K31705K72445J35269N112L65753l14178K92358M73328
2304.9G82779770J53274k12478q9798J30005l35236j68533J88217P00302J41296M0055
2314.5G83326874r690R4910J18942q12072k34146j82877M93698L81317n46493j49308
2324.2G82481155k5177R98459R34220l06092j245422q70514m69437K02103j90735j006470
2333.8G80502090J004715J024781M77142n05066k55661O10657L20663J82343j357041
2342.5G82004623o179o09055j778946o19888M4327Q07418P17621J134568J65481L86124
2352.1G82246094N96084r06982l78571m81567M90036j115036r16138k43759k7389J560974
2361.8G80823746K58407J77994j184616l25088m93012o53915o06766j404953N51300
$$ plain form
2370.4 777143097 777154160 777242737 776626587 775952148 776460266 776127548 775866928 775900650 775868378 775190125
2380.1 775190125 774640884 774013672 773277359 773191605 772927551 773153839 773708344 773872223 773593674 773589783
2389.7 773589783 773561478 773025131 772700577 772159119 772116470 771723404 770979919 771147385 771346130 771188049
2399.4 771188049 770856018 771044464 771132050 771226578 771067886 770455704 770115814 769346237 768918686 768775940
2409 768775940 768623199 768589859 768783340 768956375 768615189 768417130 767983932 767582474 767071304 766551361
2418.7 766551361 766226654 766119843 766257095 765680695 765445862 765329971 765023117 764567032 764137650 763996735
2428.3 763996735 763209305 762868500 762487488 761858444 761530609 761610413 761751251 761046982 760798645 760457458
2438 760457458 759811478 759350204 759009705 758685989 758213577 758441544 758362045 757747269 757096329 756619034
$$ packed form
2370.4G77143097J1063Q8577o16150o74439N08118l32718k60620L3722l2272o78253
2380.1G75190125n49241o27212p36313q5754k64054K26288N54505J63879k78549l891
2389.7G73589783k8305n36347l24554n41458m2649l93066p43485J67466J98745j58081
2399.4G71188049l32031J88446Q7586R4528j58692o12182l39890p69577m27551j42746
2409G68775940j52741l3340J93481J73035l41186j98059m33198m01458n11170n19943
2418.7G66551361l24707j06811J37252n76400k34833j15891l06854m56085m29382j40915
2428.3G63996735p87430l40805l81012o29044l27835P9804J40838p04269k48337l41187
2438G60457458o45980m61274l40499l23716m72412K27967p9499o14776o50940m77295
$$ plain form
2447.6 756619034 756064911 755696564 755887146 755510330 755332947 755048981 754263535 753399277 752906265 753076324
2457.2 753076324 753040009 752571487 751693726 751641922 751353607 750712967 750853882 750807800 750733795 750086517
2466.9 750086517 749699554 749707642 749718781 749281158 748281784 748149261 747763214 747436371 747113113 746731262
2476.5 746731262 746389923 745594788 745575104 745797729 745877457 745329208 744938507 744626617 743846130 743770752
2486.2 743770752 743518677 743404465 743142624 742851944 742976837 742830582 742482681 742005692 741944275 741553650
2495.8 741553650 741215973 740922089 740514221 740456161 740298767 740747299 740835876 740044174 739217072 739010696
2505.5 739010696 739202423 739365158 739477692 739153214 738916855 738316345 737901535 737709656 737441177 737571564
2515.1 737571564 737555084 737649765 737215729 736886444 736613770 735944595 735466843 735105972 735348587 735172501
$$ packed form
2447.6G56619034n54123l68347J90582l76816j77383k83966p85446q64258m93012J70059
2457.2G53076324l6315m68522q77761n1804k88315o40640J40915m6082p4005o47278
2466.9G50086517l86963Q088J1139m37623r99374j32523l86047l26843l23258l81851
2476.5G46731262l41339p95135j9684K22625P9728n48249l90701l11890p80487p5378
2486.2G43770752k52075j14212k61841k90680J24893j46255l47901m76989o1417l90625
2495.8G41553650l37677k93884m07868n8060j57394M48532Q8577p91702q27102k06376
2505.5G39010696J91727J62735J12534l24478k36359o00510m14810j91879k68479J30387
2515.1G37571564j6480R4681m34036l29285k72674o69175m77752l60871K42615j76086
$$ plain form
2524.7 735172501 735001678 734832001 734328079 734062119 733637619 733665390 733628159 733297958 732711487 732224503
2534.4 732224503 731787262 731093979 730912094 730682526 730752487 730963745 730637589 729784241 728996201 728639603
2544 728639603 728129425 727798767 727326584 726958923 726656494 726239014 725972748 725734406 725618744 725228577
2553.7 725228577 725133057 724980621 724562149 723879929 723066711 722446518 721573563 721501312 721578751 721696167
2563.3 721696167 721890106 721669159 721436386 720623245 720311127 720049362 719231415 718569641 718180847 717951279
2573 717951279 717552719 717469406 717368546 717140427 716665726 716489868 716156845 715224457 715005569 714574051
2582.6 714574051 714328995 714189377 713666534 713265915 712619705 712513809 712660217 712279282 711518250 711397400
2592.2 711397400 711453171 710988617 710820007 710805893 710690536 710145340 709962540 709855194 709328079 708938446
$$ packed form
2524.7G35172501j70823j69677n03922k65960m24500K7771l7231l30201n86471m86984
2534.4G32224503m37241o93283j81885k29568O9961K11258l26156q53348p88040l56598
2544G28639603n10178l30658m72183l67661l02429m17480k66266k38342j15662l90167
2553.7G25228577r5520j52436m18472o82220q13218o20193q72955p2251P7439J17416
2563.3G21696167J93939k20947k32773q13141l12118k61765q17947o61774l88794k29568
2573G17951279l98560q3313j00860k28119m74701j75858l33023r32388k18888m31518
2582.6G14574051k45056j39618n22843m00619o46210j05896J46408l80935p61032j20850
2592.2G11397400N5771m64554j68610j4114j15357n45196j82800j07346n27115l89633
$$ plain form
2601.9 708938446 708620911 708674622 708637238 708475876 707666092 706974335 706957169 706399460 705923691 705602188
2611.5 705602188 705433121 705193253 704736938 703920059 703019638 702796707 702631912 702503586 701935577 701412964
2621.2 701412964 701072159 700413742 699722519 698899536 698320389 697556992 697160263 696465302 695457458
2629.9 695457458 695335464 694956360 694423370 693562469 692843170 692303848 691339188 690727997 690195999 689727859
2639.5 689727859 689162521 688605881 688112717 687301178 686351776 685872345 685570908 684549713 683805771
2648.2 683805771 683433228 682940979 682369690 681682587 681056137 680585937 680361786 679858170 679235687 678357468
2657.8 678357468 677249222 676033249 675164566 675115967 674632187 674143372 673632507 672921143 672626724
2666.5 672626724 672384872 672024384 671413498 671171036 670641785 669628448 668784637 668140335 667860718
$$ packed form
2601.9G08938446l17535N3711l7384j61362q09784o91757j7166n57709m75769l21503
2611.5G05602188j69067k39868m56315q16879r00421k22931j64795j28326n68009n22613
2621.2G01412964l40805o58417o91223q22983n79147p63397l96729o94961j007844
2629.9F95457458j21994l79104n32990q60901p19299n39322r64660o11191n31998m68140
2639.5F89727859n65338n56640m93164q11539r49402m79431l01437j021195p43942
2648.2F83805771l72543m92249n71289o87103o26450m70200k24151n03616o22483q78219
2657.8F78357468j108246j215973q68683m8599m83780m88815n10865p11364k94419
2666.5F72626724k41852l60488o10886k42462n29251j013337q43811o44302k79617
$$ plain form
2675.2 667860718 667572861 667573471 667070007 666214828 666016388 665638885 664979782 664237061 663151016 662096481
2684.8 662096481 661826706 661755371 661552200 661301727 660728836 660036469 659449387 659395523 659176788 658572922
2694.5 658572922 657703629 656771011 656263580 655365829 654638596 654485855 654167328 653658981 653400955 653099060
2704.1 653099060 652215500 651390152 650743027 650312500 649817352 648972778 648247070 647731934 647223892 646607819
2713.8 646607819 646215820 645857010 645493927 645008316 644317017 643749771 643194885 642576065 641802521 641190796
2723.4 641190796 640698166 640610809 640668259 640315552 639697723 638747139 638586731 638575478 637877312 636973305
2733 636973305 636137619 635945473 635972939 635974274 635372620 634839058 634754562 634168243 633685722 633305817 632943649
2743.7 632943649 632603378 632498741 632268066 631570358 631225739 630891533 630388031 629810371 629392815 629329872
$$ packed form
2675.2F67860718k87857O10n03464q55179j98440l77503o59103p42721j086045j054535
2684.8F62096481k69775p1335k03171k50473n72891o92367n87082n3864k18735o03866
2694.5F58572922q69293r32618n07431q97751p27233j52741l18527n08347k58026l01895
2704.1F53099060q83560q25348o47125m30527m95148q44574p25708n15136n08042o16073
2713.8F46607819l91999l58810l63083m85611o91299n67246n54886o18820p73544o11725
2723.4F41190796m92630q7357N7450l52707o17829r50584j60408j1253o98166r04007
2733F36973305q35686j92146K7466J335o01654n33562q4496n86319m82521l79905l62168
2743.7F32943649l40271j04637k30675o97708l44619l34206n03502n77660m17556o2943
$$ plain form
2753.3 629329872 629258652 628683739 627906761 627392197 626845551 626622200 626254425 626035461 626121216 625648346
2762.9 625648346 625075378 624682388 624652596 624541397 624190140 623539276 623052483 623180923 623028831 622635536
2772.6 622635536 622054291 621679764 621107292 620452614 620124245 619340439 618704605 618224258 617978439 617579689
2782.2 617579689 617196617 617105827 616343956 615459290 614768295 614551849 613821793 612866631 612579575 611632042
2791.9 611632042 610679550 609892387 609051628 608332558 607710991 607301178 606534958 605396500 604154167
2800.5 604154167 603118553 602276230 601823120 601234055 600031204 598902473 598211784 597613792 596371994
2809.2 596371994 595298080 594579697 593850975 592804070 591076202 589771156 588861771 587867355 586672554
2817.9 586672554 585565567 584394188 583012924 581919785 580596581 579405060 578395920 576958580
$$ packed form
2753.3F29329872p1220n74913p76978n14564n46646k23351l67775k18964Q5755m72870
2762.9F25648346n72968l92990k9792j11199l51257o50864m86793J28440j52092l93295
2772.6F22635536n81245l74527n72472o54678l28369p83806o35834m80347k45819l98750
2782.2F17579689l83072r0790p61871q84666o90995k16446p30056r55162k87056r47533
2791.9F11632042r52492p87163q40759p19070o21567m09813p66220j138458j242333
2800.5F04154167j035614q42323m53110n89065j202851j128731o90689n97992j241798
2809.2E96371994j073914p18383p28722j046905j727868j305046r09385r94416j194801
2817.9E86672554j106987j171379j381264j093139j323204j191521j009140j437340
$$ plain form
2825.6 576958580 575002365 573420029 572495308 571421394 570429726 569025345 567769508 566787415 565335426
2834.3 565335426 563857574 562141037 560421677 558776817 557137718 555046577 552920074 551313934
2842 551313934 549344711 547372971 545533333 543831291 541997871 539592209 536964493 534537277 532564125
2850.7 532564125 530667839 528868599 527067947 525622749 524408569 523094711 521710701 519944687
2858.4 519944687 518785667 517775192 516362381 515191231 513902969 511994133 509834824 507918816
2866.1 507918816 505845718 503779488 501260414 498482552 496221619 493989372 491702690 489162483
2873.8 489162483 486438637 483543587 481035271 478707542 476040916 473894882 471871681 469959373
2881.6 469959373 468309975 466556892 464824791 463510551 462254791 460841484 460250778 459787941 459196892
$$ packed form
2825.6E76958580j956215j582336r24721j073914r91668j404381j255837r82093j451989
2834.3E65335426j477852j716537j719360j644860j639099k091141k126503j606140
2842E51313934j969223j971740j839638j702042j833420k405662k627716k427216j973152
2850.7E32564125j896286j799240j800652j445198j214180j313858j384010j766014
2858.4E19944687j159020j010475j412811j171150j288262j908836k159309j916008
2866.1E07918816k073098k066230k519074k777862k260933k232247k286682k540207
2873.8D89162483k723846k895050k508316k327729k666626k146034k023201j912308
2881.6D69959373j649398j753083j732101j314240j255760j413307n90706m62837n91049
$$ plain form
2890.2 459196892 458422089 457765236 457918243 457699165 457114754 456521759 456327057 456033020 455671616 455584145
2899.9 455584145 454666862 454100571 453891068 453320580 452279282 451212387 450923882 450349312 449502029
2908.6 449502029 448273048 446809998 445254250 443534889 442301445 440912704 439187126 437121887
2916.3 437121887 435093803 433266296 431045189 428612213 426768951 425548363 424259186 423265038
2924 423265038 421734924 419946213 419241447 418974342 418516541 418004875 417814026 417594833 418333206 419873238
2933.6 419873238 421180496 422796631 424461632 426466904 428720779 430928307 432979088 435492935
2941.3 435492935 438784714 441665115 444238739 446998940 450213356 453052597 455807114 459001274
2949.1 459001274 461639252 464370041 467435799 470496597 473129578 475728226 478915176 482043076
$$ packed form
2890.2D59196892p74803o56853J53007k19078n84411n92995j94702k94037l61404q7471
2899.9D55584145r17283n66291k09503n70488j041298j066895k88505n74570q47283
2908.6D49502029j228981j463050j555748j719361j233444j388741j725578k065239
2916.3D37121887k028084j827507k221107k432976j843262j220588j289177r94148
2924D23265038j530114j788711p04766k67105m57801n11666j90849k19193P38373J540032
2933.6D19873238J307258J616135J665001K005272K253875K207528K050781K513847
2941.3D35492935L291779K880401K573624K760201L214416K839241K754517L194160
2949.1D59001274K637978K730789L065758L060798K632981K598648L186950L127900
$$ plain form
2956.8 482043076 484785690 487466202 490577850 493648605 496390343 498759575 501083946 503223648
2964.5 503223648 505336990 508136864 510512886 512450600 514424973 516733246 518900566 520557976
2972.2 520557976 522630920 524711494 526810341 528770218 530768242 533056068 534884644 536319275
2979.9 536319275 538045769 540243073 541616096 542524147 543832970 545512238 547194672 548049583 549017982
2988.6 549017982 550489578 551629906 552367210 553459625 554398994 554559898 554966087 555682144 555993347
2997.3 555993347 555784798 556212082 556927147 556985588 557123528 557213020 557069130 556797028 556459808 556196938
3006.9 556196938 556088371 555799980 555385513 555022774 554271011 553460922 552732849 552173271 551436806 550741272
3016.6 550741272 550236053 549205360 547932281 546661034 546211967 545606575 544445076 543699417 542589989
$$ packed form
2956.8D82043076K742614K680512L111648L070755K741738K369232K324371K139702
2964.5E03223648K113342K799874K376022J937714J974373K308273K167320J657410
2972.2E20557976K072944K080574K098847J959877J998024K287826J828576J434631
2979.9E36319275J726494K197304J373023R08051J308823J679268J682434Q54911R68399
2988.6E49017982J471596J140328P37304J092415R39369J60904M06189P16057L11203
2997.3E55993347k08549M27284P15065N8441J37940Q9492j43890k72102l37220k62870
3006.9E56196938j08567k88391m14467l62739p51763q10089p28073n59578p36465o95534
3016.6E50741272n05219j030693j273079j271247m49067o05392j161499p45659j109428
$$ plain form
3025.2 542589989 541458664 540171165 539018021 538113480 536909485 535635452 534097404 532853966
3033 532853966 531642952 530323105 529040680 527749825 526623421 525509605 524390793 523134003 521857529
3041.6 521857529 520063362 518500290 517550545 516147614 514499435 513127365 512257843 510672722 508819885
3050.3 508819885 507703552 506404839 504952583 503503494 502222252 500764694 499008484 497411995
3058 497411995 495957794 494580765 493301353 492083893 490686417 489240456 487414284 485876808 484633751
3066.7 484633751 482808952 481128044 479627953 478638954 477704735 476360245 475243034 473847122 472324219
3075.4 472324219 470884590 469255676 467785873 466526680 464996910 463309097 461601105 460160408
3083.1 460160408 458940392 457544022 456398544 454992104 453684387 452187767 450342026 449438667
$$ packed form
3025.2E42589989j131325j287499j153144r04541j203995j274033j538048j243438
3033E32853966j211014j319847j282425j290855j126404j113816j118812j256790j276474
3041.6E21857529j794167j563072r49745j402931j648179j372070q69522j585121j852837
3050.3E08819885j116333j298713j452256j449089j281242j457558j756210j596489
3058D97411995j454201j377029j279412j217460j397476j445961j826172j537476j243057
3066.7D84633751j824799j680908j500091r88999r34219j344490j117211j395912j522903
3075.4D72324219j439629j628914j469803j259193j529770j687813j707992j440697
3083.1D60160408j220016j396370j145478j406440j307717j496620j845741r03359
$$ plain form
3090.8 449438667 448109665 446478691 444994469 443369751 442222290 440980911 439651794 438150673
3098.5 438150673 436730347 435425186 433907127 432585945 431218452 429657516 428375130 427466049
3106.2 427466049 426035042 424243851 422645302 421421700 420523911 419259682 417670708 416026039
3114 416026039 415002556 414015884 412196426 410535316 409625244 408740997 407327232 406067276 404630127
3122.6 404630127 403288994 402203445 400746346 399298058 397662506 396532249 395780983 394340591
3130.4 394340591 392659492 391799393 391069603 389423065 388140602 387001610 385658493 384180260 382752686
3139 382752686 381860123 380483551 379173164 378245316 377044029 375869293 374839287 373438568 372124443
3147.7 372124443 371278992 369973946 369162025 368469391 367266083 366326637 364975853 363371964 361925430
$$ packed form
3090.8D49438667j329002j630974j484222j624718j147461j241379j329117j501121
3098.5D38150673j420326j305161j518059j321182j367493j560936j282386r09081
3106.2D27466049j431007j791191j598549j223602q97789j264229j588974j644669
3114D16026039j023483r86672j819458j661110r10072q84247j413765j259956j437149
3122.6D04630127j341133j085549j457099j448288j635552j130257p51266j440392
3130.4C94340591j681099q60099p29790j646538j282463j138992j343117j478233j427574
3139C82752686q92563j376572j310387r27848j201287j174736j030006j400719j314125
3147.7C72124443q45451j305046q11921o92634j203308r39446j350784j603889j446534
$$ plain form
3156.4 361925430 360937996 359967499 358732109 357676926 356755333 355709877 354236336 353174973 352317734
3165.1 352317734 351254196 350123520 349108009 348490677 347624321 346536102 345176773 343995361 343069458
3173.8 343069458 342150650 341574783 340713959 339370041 338081284 337358284 336578407 335790825 334790306
3182.4 334790306 333476410 332563095 331353340 330618782 329955177 328963242 328287811 327342758 326614723
3191.1 326614723 325844803 324875679 323917465 323213348 322553749 321900024 321508827 320183105 319002628
3199.8 319002628 318451653 317446823 316275253 315580292 315293789 314546185 313284378 312152653 311891956
3208.5 311891956 311557064 310583286 309838333 309557133 309248981 308210297 307360516 306664104 306037788
3217.2 306037788 305324421 304354172 303659992 302631550 302029514 301555214 301175957 300614700 299403934
$$ packed form
3156.4C61925430r87434r70497j235390j055183r21593j045456j473541j061363q57239
3165.1C52317734j063538j130676j015511o17332q66356j088219j359329j181412r25903
3173.8C43069458r18808n75867q60824j343918j288757p23000p79877p87582j000519
3182.4C34790306j313896r13315j209755p34558o63605r91935o75431r45053p28035
3191.1C26614723p69920r69124r58214p04117o59599o53725l91197j325722j180477
3199.8C19002628n50975j004830j171570o94961k86503p47604j261807j131725k60697
3208.5C11891956l34892r73778p44953k81200l08152j038684q49781o96412o26316
3217.2C06037788p13367r70249o94180j028442o02036m74300l79257n61257j210766
$$ plain form
3225.8 299403934 298925991 298083324 297250099 296873150 296189899 295797348 295534115 294967461 293982868 293397999
3235.5 293397999 292977562 292239132 291430111 290851269 290500050 289936428 289356995 288796768 288626976 288241348
3245.1 288241348 287718487 287190075 286218853 285706959 285072308 284347630 283625603 283220692 283245029 282702942
3254.8 282702942 282330990 282085609 281604156 280815544 280327892 279957428 278949013 278066254 277480049
3263.4 277480049 277640820 277967224 277799511 277103119 276182575 275599384 275223980 275555935 275403728 274543247
3273.1 274543247 273944187 273501835 273105030 272531624 272477150 272380733 271658764 270793819 270279713 270081635
3282.7 270081635 269984932 270348015 270254097 269637012 269027100 268527069 268332481 268116531 267520103 266522980
3292.4 266522980 266157227 266225758 266034203 265761528 265277100 264662209 264448166 264490528 264128418 263651409
$$ packed form
3225.8B99403934m77943q42667q33225l76949o83251l92551k63233n66654r84593n84869
3235.5B93397999m20437p38430q09021n78842l51219n63622n79433n60227j69792l85628
3245.1B88241348n22861n28412r71222n11894o34651p24678p22027m04911K4337n42087
3254.8B82702942l71952k45381m81453p88612m87652l70464j008415q82759n86205
3263.4B77480049J60771L26404j67713o96392r20544n83191l75404L31955j52207q60481
3273.1B74543247n99060m42352l96805n73406n4474r6417p21969q64945n14106j98078
3282.7B70081635r6703L63083r3918o17085o09912n00031j94588k15950n96428r97123
3292.4B66522980l65753O8531j91555k72675m84428o14891k14043M2362l62110m77009
$$ plain form
3302 263651409 263087158 263061504 263268108 262488670 261697636 261321907 261184750 261016750 260497475 259813919
3311.7 259813919 259581070 259585896 259105968 258899632 258630447 258127441 257486992 256821556 256557255 256052780
3321.3 256052780 255734005 255430183 254887199 254480762 254128685 253745232 253491764 253689480 253367348 252782822
3330.9 252782822 252495480 252040195 251552658 251262264 250945187 250174713 249709377 249362774 249000854 248947639
3340.6 248947639 248638611 248301544 247940903 247469196 246719074 246105728 245914497 245702000 245575027 245281334
3350.2 245281334 245037746 244917774 244468708 243686638 243032894 242752514 242533588 242032032 241243629 240814514
3359.9 240814514 240732594 240873699 240984173 240823612 240582161 239911461 239216156 238793049 238089352 237107468
3369.5 237107468 236938858 237371044 237652016 237801094 237052841 236181164 235740585 235277557 234886818 235009098
$$ packed form
3302B63651409n64251k5654K06604p79438p91034l75729j37157j68000n19275o83556
3311.7B59813919k32849M826m79928k06336k69185n03006o40449o65436k64301n04475
3321.3B56052780l18775l03822n42984m06437l52077l83453k53468J97716l22132n84526
3330.9B52782822k87342m55285m87537k90394l17077p70474m65336l46603l61920n3215
3340.6B48947639l09028l37067l60641m71707p50122o13346j91231k12497j26973k93693
3350.2B45281334k43588j19972m49066p82070o53744k80380k18926n01556p88403m29115
3359.9B40814514q1920J41105J10474j60561k41451o70700o95305m23107p03697r81884
3369.5B37107468j68610M32186K80972J49078p48253q71677m40579m63028l90739J22280
$$ plain form
3379.2 235009098 235255928 234444771 234219856 234957199 235195541 234835129 234276733 233790703 233228245 233146362
3388.8 233146362 232788467 232454567 232769070 232575798 232251244 231960411 232092705 232132683 231352329 231020031
3398.4 231020031 231067085 231233006 231630554 231643391 231152115 230929108 231204033 231229343 230631218 230328751
3408.1 230328751 230401497 230147057 230242596 230648136 230916061 230882778 230418987 230038795 230420990 231036224
3417.7 231036224 231007423 230930595 230428600 230368214 231036892 230955868 230837326 230572910 230376949 230579815
3427.4 230579815 230891666 231160545 231279736 231460686 231001892 231108208 231858253 231898327 231982212 232220936
3437 232220936 232203217 232285118 232655792 233076134 233674355 233737869 233755493 234191380 234310074 234627151 234254799
3447.6 234254799 234177132 235020580 235655823 236350670 236989117 237153835 236892262 237157001 237492867 237806168
$$ packed form
3379.2B35009098K46830q11157k24915P37343K38342l60412n58396m86030n62458q1883
3388.8B33146362l57895l33900L14503j93272l24554k90833J32294L9978p80354l32298
3398.4B31020031M7054J65921L97548J2837m91276k23007K74925K5310n98125l02467
3408.1B30328751P2746k54440R5539M05540K67925l3283m63791l80192L82195O15234
3417.7B31036224k8801p6828n01995o0386O68678q1024j18542k64416j95961K02866
3427.4B30579815L11851K68879J19191J80950m58794J06316P50045M0074Q3885K38724
3437B32220936j7719Q1901L70674M20342N98221O3514J7624M35887J18694L17077l72352
3447.6B34254799p7667Q43448O35243O94847O38447J64718k61573K64739L35866L13301
$$ plain form
3457.3 237806168 238350735 238480587 238917522 239251842 239359589 239651680 240444660 241125984 241257858 241810322
3466.9 241810322 242163086 242693291 243347816 243491745 243555336 243968487 244912605 245489616 245891323 246384106
3476.6 246384106 246834583 247249146 247850666 248493538 248988972 249362240 249303589 250139122 250672035 251174030
3486.2 251174030 252657681 252889786 252901382 253529148 254564514 255395298 255602608 256106319 256520157
3494.9 256520157 257066364 257527771 258024349 258723049 259331875 260146656 261233158 262198524 262308331
3503.6 262308331 262309113 262688065 263553276 264457130 265658493 266700439 266352921 266650314 267457256 268696804
3513.2 268696804 270045929 270913506 271632233 271843834 272366333 272872219 273594761 274805470 276126003
3521.9 276126003 276891651 276619778 277549572 279203587 280510788 280942745 281135483 281503696 281962452
$$ packed form
3457.3B37806168N44567J29852M36935L34320J07747K92091P92980O81324J31874N52464
3466.9B41810322L52764N30205O54525J43929O3591M13151R44118N77011M01707M92783
3476.6B46384106M50477M14563O01520O42872M95434L73268n8651Q35533N32913N01995
3486.2B51174030J483651K32105J1596O27766J035366Q30784K07310N03711M13838
3494.9B56520157N46207M61407M96578O98700O08826Q14781J086502R65366J09807
3503.6B62308331P82L78952Q65211R03854J201363J041946l47518K97393Q06942J239548
3513.2B68696804J349125Q67577P18727K11601N22499N05886P22542J210709J320533
3521.9B76126003P65648k71873R29794J654015J307201M31957J92738L68213M58756
$$ plain form
3530.6 281962452 282873402 283901501 285382137 286097660 286831417 287119446 286821880 288604126 290262413
3539.2 290262413 291338749 291850529 292399483 293514214 293938751 294435158 296106339 298445492 298569450
3547.9 298569450 299115276 300782738 302372627 303656712 303068619 304330044 305990429 307525902 308869724
3556.6 308869724 309447060 311329021 312888203 314597511 315504150 317126827 318686466 319013996 322688408
3565.3 322688408 324674454 324288979 323395271 323542480 327677879 330317230 332069397 333699646 335117264
3574 335117264 336594887 337937813 339695015 341213875 343599281 344965439 346156654 348554611 351018867
3582.6 351018867 352785110 354053421 358015518 359976387 359293098 361054802 361325302 364753456 368444405
3591.3 368444405 371454430 373070374 374398422 377935867 377763405 380317879 384746094 386014175
$$ packed form
3530.6B81962452R10950J028099J480636P15523P33757K88029k97566J782246J658287
3539.2B90262413J076336N11780N48954J114731M24537M96407J671181K339153J23958
3547.9B98569450N45826J667462J589889J284085n88093J261425J660385J535473J343822
3556.6C08869724N77336J881961J559182J709308R06639J622677J559639L27530L674412
3565.3C22688408J986046l85475q93708J47209M135399K639351J752167J630249J417618
3574C35117264J477623J342926J757202J518860K385406J366158J191215K397957K464256
3582.6C51018867J766243J268311L962097J960869o83289J761704K70500L428154L690949
3591.3C68444405L010025J615944J328048L537445j72462K554474M428215J268081
$$ plain form
3599 386014175 387859612 388496513 390071144 393072662 395559502 398391113 402156563 405669746 405408478
3607.7 405408478 407494698 407790642 409213142 416203575 417209549 416525650 420928612 421283951 425969124
3616.4 425969124 431366692 431902847 433160667 432027779 433357124 437723083 440976410 443752632
3624.1 443752632 446721458 449097481 452201004 459242249 458814659 448278122 453836021 459616051
3631.8 459616051 464999733 466816559 466097565 468981361 472628021 475576134 476269226 477756310 480446548
3640.5 480446548 483552475 486074333 487209969 489614029 493006477 498373260 498875656 497383041
3648.2 497383041 502377968 500294075 497161446 499219017 505971298 510596428 514536285 518943825
3655.9 518943825 511808472 514564209 520496292 522606277 523843117 524439621 527322350 529034538
$$ packed form
3599C86014175J845437O36901J574631L001518K486840K831611L765450L513183k61268
3607.7D05408478K086220K95944J422500O990433J005974o83899M402962L55339M685173
3616.4D25969124N397568N36155J257820j132888J329345M365959L253327K776222
3624.1D43752632K968826K376023L103523P041245m27590j0536537N557899N780030
3631.8D59616051N383682J816826p18994K883796L646660K948113O93092J487084K690238
3640.5D80446548L105927K521858J135636K404060L392448N366783N02396j492615
3648.2D97383041M994927k083893l132629K057571O752281M625130L939857M407540
3655.9E18943825p135353K755737N932083K109985J236840N96504K882729J712188
$$ plain form
3663.6 529034538 531031761 533059425 534111481 538551331 541094475 540984650 540916595 536368713 540148430
3672.3 540148430 549187317 559671478 558899078 540318375 544336090 551971626 556397438 554960937
3680 554960937 556205864 559395027 561509094 563313370 564046059 565860214 570897408 576656837 567669754
3688.7 567669754 565000343 573863258 568968964 568862305 574146347 575515404 577914429 578325844 578346558
3697.4 578346558 580348778 582215652 585668983 587335854 581399040 580336227 585628395 587858582
3705.1 587858582 588773232 589917145 593090668 596954231 589478111 593944359 599088173 586254807
3712.8 586254807 590754700 595672188 596446915 597633514 601187439 603108673 599357986 600255737 606033630
3721.5 606033630 603682060 599998512 605582237 606763687 605705185 602984924 603593712 608783226
$$ packed form
3663.6E29034538J997223K027664J052056M439850K543144j09825o8055m547882L779717
3672.3E40148430R038887J0484161p72400j8580703M017715P635536M425812j436501
3680E54960937J244927L189163K114067J804276P32689J814155N037194N759429q987083
3688.7E67669754k669411Q862915m894294j06659N284042J369057K399025M11415K0714
3697.4E78346558K002220J866874L453331J666871n936814j062813N292168K230187
3705.1E87858582R14650J143913L173523L863563p476120M466248N143814j2833366
3712.8E86254807M499893M917488P74727J186599L553925J921234l750687Q97751N777893
3721.5F06033630k351570l683548N583725J181450j058502k720261O08788N189514
$$ plain form
3729.2 608783226 610746117 616078377 612651138 605911484 615396957 615284157 606388702 607894974
3736.9 607894974 611408615 611617317 613971481 618024826 614515877 618037720 629606895 616790123
3744.7 616790123 602941856 614411774 621815834 629403877 625715256 615446320 626174889 617805328
3752.4 617805328 612728767 619788208 624220200 627786331 623125839 626203270 631829262 622611732
3760.1 622611732 621279793 626861992 629192314 629607430 632746315 629733849 625573845 629788399
3767.8 629788399 635774727 636567230 626505013 627632599 631181908 632369576 633781242 633841782 634802780
3776.5 634802780 635396461 638459015 637498665 629890022 633577652 636618233 637876053 640070343 637724686
3785.2 637724686 637200203 638847237 639386292 639898415 640492172 641302261 642071304 642891006 642533493
$$ packed form
3729.2F08783226J962891N332260l427239o739654R485473j12800q895455J506272
3736.9F07894974L513641K08702K354164M053345l508949L521843J1569175j2816772
3744.7F16790123j3848267J1469918P404060P588043l688621j0268936J0728569q369561
3752.4F17805328n076561P059441M431992L566131m660492L077431N625992r217530
3760.1F22611732j331939N582199K330322M15116L138885l012466m160004M214554
3767.8F29788399N986328P92503j0062217J127586L549309J187668J411666O0540R60998
3776.5F34802780N93681L062554r60350p608643L687630L040581J257820K194290k345657
3785.2F37724686n24483J647034N39055N12123N93757Q10089P69043Q19702l57513
$$ plain form
3793.8 642533493 643777313 646903305 643490524 640356522 642982101 648129730 655049591 645749664
3801.5 645749664 634313126 640201645 644058456 649134674 654282227 643961411 640486832 645723648
3809.3 645723648 648011627 648687134 649435043 650240555 652752457 659235077 656684952 641704941 647453918
3817.9 647453918 653826065 659425964 659483337 638453560 643627472 650727615 652947235 655753555
3825.7 655753555 655558624 651028595 651400833 654139023 658249741 660040665 651896515 655215454 662841263
3834.3 662841263 657340622 657244186 664903030 654078751 650508194 660886917 655406647 653455353
3842.1 653455353 660157852 658321609 655640335 658983765 660321655 660506058 662481537 662059555 665223694
3850.7 665223694 671650467 665587616 665290680 646325531 649455109 661740112 661009827 660004044
$$ packed form
3793.8F42533493J243820L125992l412781l134002K625579N147629O919861r299927
3801.5F45749664j1436538N888519L856811N076218N147553j0320816l474579N236816
3809.3F45723648K287979O75507P47909Q05512K511902O482620k550125j4980011N748977
3817.9F47453918O372147N599899N7373k1029777N173912P100143K219620K806320
3825.7F55753555j94931m530029L72238K738190M110718J790924q144150L318939P625809
3834.3F62841263n500641r6436P658844j0824279l570557J0378723n480270j951294
3842.1F53455353O702499j836243k681274L343430J337890J84403J975479m21982L164139
3850.7F65223694O426773o062851k96936j8965149L129578J2285003p30285j005783
$$ plain form
3858.4 660004044 663415222 666005783 668817062 663798218 663430786 669098511 661988983 658053741
3866.2 658053741 663098145 668878326 675376282 665569992 656244659 661322708 668543243 671692276
3873.9 671692276 660054016 661657410 666433029 666919556 669398117 672594833 665627060 659859314
3881.6 659859314 667389984 669313965 670939255 675071716 661057739 663632278 669127731 669959564
3889.3 669959564 673759766 672361679 662919617 665007401 670204926 669605255 670515366 671986847 675200806
3898 675200806 676752167 666441422 671969757 674069138 668515778 672707138 667901382 666302109
3905.7 666302109 668035736 669540024 671615524 671098938 671726303 671977081 672121506 672374496 672059784
3914.4 672059784 674087601 676356277 672011948 668789978 673342743 673580017 670744476 673112564
$$ packed form
3858.4F60004044L411178K590561K811279n018844l67432N667725p109528l935242
3866.2F58053741N044404N780181O497956r806290r325333N078049P220535L149033
3873.9F71692276j1638260J603394M775619M86527K478561L196716o967773n767746
3881.6F59859314P530670J923981J625290M132461j4013977K574539N495453Q31833
3889.3F69959564L800202j398087r442062K087784N197525n99671R10111J471481L213959
3898F75200806J551361j0310745N528335K099381n553360M191360m805756j599273
3905.7F66302109J733627J504288K075500n16586O27365K50778J44425K52990l14712
3914.4F72059784K027817K268676m344329l221970M552765K37274k835541K368088
$$ plain form
3922.1 673112564 674277725 675203552 673561783 670603485 672308197 674241791 675613251 674746857 674433670
3930.8 674433670 676046524 673222122 672498703 674350510 674542007 675370865 675368652 674156113 674099350
3939.5 674099350 674375839 676089020 677005463 672707977 672680435 675046997 676406631 677595673 675415649
3948.1 675415649 676530457 676503677 673596573 676040649 676536255 675245590 675197296 675218811 675935669
3956.8 675935669 676246262 676544571 676264648 677341156 678022995 676235199 676368332 677392960 677236633
3965.5 677236633 676602783 676825409 677990189 678206253 677239304 677465286 678387375 678113327 677629776
3974.2 677629776 678010712 678727264 678325577 677968369 678004303 677945633 678268967 678623886 678999481 678670807
3983.8 678670807 678923950 678835144 677722473 677894211 678512039 679108276 678908539 678757706 679345322 679735107
$$ packed form
3922.1F73112564J165161R25827j641769k958298J704712J933594J371460q66394l13187
3930.8F74433670J612854k824402p23419J851807J91497Q28858k213j212539n6763
3939.5F74099350K76489J713181R16443m297486k7542K366562J359634J189042k180024
3948.1F75415649J114808k6780k907104K444076M95606j290665m8294K1515P16858
3956.8F75935669L10593K98309k79923J076508O81839j787796J33133J024628j56327
3965.5F77236633o33850K22626J164780K16064r66949K25982R22089k74048m83551
3974.2F77629776L80936P16552m01687l57208L5934n8670L23334L54919L75595l28674
3983.8F78670807K53143q8806j112671J71738O17828N96237j99737j50833N87616L89785
$$ plain form
3993.5 679735107 680208130 679952011 679697418 679643402 679653473 679772873 679686279
4000.2 679686279
$$ packed form
3993.5F79735107M73023k56119k54593n4016J0071J19400q6594
4000.2F79686279
##END=$$ End of the data block
