##TITLE=$$ Begin of the data block
##JCAMP-DX=5.00 $$ ACD/SpecManager v 10.08
##SPECTROMETER/DATA SYSTEM=Varian
##DATE=20 Nov 2012 09:53:08
##DATA TYPE=INFRARED SPECTRUM
##DATA CLASS=XYDATA
##ORIGIN=
##OWNER=
##NPOINTS=3735
##FIRSTX=399.26403809
##LASTX=4000.35498047
##MAXX=4000.35498047
##MINX=399.26403809
##MAXY=78.48924255
##MINY=17.18149567
##XFACTOR=1.0000000000
##YFACTOR=0.000000100000000
##FIRSTY=47.79092026
##DELTAX=0.96440572
##XUNITS=1/CM
##YUNITS=TRANSMITTANCE
##XYDATA=(X++(Y..Y))
399.3D77909203j0472985q990173l757210L148689M483986J11885k676086k770958
407D56986351j565437l91541j841163J884307O179085n052414l818626O360359N940895
415.7D64681816L79715q718567p446327J7855377N311432o514473o185303j186714
423.4D58176956k915420l639641J233101l86696o689835j561737O870957L805275p18003
432.1D54174957l625526o845856n523872M387626O113511k395058m280472l204307
439.8D38801003J009025K56310K714996N254745N139313M524574j520919N604629M873848
448.4D66657524m918823j541863J896363J908645Q53424J335106k075767o931458q80890
457.1D56302261L92495l278313J003456L129730J397972J602326P24106n433617l732185
$$ y = [477909203, 467436218, 458446045, 454688835, 457837524, 462321510, 462433395, 459757309, 456986351, 455420914, 455029373, 453188210, 455072517, 461251602, 456199188, 452380562, 458740921, 464681816, 465061531, 456342964, 448896637, 466752014, 472063446, 465548973, 459363670, 458176956, 455261536, 451621895, 452854996, 452468300, 445778465, 444216728, 451087685, 454892960, 454174957, 450549431, 443703575, 438179703, 442567329, 448680840, 446285782, 442005310, 438801003, 439810028, 440066338, 442781334, 448036079, 453175392, 457699966, 456179047, 461783676, 466657524, 461738701, 460196838, 462093201, 464001846, 464855270, 466190376, 464114609, 457183151, 456302261, 456694756, 453416443, 454419899, 457549629, 458947601, 460549927, 461274033, 455840416, 452108231]
465.8D52108231K019615j584854n182076k883224j079560l744926p515602J289100
473.5D33426704M151497K67945l686409k423096J678657j025848K82211j424141m490509
482.2D26757011M789467P251091j464920n145683M27551K93541l782005l35083j890831
490.9D26900139N61867K154617j880074j489868P00760R58977k338905j161843o56280
499.6D23749390Q79058m19158m776192J3885j258583k559242j506767j123810j603279
508.2D11395302p22466O06575j999397j565590j469765j360054m214325l665618j7472
516.9C96987190l515548l188820j428185K62566l414459k242585J454430j224327j467476
525.6C82222786k223930J824989l63388r84268Q83979k019538J462936R36394o9924
$$ y = [452108231, 454127846, 452542992, 447360916, 444477692, 443398132, 439653206, 432137604, 433426704, 437578201, 437846146, 434159737, 431736641, 433415298, 432389450, 432671661, 431247520, 426757011, 431546478, 438797569, 437332649, 432186966, 432614517, 432908058, 429126053, 428790970, 426900139, 427462006, 429616623, 427736549, 426246681, 426947441, 427906418, 425567513, 424405670, 423749390, 424628448, 424209290, 419433098, 419446983, 418188400, 415629158, 414122391, 412998581, 411395302, 410672836, 411279411, 409280014, 407714424, 406244659, 404884605, 400670280, 397004662, 396987190, 393471642, 390282822, 388854637, 389117203, 385702744, 383460159, 384914589, 383690262, 382222786, 379998856, 381823845, 381460457, 380476189, 381360168, 379340630, 380803566, 381739960, 381670036]
534.3C81670036N71213J825409K495880K617874M627953J487694J858825K714043J587448
543D01456375J675949J313515J717186L99704Q5220l395k3231j137696m87938N97496
552.6D05593185j540184j556816k570038j143837m81567j759758j54762o45371j806335
561.3C93934517l040695j646767j554756l291092m350853n515289l123780k508163
569C68903122k146225k493782j480942j805229l165474n72472J727906K049408j532364
577.7C59483948M70390K110672L304901N043564K467690K990799L139724L860092L284417
586.4C86156197L678970L942032K722130J376533j99318K215615L29742r86366M19159
595C99654694N50842L60489J0757Q06885j345215m97017P70989j38855P2136n88341
$$ y = [381670036, 382241249, 384066658, 386562538, 389180412, 393808365, 395296059, 397154884, 399868927, 401456375, 403132324, 404445839, 406163025, 406562729, 406647949, 406644554, 406621323, 405483627, 404995689, 405593185, 404053001, 402496185, 399926147, 398782310, 398300743, 396540985, 396386223, 395740852, 393934517, 390893822, 389247055, 387692299, 384401207, 380050354, 374535065, 371411285, 368903122, 366756897, 364263115, 362782173, 360976944, 357811470, 357238998, 358966904, 361016312, 359483948, 359954338, 362065010, 365369911, 370413475, 372881165, 375871964, 379011688, 382871780, 386156197, 389835167, 393777199, 396499329, 397875862, 397676544, 399892159, 400221901, 399235535, 399654694, 400205536, 400566025, 400576782, 401383667, 400038452, 399541435, 400312424, 400173569, 400245705, 399657364]
604.7C99657364M75693m03672q51860O27823J975937J238899Q7471J039086R24453
613.4D04771194J395340p5950l75023N29327J294976J834297Q34427K691536K164039
622D15064163J992684K335395J973649J727714R87854K953491J789971J413192J064530
630.7D31302643m04587P85484K99187Q30879J520729J757813J271133Q19512J715965
639.4D39898758N72662n33485L37295J207657M40979P09305O81610N39742J851539
648.1D45706062J415406J173935O01997N00526O99578p5302l0213M86832N95360k08893
657.7D50865288J021194J956597J242675O24314o62842k00195L52859M75922J029930
666.4D56705742j052551k881737N595474K354317Q72421R93500O35300J330032O37932
$$ y = [399657364, 400133057, 399729385, 398877525, 399505348, 401481285, 402720184, 402807655, 403846741, 404771194, 406166534, 406090584, 405715561, 406244888, 407539864, 409374161, 410208588, 412900124, 415064163, 417056847, 419392242, 421365891, 423093605, 424081459, 427034950, 428824921, 430238113, 431302643, 430898056, 431683540, 431982727, 432813606, 434334335, 436092148, 437363281, 438182793, 439898758, 440471420, 439937935, 440275230, 441482887, 441923866, 442633171, 443314781, 443854523, 445706062, 447121468, 448295403, 448897400, 449397926, 450097504, 450022202, 449991989, 450478821, 451074181, 450865288, 451886482, 453843079, 455085754, 455710068, 455047226, 454847031, 455199890, 455675812, 456705742, 455653191, 452771454, 458366928, 460721245, 461593666, 462587166, 463222466, 464552498, 465190430]
675.1D65190430l75557M61464J302528J295433j21307m10652K0294J079330Q57659
683.8D69299622K79617K198410J248703q3695N57213R4376k34223n77697j048546l94516
693.4D71339264p1030r23271K56920P81059k204399k899322p35093n83343j527252
702.1D63433533j504746j967277j557236o88744p31887l78380K72293R08050O48232
710.8D58433838J496467J626053N7335L93868J664962K292176K513847L562508L669090
719.5D75710144L521614K443924J619034L554764L619499K908172K828904K696991
727.2D98903046K847023K976455K286988J492920K602539K619209K433815K083664
734.9E18245659O02875P43141J178627J042099J113853J207581J154747J404953J43204
$$ y = [465190430, 464814873, 465276337, 466578865, 467874298, 467752991, 467342339, 467362633, 468441963, 469299622, 469579239, 471777649, 473026352, 472942657, 473499870, 473594246, 473360023, 472782326, 471733780, 471339264, 471268234, 470344963, 470601883, 471382942, 469178543, 466279221, 465544128, 464960785, 463433533, 461928787, 459961510, 458404274, 457715530, 456983643, 456605263, 456877556, 457785606, 458433838, 459930305, 461556358, 461613693, 462007561, 463672523, 465964699, 468478546, 472041054, 475710144, 479231758, 481675682, 483294716, 486849480, 490468979, 493377151, 496206055, 498903046, 501750069, 504726524, 507013512, 508506432, 511108971, 513728180, 516161995, 518245659, 518848534, 519591675, 520770302, 521812401, 522926254, 524133835, 525288582, 526693535, 526836739]
743.6E26836739j703988l65562P92961j34163j065788j740341k170372l301087l479232
752.2E13669167j723290p77626j606255k583045k551575k125168j445274k194252k190438
760.9D96472244j045227k060776k007484q50296n7564M46854P29446P02019P39899
769.6D93069115K579269L284836L169479M095307M066353L951988M488945N202102
777.3E23907394M303780L523254N004425M426079M043656L920898L478928L962745
785E56571159K561264K193947K679863K757607K316856J986809J710663K317047K869530
793.7E77964745J188240K222099J546669R24339K965965K377930K169380K472573K903671
802.4E96735611J420097N31426J094818N76248R35364J062012O06536q27140r70726
$$ y = [526836739, 525132751, 524767189, 525560150, 525425987, 524360199, 522619858, 520449486, 517148399, 513669167, 511945877, 511168251, 509561996, 506978951, 504427376, 502302208, 500856934, 498662682, 496472244, 495427017, 493366241, 491358757, 490508461, 490450897, 490897751, 491627197, 492329216, 493069115, 495648384, 498933220, 502102699, 506198006, 510264359, 514216347, 518705292, 523907394, 528211174, 531734428, 536738853, 541164932, 545208588, 549129486, 552608414, 556571159, 559132423, 561326370, 564006233, 566763840, 569080696, 571067505, 572778168, 575095215, 577964745, 579152985, 581375084, 582921753, 583846092, 586812057, 589189987, 591359367, 593831940, 596735611, 598155708, 598687134, 599781952, 600358200, 601293564, 602355576, 602962112, 602134972, 601164246]
811.1F01164246j029053k34985R29260r3308l63083l15361P29714K48222o26793q40339
820.7E99568520q48198M9400j456451j991425j492691j188316j560097k250977k555961
829.4E86273804k098275j053237l243027l562317j880951j719933k332458k362518
837.1E68021088j225434j773033j779289k069664l053398l235359k412568p49588r04846
845.8E50817909j930160k900963k401962j425591j379127j817780k671661k896881
853.5E33393784l109322k986069l319282l377953l141174k890320k012672p83959J598549
862.2E13371582K720985L279381M623795N107956N414505M695244N135955O081429
869.9E50430832O679001P696495O658630N551033M793625M096603L179169K952919
$$ y = [601164246, 600135193, 599900208, 600829468, 600736160, 600373077, 600057716, 600787430, 601035652, 600408859, 599568520, 598720322, 598769722, 597313271, 595321846, 593829155, 592640839, 591080742, 588829765, 586273804, 584175529, 583122292, 579879265, 576316948, 574435997, 572716064, 570383606, 568021088, 566795654, 565022621, 563243332, 561173668, 558120270, 554884911, 552472343, 551722755, 550817909, 548887749, 545986786, 543584824, 542159233, 540780106, 538962326, 536290665, 533393784, 530284462, 527298393, 523979111, 520601158, 517459984, 514569664, 512556992, 511773033, 513371582, 516092567, 519371948, 523995743, 529103699, 534518204, 539213448, 544349403, 550430832, 557109833, 564806328, 571464958, 577015991, 581809616, 585906219, 589085388, 592038307]
877.6E92038307J920281J418457Q28705j435814q46711j019058k018318l102798k673989
886.3E85109062k603416m103775l056679l366013l746070l834343l488427l360366
894E57549973l745537k419091k901878l507576l583565l631820l300019l012237k866173
902.7E28582077l331299l113098l900909m470520m312249n175552n295029m789123
910.4D94194298n061112n778770n626412n122604n818443o099854n502891n706787
918.1D49477425n082093l984375l372879l227005k733078j670074j129418n08194N23797
926.8D28294106R49287j94092j1215O26335J426239K137070J204147J535835J788559
935.5D37756271J796914J878395K482605L196640K350044K295456K584915K671585
$$ y = [592038307, 593958588, 595377045, 596205750, 594769936, 593923225, 592904167, 590885849, 587783051, 585109062, 582505646, 578401871, 575345192, 571979179, 568233109, 564398766, 560910339, 557549973, 553804436, 551385345, 548483467, 544975891, 541392326, 537760506, 534460487, 531448250, 528582077, 525250778, 522137680, 518236771, 513766251, 509454002, 504278450, 498983421, 494194298, 489133186, 483354416, 477728004, 472605400, 466786957, 460687103, 455184212, 449477425, 444395332, 440410957, 437038078, 433811073, 431077995, 429407921, 428278503, 427770309, 428294106, 429243393, 429049301, 429038086, 429664421, 431090660, 433227730, 434431877, 435967712, 437756271, 439553185, 441431580, 443914185, 447110825, 449460869, 451756325, 454341240, 457012825]
943.2D57012825K881928K234764O32133j34735q91686k707633l393326l578072m139519
951.9D47916679n170974o182557o455726o871681o522370p263107p948799p880402
959.6C93621063q580704q226737p824250p440834q999405r023132q207779r306717
967.3C26011505r250755r663391q928337q803292r012279r598370q922901q639660
975B53192520r492321p726192q500748p154427o934890o135273m722023n181160l513279
983.7A93832207n403366l741722l227368k634201j364860j756669j12609j519680Q335
992.4A74080067r93290r29127J4858l57551J007118j5373J331787Q1997N70984J39885
1002A74931355j73188J214428l74374P27768l60165Q35037j05037j119957j99910n64651
$$ y = [457012825, 459894753, 462129517, 462761650, 462626915, 461735229, 459027596, 455634270, 452056198, 447916679, 442745705, 436563148, 430107422, 423235741, 416713371, 409450264, 401501465, 393621063, 385040359, 376813622, 368989372, 361548538, 352549133, 343526001, 335318222, 326011505, 316760750, 307097359, 298169022, 289365730, 280353451, 270755081, 261832180, 253192520, 243700199, 235974007, 227473259, 220318832, 213383942, 207248669, 202526646, 197345486, 193832207, 188428841, 184687119, 181459751, 178825550, 177460690, 175704021, 175591412, 174071732, 174080067, 173086777, 172157650, 172172508, 171814957, 172822075, 172806702, 174138489, 174220486, 174791470, 174931355, 174758167, 175972595, 175598221, 176325989, 175965824, 176800861, 176695824, 175575867, 175375957, 174811306]
1011.7A74811306M02775j382752N79720l75805j22509N11227L04374K467175o23055
1020.3A76572456Q68779N56831P73697J575050J046715K440300P32918J831131J206283
1029A87604160J974182J541501J418857J958523L11661K194919P76692P09457p75661
1037.7A97714291n01290J42594o22712J041985j095886P38964k06928O2522P87449
1046.4A98060989m46300L03745j171188J817188Q33092J249847K457600K561836K891216
1055.1B08558025J633606M335537K892285L563690L078499L290863L890266K904244
1062.8B34147015N337123K930356L882885L873214L138199J883774j066551j458569
1070.5B52667446m457035m296894n156517m558506l847237l591537j539002j332683
$$ y = [174811306, 175214081, 173831329, 174411049, 174035244, 173912735, 174423962, 174728336, 177195511, 176572456, 177441235, 177998066, 178771763, 180346813, 181393528, 183833828, 184566746, 186397877, 187604160, 189578342, 191119843, 192538700, 194497223, 194808884, 197003803, 197780495, 198489952, 197714291, 197213001, 197355595, 196732883, 197774868, 196678982, 197417946, 197211018, 197273540, 198060989, 197614689, 197918434, 196747246, 198564434, 199397526, 200647373, 203104973, 205666809, 208558025, 210191631, 214527168, 217419453, 220983143, 224061642, 227352505, 231242771, 234147015, 239484138, 242414494, 246297379, 250170593, 253308792, 255192566, 254126015, 252667446, 248210411, 243913517, 238757000, 234198494, 230351257, 226759720, 225220718, 223888035]
1078.2B23888035N95188q50678Q07648P77359J308212K717476J553727L161582J918316
1086.9B35876865L555069L099194L297481L190194K486629L388100K279720M673176
1094.6B61846428J940002J875477J920891O0520J080380Q8367J533508l01609J98880
1103.3B70242844N01232l35808J06831n3082J686916R03397K499619J147365J643562
1112B78342876L101616K100449K626476J161003K849942J110687P94144J267910P86190
1120.6B94141293J450748q0872J824265M30489P87563J122665J064663K341385J242218
1129.3C04324417K688141J249962K342262K350960O74858K10247m28867R38549q70152
1138C13480377o18572j837540k582760k780532l512669k012730l943748k591210k679119
$$ y = [223888035, 224483223, 223632545, 224440193, 225217552, 226525764, 229243240, 230796967, 233958549, 235876865, 239431934, 242531128, 245828609, 249018803, 251505432, 254893532, 257173252, 261846428, 263786430, 265661907, 267582798, 267643318, 268723698, 268812065, 270345573, 270043964, 270242844, 270744076, 270408268, 270515099, 270462017, 272148933, 273052330, 275551949, 276699314, 278342876, 281444492, 283544941, 286171417, 287332420, 290182362, 291293049, 292087193, 293355103, 294141293, 295592041, 295511169, 297335434, 297765923, 298553486, 299676151, 300740814, 303082199, 304324417, 307012558, 308262520, 310604782, 312955742, 313630600, 313840847, 313411980, 314350529, 313480377, 312861805, 311024265, 308441505, 305660973, 302148304, 300135574, 296191826, 293600616, 290921497]
1146.7B90921497k898922k822208k935524j354485k536335q81195j495323j021614
1154.4B74975891r90238q38013P51152p5512J463852N33715J473083J607895J853733
1163.1B80755558K782803L106823M814777L818359N366879N028477N552539N919800
1170.8C17146015O023464P337685O221390P213402O519470P391319O832275N976334
1178.5C70661354P053146O145668O783791O536598O781349N756493N180931N681610
1186.2D20580940M387703M303475M306030M006271L100395L026810K671051J630860
1193.9D48013535J264114P85904J585426J114769N34363J281700J004486O61278N83191
1202.6D56828766M84123O03676J226540J019439J133919J750793J482392J679725K175065
$$ y = [290921497, 288022575, 285200367, 282264843, 280910358, 278374023, 277492828, 275997505, 274975891, 273985653, 273147640, 273898792, 273823280, 275287132, 275820847, 277293930, 278901825, 280755558, 283538361, 286645184, 291459961, 295278320, 300645199, 305673676, 311226215, 317146015, 323169479, 330507164, 336728554, 343941956, 350461426, 357852745, 364685020, 370661354, 377714500, 383860168, 390643959, 397180557, 403961906, 409718399, 414899330, 420580940, 424968643, 429272118, 433578148, 437584419, 440684814, 443711624, 446382675, 448013535, 449277649, 450063553, 451648979, 452763748, 453298111, 454579811, 455584297, 456245575, 456828766, 457312889, 457916565, 459143105, 460162544, 461296463, 463047256, 464529648, 466209373, 468384438]
1211.3D68384438K529029K441864K428666K501945K410202K286072K218323K046890
1219D87247429J526222J202889J447639J070252j77880k08130j31340n94406o33049
1227.7D90749626q78029j097068q59490p83806r27849q93898r30519r99984j062279
1236.4D82316704j059189q23288o97174o46324p92351p66029k19651j76925O7558N75638
1246D77778969O24466Q55446R68322P02973O74591Q07762O39801J253471J133118K99835
1255.7D85738754N89562O80847O71387L54347o4621L39393N49698L28446Q03909J328468
1265.3D91320190P99332P29103J265221J337890R66988J162605J011162O23055J203880
1274E00419426R72977M35638K36702L88832R7122k09922j90506m46511k52723m19922
$$ y = [468384438, 470913467, 473355331, 475783997, 478285942, 480696144, 482982216, 485200539, 487247429, 488773651, 489976540, 491424179, 492494431, 492316551, 492108421, 491977081, 491382675, 490749626, 489871597, 488774529, 487915039, 487131233, 486203384, 485309486, 484378967, 483378983, 482316704, 481257515, 480434227, 479737053, 479090729, 478298378, 477532349, 477312698, 477135773, 477203331, 477778969, 478403435, 479258881, 480227203, 480930176, 481604767, 482412529, 483052330, 484305801, 485438919, 485738754, 486328316, 487009163, 487680550, 488034897, 487970276, 488309669, 488859367, 489187813, 489991722, 491320190, 492119522, 492848625, 494113846, 495451736, 496418724, 497581329, 498592491, 499215546, 500419426, 501392403, 501828041, 502064743, 502453575, 502550697, 502340775, 502150269, 501703758, 501451035, 501031113]
1283.6E01031113J5297j35308n18074J70021J32714J6975k29492l59726o39343r81942
1293.3D98502235j272506j211167j049423j258926o21033j050453j525192j353188
1301D89160347j205292j409874k232246r70078k01759j061897j621475j771164j046524
1309.7D77640038r47648j099968q72612n44548p00798j176529j206932j080741p25594
1318.3D69284668j089554j087761r97314j039810o28777j336441j698341k047577k301712
1327D57057381k403488l221360k738609k601013k658806k529335k783127k043610j537284
1335.7D34540749q81043j224365p42912n40924q43583K14081m12292K92778M06608
1344.4D30809097L82843O15807N74837O18553P667M29955j09978k31895n92270m16374
$$ y = [501031113, 501046410, 500911102, 500393028, 500563049, 500695763, 500712738, 500483246, 500123520, 499484177, 498502235, 497229729, 496018562, 494969139, 493710213, 493089180, 492038727, 490513535, 489160347, 487955055, 486545181, 484312935, 483342857, 483141098, 482079201, 480457726, 478686562, 477640038, 476692390, 475592422, 474719810, 474175262, 473474464, 472297935, 471091003, 470010262, 469284668, 468195114, 467107353, 466110039, 465070229, 464441452, 463105011, 461406670, 459359093, 457057381, 454653893, 451432533, 448693924, 446092911, 443434105, 440904770, 438121643, 436078033, 434540749, 433659706, 432435341, 431692429, 431151505, 430307922, 430522003, 430109711, 430402489, 430809097, 431191940, 431807747, 432382584, 433001137, 433008804, 433438759, 433328781, 433096886, 432504616, 432088242]
1354D32088242K95372n37033n17846o71081j67847l72391n21354l83911m70276k24915
1363.7D28516960o88591J72234l55263L23830O3552q48503M54636j42784P02095N49774
1373.3D28747940N29480N84259Q42400J389236L42598O72455K04964J273040R05228
1382D35491600P16515J694069J062660J999016J423721K074165K152825K059173J773033
1390.7D50446777J323357J726456Q84857J01967j768647N11971L32146m01841j199073
1399.3D51957970j538048M50859q88062n44471o07071j845856j164207j044350o74133
1408D44102631j534577j009254j351013j174164q64868j365281m38461n89332N7373
1416.7D35833054n32723K50664k110939j140633J587296p859K84234j621590K25754
$$ y = [432088242, 432383614, 431846581, 431328735, 430657654, 430489807, 430117416, 429596062, 429212151, 428741875, 428516960, 427828369, 428000603, 427645340, 427969170, 428032722, 427184219, 427638855, 427496071, 428198166, 428747940, 429277420, 429861679, 430704079, 432093315, 432435913, 433108368, 433313332, 434586372, 435491600, 436208115, 437902184, 438964844, 440963860, 442387581, 444461746, 446614571, 448673744, 450446777, 451770134, 453496590, 454381447, 454483414, 452714767, 453226738, 453558884, 453157043, 451957970, 450419922, 450870781, 449982719, 449438248, 448831177, 446985321, 445821114, 444776764, 444102631, 442568054, 441558800, 440207787, 439033623, 438168755, 436803474, 436365013, 435775681, 435833054, 435300331, 435550995, 433440056, 432299423, 433886719, 433878860, 434163094, 432541504, 432767258]
1425.4D32767258J072807M15268J438446L5591Q32672M89693J344185R33876M58374
1434.1D39788170J687012N88569L14636k84538K039070J245232J032410J015472J18637
1442.7D47544670J637802L37944P20711O7940j76087q66012l51448R51080o90498p3204
1452.4D49102898j463547J81656%j116448R0866l990440J793327j457901J533089M73785
1462D45147285Q30193K400742J70326L431129J098862L643341K806282L637352M588127
1470.7D67753639L236313O901627K500038P100410L414192N257760N221557L826523
1478.4E05212059N168800L332482N237388K746010M090653L605499L243446M021683
1486.1E36658020J395035N182915K873878M775200J380653K344246L876801J976509
$$ y = [432767258, 433840065, 434255333, 435693779, 435729370, 436562042, 437051735, 438395920, 439329796, 439788170, 441475182, 442063751, 442378387, 442093849, 444132919, 445378151, 446410561, 447426033, 447544670, 449182472, 449520416, 450241127, 450309067, 450132980, 449266968, 448915520, 449866600, 449176102, 449102898, 447639351, 447821007, 447821007, 446704559, 446795425, 442804985, 444598312, 443140411, 444673500, 445147285, 445977478, 448378220, 448548546, 451979675, 453078537, 456721878, 459528160, 463165512, 467753639, 470989952, 477891579, 480391617, 487492027, 490906219, 496163979, 501385536, 505212059, 510380859, 513713341, 518950729, 521696739, 525787392, 529392891, 532636337, 536658020, 538053055, 543235970, 546109848, 550885048, 552265701, 554609947, 558486748, 560463257]
1493.8E60463257L687744J500130J460533J952934K052422J925583K125816L117714
1501.6E78286133J538734L063164J959152L483620k99873m945412N614204M35372L140068
1510.2E92275162J493339J702729P629J909180K275543r5139J984902k000771M076042
1518.9F03628616K795105M83666L49617k384835L860894J905975J169129j41755J322441
1527.6F12988853O40297L6965J838035R96399K332535j591530j714973K413444J632805
1536.3F19572830K016449J163445L72848p948074O134834K035179k39143K159080j824722
1545F23442726l48434J035194J223717R73015j28670r42383M40903J108932J78109
1553.6F26983109n93949k66151L089142M059410m186287m074707m372635L675079J396866
$$ y = [560463257, 564151001, 565651131, 567111664, 569064598, 571117020, 573042603, 575168419, 578286133, 579824867, 582888031, 584847183, 588330803, 588030930, 583085518, 588699722, 589135094, 592275162, 593768501, 595471230, 595478859, 597388039, 599663582, 599568443, 601553345, 599552574, 603628616, 606423721, 606907387, 607257004, 604872169, 608733063, 610639038, 611808167, 611666412, 612988853, 613629150, 613666115, 615504150, 616500549, 618833084, 617241554, 615526581, 617940025, 619572830, 621589279, 622752724, 623125572, 615177498, 621312332, 623347511, 623108368, 625267448, 623442726, 623094292, 624129486, 625353203, 626326218, 626197548, 625255165, 625696068, 626805000, 626983109, 626389160, 626123009, 629212151, 633271561, 629085274, 625010567, 620637932, 624313011, 625709877]
1562.3F25709877O99272M64325j360092n80521R9564J050186K99149l617325k28195
1571F22536240N40619k59133l97949Q87146L2272n958786M04625J223946k21291q60252
1580.6F17927437p04384m39339o72264q68110j165123j334343j174393j140022q83675
1589.3F09545784o80428o15577j307259j100349j400681j749801j163826j717415j321678
1598E98488770j762658j631660j663704j564789j105537j891632j211434j694526j886063
1606.7E84076767k330475j734810k083015l294106j858139k256965j432267j715736
1614.4E67371254n01518j059494p809449k85415p98836j131592j950798o54182k147179
1623.1E51032791m853859j67351q15467j80588k539520j989098r67484j001396p33795
$$ y = [625709877, 626409149, 626873474, 625513382, 624932861, 625032425, 626082611, 626381760, 622764435, 622536240, 623076859, 622817726, 622419777, 623306923, 623339195, 617380409, 617785034, 619008980, 618787689, 617927437, 617223053, 616783714, 616111450, 615243340, 614078217, 612743874, 611569481, 610429459, 609545784, 608865356, 608249779, 606942520, 605842171, 604441490, 602691689, 601527863, 599810448, 598488770, 596726112, 595094452, 593430748, 591865959, 590760422, 588868790, 587657356, 585962830, 584076767, 581746292, 580011482, 577928467, 574634361, 572776222, 570519257, 569086990, 567371254, 566869736, 565810242, 558000793, 557715378, 556916542, 555784950, 553834152, 553179970, 551032791, 546178932, 546011581, 545196114, 545015526, 542476006, 540486908, 539519424, 538518028, 537784233]
1631.7E37784233j590958L72467M90952k017555l448792K24686k83470l70331N70793
1640.4E31732025j68419J083794j30272J167526J424980j425132M05464J4458J915740
1649.1E36020164J359940L082008K830010j295815k589721K313690L306045J669503
1656.8E46695824K291908J526375J990623K247467K138558K261848k1629K315445K037353
1665.5E63483772K437134L039017L057785J443710J398277L350029J859856L395844
1673.2E83465424L479957J963272J106644K993927L337631L273850L794746J860275
1680.9F05275726L322869M340744J442566j834031N716286N172806L245048K303696
1688.6F28985710K984162K900695K645874K937050K618256L326950L763275p706K943192
$$ y = [537784233, 536193275, 536565742, 537056694, 535039139, 531590347, 531815033, 531531563, 531161232, 531732025, 531563606, 532647400, 532517128, 533684654, 535109634, 533684502, 534089966, 534104424, 536020164, 537380104, 540462112, 543292122, 541996307, 539406586, 541720276, 545026321, 546695824, 548987732, 550514107, 552504730, 554752197, 556890755, 559152603, 559130974, 561446419, 563483772, 565920906, 568959923, 572017708, 573461418, 574859695, 578209724, 580069580, 583465424, 586945381, 588908653, 590015297, 593009224, 596346855, 599620705, 603415451, 605275726, 608598595, 612939339, 614381905, 612547874, 618264160, 623436966, 626682014, 628985710, 631969872, 634870567, 637516441, 640453491, 643071747, 646398697, 650161972, 650154266, 653097458]
1697.3F53097458L384552M374161k76413m260788N151367L791199K529831N94635J686401
1706F70072403Q49075J419754J812744R36661P95746R77402J522598J671524O83212
1714.7F80741119o5155L051300J295395n226593K357407J880188J254806R41239M07028
1723.4F86636734m35257N84030J113892M96826J121445R14840J00174K85111K348251
1732F93166046K841644j531219l530045J696930K232666J032791J697846l95813j661987
1740.7F95548859L053207K135773K40478M39225K265319J407318N70984J615143M09317
1749.4G07685623K543183k976k28577K790909J788635K221756K108689M29306Q85391
1758.1G20221939J716004J815795K381058l94821m41895J984864J075821J307449J444550
$$ y = [653097458, 656482010, 660856171, 660579758, 656318970, 661470337, 665261536, 667791367, 668386002, 670072403, 670921478, 672341232, 674153976, 675090637, 675886383, 676863785, 678386383, 680057907, 680741119, 680675964, 683727264, 685022659, 679796066, 682153473, 684033661, 685288467, 686229706, 686636734, 686201477, 686785507, 687899399, 688396225, 689517670, 690432510, 690532684, 690817795, 693166046, 696007690, 694476471, 690946426, 692643356, 694876022, 695908813, 697606659, 697210846, 695548859, 698602066, 700737839, 700978317, 701417542, 703682861, 705090179, 705661163, 707276306, 707685623, 710228806, 710225830, 709997253, 712788162, 714576797, 716798553, 718907242, 719336548, 720221939, 721937943, 723753738, 726134796, 725739975, 725298080, 727282944, 728358765, 729666214, 731110764]
1766.8G31110764J242904j027145J450958L011322O1646j914902j292801L376312J748429
1775.4G37767487p47223J349487N61371P66830k61078j26800J271591J081085N94559
1784.1G42257309o11877N87158J070633R18350K84653Q53500O91528l38058j247101
1792.8G44466095o4163K685852O77948m53034Q80509J186371Q5449r19113J329803
1801.5G49875717k64969M32129J132889L72620O35070J02234K57187M05884N45349
1810.2G53494110j311035L38745J500397J83029L03879k68936N70144M9591M41742
1818.8G55301666P19834J1215J015396Q8119N38025K03476j882705L30276J989594
1827.5G58314896J705551n09644k300644M71115J627427J7471N9128L90777J88065
$$ y = [731110764, 732353668, 731326523, 732777481, 735788803, 735850449, 733935547, 732642746, 736019058, 737767487, 737020264, 738369751, 738931122, 739697952, 739436874, 739310074, 740581665, 741662750, 742257309, 741645432, 742232590, 743303223, 744221573, 744506226, 745359726, 746051254, 745713196, 744466095, 744401932, 747087784, 747765732, 747312698, 748193207, 749379578, 749465027, 748545914, 749875717, 749610748, 750042877, 751175766, 751548386, 752183456, 752285690, 752542877, 752948761, 753494110, 752183075, 752521820, 754022217, 754205246, 754509125, 754240189, 754810333, 754859924, 755301666, 756021500, 756032715, 757048111, 757136230, 757674255, 757877731, 755995026, 756325302, 758314896, 760020447, 759510803, 757210159, 757681274, 759308701, 759326172, 759385300, 759776077, 759964142]
1836.2G59964142J06811o58493O77567Q8806L20511P88345J381302R09805m221191
1844.9G59357605J021042J524353l7766n18417M6692M80652k823O80237j11161K12632
1854.5G62653046j8311j72195K76718l32337k6168k26822N79223p0572K24610L55453
1864.2G63242645o7672Q67157k79770P63092o96793j440659O86722M17023M46320j46866
1873.8G63791199N16815J00861j04218J75705M43115M49066l33938L4179m67300P19223
1883.4G65324707N90134l20740J79520J46103J188354n798j170960O4469N21316J65558
1893.1G66682663M99496M80423j055984L90701N62821P5149j69220J1444M64707k90299
1902.7G67651901M69361M4021k31323j12686k45819J97601K95563J37634m29916O91909
$$ y = [759964142, 760070953, 759412460, 760090027, 760178833, 760499344, 761287689, 762668991, 763578796, 759357605, 760378647, 761903000, 761865234, 761346817, 761393509, 761874161, 761871338, 762551575, 762440414, 762653046, 762634735, 762462540, 762739258, 762406921, 762380753, 762153931, 762733154, 762662582, 762887192, 763242645, 763174973, 764042130, 763762360, 764525452, 763828659, 762388000, 763074722, 763491745, 763938065, 763791199, 764308014, 764408875, 764304657, 764480362, 764923477, 765372543, 765038605, 765072784, 764605484, 765324707, 765914841, 765594101, 765773621, 765919724, 767108078, 767102280, 765931320, 765995789, 766517105, 766682663, 767182159, 767662582, 766606598, 766997299, 767560120, 767635269, 767466049, 767477493, 767942200, 767651901, 768121262, 768165283, 767933960, 767821274, 767575455, 767773056, 768068619, 768206253, 767776337, 768468246]
1912.4G68468246K89689j66016k46048r4376Q74329j249237l08762Q29087L66668K33460
1922G68997040p10755m25033L13034N50308P7667O23932j8692m62570J36261j10474
1931.7G68970718K9755o95648L72238N69916l0518O8817m32586K06527P0038N29480
1941.3G69658737k88009j212769L90778M50363M00924J18866M15039l7384m43649k01568
1951G69251328o409J00479j93787J73951J16806L66439K72141L59955M51507j33285
1960.6G70759125k32315l89176J44730j50452O1951K68249l18603N1803L83759Q96301
1970.2G71475372R1706j18714n5237j0833n8594p75833n0430n9662J85394K68555M48379
1980.8G71340103O52161q0033P7973l10211J21154N9739j96000l14941p57141M16260
$$ y = [768468246, 768757935, 768591919, 768345871, 768251495, 769125824, 767876587, 767567825, 768396912, 768763580, 768997040, 768286285, 767861252, 768174286, 768724594, 768802261, 769426193, 769407501, 768944931, 769081192, 768970718, 769000473, 768304825, 768677063, 769246979, 769216461, 769285278, 768852692, 769059219, 769129257, 769658737, 769370728, 768157959, 768548737, 768999100, 769400024, 769518890, 769933929, 769896545, 769452896, 769251328, 769244919, 769345398, 769151611, 769325562, 769442368, 769808807, 770080948, 770440903, 770892410, 770759125, 770526810, 770137634, 770282364, 770131912, 770193863, 770462112, 770143509, 770195312, 770579071, 771475372, 771567078, 771448364, 771393127, 771382294, 771323700, 770547867, 770497437, 770437775, 770623169, 770891724, 771340103, 771992264, 771912231, 771990204, 771679993, 771801147, 771860886, 771664886, 771349945, 770592804, 771009064]
1990.5G71009064L41491k91977m8141O96259M37316k32849P7439j24665k89917q24279
2000.1G70749741m18549r1324j01852K27051l7613L17154N35278L92456k93732k82364
2009.8G70996246n82046r21097j4343j16120N2872J04981q8730k19651J27945L55530
2019.4G69695587k17285l93143r17968l82004m26178o30493o4621K17361M78134k26898
2029.1G67132492j14899k33383k00119k81372n63888j36261m83475k00348o88858l60336
2038.7G63869553L86200J22222q5144l04946O45065l8452n10102k38342l67584j04904
2048.4G63373566l58124k20718j69373K94495m7379P1259L09524j64566M44107j98746
2058G63334045n04608l91617k14462j01013J65405O74973o0959J22604J14975K39029
$$ y = [771009064, 771350555, 771058578, 771010437, 771706696, 772144012, 771911163, 771988602, 771863937, 771574020, 770749741, 770331192, 770239868, 770138016, 770365067, 770327454, 770644608, 771179886, 771572342, 771278610, 770996246, 770414200, 769493103, 769478760, 769362640, 769415512, 769520493, 769431763, 769212112, 769340057, 769695587, 769478302, 769085159, 768167191, 767785187, 767359009, 766728516, 766663895, 766881256, 767359390, 767132492, 767017593, 766784210, 766584091, 766302719, 765738831, 765602570, 765119095, 764918747, 764229889, 763869553, 764255753, 764377975, 764292831, 763987885, 764632950, 764594498, 764084396, 763846054, 763478470, 763373566, 763015442, 762794724, 762625351, 762919846, 762872467, 762943726, 763253250, 763088684, 763532791, 763334045, 762829437, 762437820, 762223358, 762122345, 762287750, 762962723, 762901764, 763024368, 763139343, 763378372]
2067.6G63378372O5308j25199L3417m90799k823k29263O5994q0413j69373N72815K2049
2078.2G63040085J75629R6206J24512j23901m6692n570l42636K23160k04315j0758
2087.9G62925720o790M23966O22711l37677j02997n7678M1427j33819K24228J7700
2097.5G63616791l75748Q3313K55661Q69827J67542l91159m52728M4708K32010n2567
2107.2G63997650M77753j25733J78223m1656l25165L56598O31637J99051j024704k20032
2116.8G64103622J0682J34277J29929k35138M92324K29569K31781l204L04031j60141
2126.5G65237732o05698K9526m41360k2889J6556J98517J46179J49842K16598j44577
2136.1G64780426M58450k55661R995K93732J13678K49328o02646m36630n0964J30996
$$ y = [763378372, 763443680, 763318481, 763351898, 762861099, 762858276, 762629013, 762695007, 762614594, 762445221, 763018036, 763040085, 763215714, 763311920, 763436432, 763312531, 763265839, 763260269, 762917633, 763140793, 762936478, 762925720, 762918930, 763342896, 763965607, 763627930, 763524933, 763467255, 763508682, 763374863, 763599091, 763616791, 763241043, 763324356, 763580017, 764449844, 764617386, 764226227, 763773499, 763818207, 764050217, 763997650, 764475403, 764349670, 764527893, 764486237, 764161072, 764517670, 765149307, 765348358, 764323654, 764103622, 764114304, 764248581, 764378510, 764143372, 764635696, 764865265, 765097046, 765093842, 765397873, 765237732, 764632034, 764661560, 764220200, 764197311, 764213867, 764412384, 764558563, 764708405, 764925003, 764780426, 765238876, 764983215, 764993210, 765286942, 765400620, 765649948, 765047302, 764610672, 764559708, 764690704]
2145.8G64690704J54953O39725M883n69916Q164j17188N76401J96304k08587l86124
2155.4G64989319j14517O00204J33591N90133J37787K1820L05863j53885j23367J25198
2165G66512146N36270P6828L2349o333K04163P2327k73819L76739N27191O33698o8512
2175.6G68623047J16577M12064L7918J01242J2970N73501J32523K39258L63388J53427
2185.3G70765915J50375l30963M11301M84695N70832L92074N5542J53351l83911j29013
2194.9G72140198L49807O08826K0752N7373M34265J05896m120J38779N12695j54876
2204.6G74209595J02844K58102j20239J63193J34201L64914K43530P19986N13916J76621
2214.2G76766663P4997l49808L07998N5771j19018p4005J61438N32303L91464J18637
$$ y = [764690704, 764845657, 765485382, 765490265, 764920349, 764928513, 764811325, 765387726, 765584030, 765375443, 764989319, 764874802, 765475006, 765608597, 766198730, 766336517, 766358337, 766664200, 766510315, 766386948, 766512146, 767048416, 767125244, 767157593, 767151260, 767355423, 767427750, 767153931, 767530670, 768057861, 768691559, 768623047, 768739624, 769151688, 769189606, 769290848, 769303818, 769877319, 770009842, 770249100, 770612488, 770765915, 770916290, 770585327, 770996628, 771481323, 772052155, 772444229, 772499771, 772653122, 772269211, 772140198, 772490005, 773098831, 773119583, 773176956, 773611221, 773717117, 773712997, 773851776, 774364471, 774209595, 774312439, 774570541, 774450302, 774613495, 774747696, 775112610, 775356140, 776076126, 776590042, 776766663, 776841660, 776491852, 776799850, 776855621, 776736603, 776662598, 776824036, 777356339, 777747803, 777866440]
2223.9G77866440n9662N27420K060k50397j32141J84174L77273m66308j76316l8223
2233.5G77834320L62701M38538K57645M01535J35116J99967j28861J3199l69873r4376
2243.2G79049911N20249J50680Q3619j54267L57590J69830L9978j6403l13797J2741
2252.8G79900131K38648N57556k44370j18866R232J9531L95508n3635L67585M8523
2262.4G81119843o6834o0043N6991K88468N5923K78015l41263k70385o2485L50113
2272.1G81348343K76871k27433L67661M04129N10940K6551p5608m5776J6861j07040
2281.7G82495499o60935R2926k13775J12609L85514R1171J98059M425N14908m6463
2291.4G82973938J18942K34223j22605m27170n88302M24576K39715N10025P7515k5864
$$ y = [777866440, 777806778, 778334198, 778336258, 778085861, 777953720, 778137894, 778515167, 778048859, 777872543, 777834320, 778197021, 778635559, 778893204, 779294739, 779429855, 779629822, 779500961, 779514160, 779144287, 779049911, 779570160, 779720840, 779804459, 779650192, 780007782, 780177612, 780217590, 780201187, 779887390, 779900131, 780138779, 780696335, 780451965, 780333099, 780342331, 780361862, 780757370, 780703735, 781071320, 781119843, 781053009, 780992966, 781049957, 781338425, 781394348, 781672363, 781331100, 781060715, 780998230, 781348343, 781625214, 781397781, 781765442, 782169571, 782680511, 782707062, 782631454, 782585678, 782602539, 782495499, 781834564, 781927490, 781713715, 781826324, 782211838, 782303009, 782501068, 782505493, 783020401, 782973938, 783092880, 783327103, 783204498, 782777328, 782189026, 782613602, 782853317, 783363342, 783440857, 783414993]
2301G83414993M34723j68533J94549R5520M9210o70547m09317L02047J41297Q2626
2310.7G83466568p41348K53601N96390Q08563K36130q29163M28390L04642l57666n89752
2320.3G83576355J70059J07041j56022l5629m95834O94733P31506L00217q76770o32020
2329.9G83383636n0201n26123N2261o72912M70123N10178l891L21350M87671L08609
2339.6G84280701n19791P8888j064911p9193K8915j859359r39789J80282P66983N16129
2349.2G81388855Q44498J89666K72522R56269o66657q00400m98199M60205J14059p17926
2358.9G81542892j568298J7014K778015P03430j152802m84695O09512j588363l17231
2367.6G80539474N15748j700287r50928m34036Q65402k91748j002731j90125n52673
$$ y = [783414993, 783849716, 783681183, 783875732, 783971252, 784020462, 783349915, 782940598, 783242645, 783383942, 783466568, 782725220, 782978821, 783575211, 784383774, 784619904, 783790741, 784219131, 784523773, 784166107, 783576355, 783746414, 783853455, 783697433, 783661804, 783165970, 783860703, 784592209, 784892426, 784015656, 783383636, 783333435, 782807312, 782859573, 782186661, 782656784, 783166962, 783163071, 783484421, 783972092, 784280701, 783760910, 783839798, 782774887, 782695694, 782724609, 780865250, 779925461, 780105743, 780872726, 781388855, 782233353, 782423019, 782695541, 783651810, 782985153, 782184753, 781686554, 782146759, 782260818, 781542892, 779974594, 779991608, 782769623, 783473053, 782320251, 781835556, 782445068, 780856705, 780539474, 781055222, 779354935, 778404007, 777969971, 778835373, 778543625, 777540894, 777350769, 776798096]
2376.2G76798096J8234l738k33841l53470j48850p87658r31015k32697p9956O76804
2385.9G74721909L84674N3100k81601k81524J22070o24085p19299n58319l7765j36719
2395.5G72642441l27225K02484P7744k37961m62265K44369K34375j31301p2556l61557
2405.2G71808548n53894m83551o2180l07617q3694l8147j41220q2474m51203j64337
2414.8G69440231k66342l23257o79627n03311k65121n05371j0071j29853K06681k60926
2424.5G66703033o65283j96228m01153m31290p04575l57895k23922n24369o10961j64261
2434.1G62423096O7749m57230k74811m58679l37219k29187l09372m20837l74833J56784
2443.7G59785461n08270o52466n56793j87073j22375m79660n4398m99725l02429k56577
$$ y = [776798096, 776816330, 776812592, 776578751, 776225281, 776076431, 775288773, 774357758, 774125061, 774045105, 774721909, 775106583, 775159683, 774878082, 774596558, 774718628, 774094543, 773375244, 772816925, 772779160, 772642441, 772315216, 772517700, 772595444, 772357483, 771895218, 772139587, 772373962, 772242661, 772170105, 771808548, 771254654, 770771103, 770708923, 770401306, 770317612, 770279465, 770138245, 770055771, 769604568, 769440231, 769173889, 768850632, 768171005, 767667694, 767402573, 766897202, 766887131, 766757278, 766963959, 766703033, 766037750, 765841522, 765440369, 765009079, 764304504, 763946609, 763722687, 763198318, 762587357, 762423096, 762490845, 762033615, 761758804, 761300125, 760962906, 760733719, 760424347, 760003510, 759628677, 759785461, 759277191, 758624725, 758067932, 757880859, 757758484, 757278824, 757224426, 756724701, 756422272, 756165695]
2453.4G56165695n10025o73904p01370%j09635j90277m17480n12085o54297k20871
2463G52175751K15530m09698l33634n61523m31977j56402R9716l29971q09784p935
2472.7G49450073m28695n80292m73709j61057k83584o27747J54800N494j7548m48608
2482.3G46589127m42963n15137p29751J31988j79443k98157m60663j13830P2555k74734
2492G43778992k5101l29971k06147m58068m18702l90548l23105O6299j25274J88903
2501.6G41757278j51138m24881l95660K6321M0970k63519J16501m62037l68652k78549
2511.2G39596634l99094l74527k36969L60337J37100R7580l64533o42700m96445l06549
2520.9G37370834m36554o46514j64795m89197K14691K62146n66711l13035j41983L11738
$$ y = [756165695, 755655670, 754981766, 754280396, 754280396, 754170761, 753980484, 753563004, 753050919, 752396622, 752175751, 752391281, 751981583, 751647949, 751086426, 750654449, 750498047, 750597763, 750267792, 749458008, 749450073, 749021378, 748441086, 747967377, 747806320, 747522736, 746894989, 747049789, 747055283, 747037735, 746589127, 746146164, 745631027, 744901276, 745033264, 744853821, 744555664, 744095001, 743981171, 744053726, 743778992, 743753891, 743423920, 743217773, 742759705, 742341003, 741950455, 741627350, 741693649, 741568375, 741757278, 741606140, 741181259, 740785599, 740811920, 740852890, 740589371, 740705872, 740243835, 739875183, 739596634, 739197540, 738823013, 738586044, 738946381, 739083481, 739181061, 738816528, 738173828, 737677383, 737370834, 736934280, 736287766, 736122971, 735633774, 735848465, 736110611, 735543900, 735230865, 735088882, 735400620]
2530.5G35400620r3308p93991j191406o35147l16849m37241K04468k87247n7296K59628
2540.2G32052231l88336o66428n22766m13513n72434m08478o50787k37503j32828n24444
2549.8G27534714k52915M9057J39542o16379n22995k30026l37067p35702q57926j38931
2559.5G24031372m66614n88150k31781K79846j52k89536J0071q93936r51157l20053
2569.1G20579910o6147o49032o73447j32370k48413J23062j66397j4343k17056o15311
2578.7G17920456n40466q08106k02179n00870n11856j16424j88523k90985n96008j27640
2588.4G14037399J35651p2174o00586k78473p9956n45197l70025l52020k17896l63617
2598G11293106j26343R3232j01777n43518o53686o3248l54614l44086o04400p0649
$$ y = [735400620, 735307312, 734513321, 733321915, 732686768, 732369919, 731932678, 732137146, 731849899, 731792603, 732052231, 731663895, 730997467, 730474701, 730061188, 729488754, 729080276, 728429489, 728191986, 728059158, 727534714, 727281799, 727330856, 727470398, 726854019, 726331024, 726100998, 725763931, 725028229, 724170303, 724031372, 723564758, 722976608, 722744827, 723024673, 723024521, 722734985, 722745056, 721851120, 720899963, 720579910, 720513763, 719864731, 719191284, 719058914, 718810501, 718933563, 718767166, 718752823, 718535767, 717920456, 717379990, 716571884, 716369705, 715868835, 715356979, 715240555, 715052032, 714761047, 714165039, 714037399, 714173050, 714100876, 713500290, 713221817, 713141861, 712596664, 712226639, 711874619, 711656723, 711293106, 711166763, 711259995, 711158218, 710614700, 709961014, 709897766, 709543152, 709199066, 708594666, 708524017]
2607.7G08524017K87323o53076l90167o57349m06570l00675o52084m70047n16739j01929
2617.3G04662704l74755n40314o81229o56662n69916o73370l59726o35757o23856o48422
2627F98898697n21546q78677r77173r9640l62320m47769l51410m17556r60083j298829
2636.6F92583694p97576m78440k23160p79495p46918k17437m31977q50830o52237n47943
2646.3F86857681j217575p15103l35083l95889l85285m33197m43878j055679o61698
2654.9F81214294k53448m97971o70471q47320j065064j234665o84509l68118l34320
2663.6F75258408k07978k17743o16531n02472k97317o77872m22974p89566p56302m45556
2673.3F70324097p43943m66079l80936l20663n45350n16433k42462l01514n57785q37250
$$ y = [708524017, 708811340, 708158264, 707768097, 707110748, 706704178, 706403503, 705751419, 705281372, 704764633, 704662704, 704287949, 703747635, 703066406, 702409744, 701839828, 701166458, 700806732, 700170975, 699547119, 698898697, 698377151, 697498474, 696521301, 696421661, 696059341, 695611572, 695260162, 694842606, 693882523, 692583694, 691786118, 691307678, 691084518, 690305023, 689558105, 689340668, 688908691, 688057861, 687405624, 686857681, 685640106, 684925003, 684589920, 684194031, 683808746, 683375549, 682931671, 681875992, 681214294, 680960846, 680462875, 679792404, 678945084, 677880020, 676645355, 675960846, 675592728, 675258408, 675050430, 674832687, 674216156, 673713684, 673416367, 672738495, 672315521, 671525955, 670769653, 670324097, 669580154, 669114075, 668733139, 668412476, 667867126, 667350693, 667108231, 666806717, 666248932, 665411682]
2682.9F65411682p62100p58362n28641m69665J30157j3580q85315n00641n59692n20783
2692.5F60543060m35867m24728n71824p54470o30875r50928k37350j52588p20291o40869
2702.2F55023270n90668n06516q00170o74973l54996k38571n98907o90003m95148o66427
2711.8F49406891n83038p28302m90342n17273o69937p00607n42297O7825l64914o43311
2721.5F44234695p53173n61219j75018m23202o91834p53326k75116m62494l33977k07405
2731.1F39597931o74210n18608m96712l76777m67377l40538j90239k03514k37732p25822
2740.8F35366402p67289n40123j58729k92015l14598r9716m11950m74128k44179j76544
2750.4F31887131o78368l04756j29852n91812n65758n89791k50206l46489k59780k07978
$$ y = [665411682, 664649582, 663891220, 663362579, 662892914, 663023071, 663009491, 662124176, 661623535, 661063843, 660543060, 660107193, 659682465, 659110641, 658356171, 657725296, 656774368, 656537018, 656384430, 655664139, 655023270, 654432602, 653926086, 653125916, 652450943, 652095947, 651857376, 651258469, 650568466, 650073318, 649406891, 648823853, 648095551, 647605209, 647087936, 646417999, 645717392, 645175095, 645242920, 644878006, 644234695, 643481522, 642920303, 642745285, 642322083, 641630249, 640876923, 640601807, 640139313, 639805336, 639597931, 638923721, 638405113, 637908401, 637531624, 637064247, 636723709, 636533470, 636329956, 636092224, 635366402, 634599113, 634058990, 633900261, 633608246, 633293648, 633193932, 632781982, 632307854, 632063675, 631887131, 631208763, 630904007, 630774155, 630182343, 629616585, 629026794, 628776588, 628430099, 628170319, 627962341]
2760F27962341j7128J15624o24199n70564o43082n15556k98615j90201k28080n58777
2769.7F24431763J411k61001n26619m13704n60112m50707n02281n37910o33622m89921
2779.3F20057297p09572n44205j90658m39568l66669k80571l24287m42810l46947r73587
2789F15438423j152420n78194q52050q85887o09475l66554j018600j004258m79545
2797.7F08491440r57565q54073q51593q51173j120530j024131o20156q79020p65381
2806.3F00567818r33533n74532n45997j333084j359520j007118j145859j533165j127930
2815E91007080j074333j016731p88384j045875j229210j277047j158714j325760j126442
2823.7E80964584j301613j455459j160545j452141j363411j319847j149063j184845
$$ y = [627962341, 627945213, 628060837, 627436638, 626866074, 626222992, 625707436, 625408821, 625218620, 624990540, 624431763, 624433174, 624172173, 623645554, 623231850, 622671738, 622221031, 621718750, 621180840, 620547218, 620057297, 619347725, 618803520, 618612862, 618173294, 617806625, 617526054, 617201767, 616758957, 616412010, 615438423, 614286003, 613707809, 612855759, 611969872, 611360397, 610993843, 609975243, 608970985, 608491440, 607533875, 606679802, 605828209, 604977036, 603856506, 602832375, 602212219, 601333199, 600567818, 599634285, 599059753, 598513756, 597180672, 595821152, 594814034, 593668175, 592135010, 591007080, 589932747, 588916016, 588127632, 587081757, 585852547, 584575500, 583416786, 582091026, 580964584, 579662971, 578207512, 577046967, 575594826, 574231415, 572911568, 571762505, 570577660]
2831.4E70577660j409645j218682j383056j579094j874466j827774j412049j477127
2839.1E58395767k185325k077179j473961j829987j711769j571960j998940k326698
2846.8E43219948k292252k363090k605019k226181k030678j743431j499367j527633
2854.6E26932297j468544j305695j522713j706733p85866j063538j490554j442185
2862.3E16146469j506615j051902j977387k340011k245484k528839k447929k530937
2870D99517365j889115k055092k639274k796059k830276k498475k466354k304993k588386
2878.7D77449341k640648j855736j830978k206154j843567j498337j350593r97620
2886.4D63225708j135674q01544m12979q36830q15086m53644m90303m97475n0392j12000
$$ y = [570577660, 569168015, 567949333, 566566277, 564987183, 563112717, 561284943, 559872894, 558395767, 556210442, 554133263, 552659302, 550829315, 549117546, 547545586, 545546646, 543219948, 540927696, 538564606, 535959587, 533733406, 531702728, 529959297, 528459930, 526932297, 525463753, 524158058, 522635345, 520928612, 520142746, 519079208, 517588654, 516146469, 514639854, 513587952, 511610565, 509270554, 507025070, 504496231, 502048302, 499517365, 497628250, 495573158, 492933884, 490137825, 487307549, 484809074, 482342720, 480037727, 477449341, 474808693, 472952957, 471121979, 468915825, 467072258, 465573921, 464223328, 463225708, 462090034, 461288490, 460875511, 460038681, 459223595, 458769951, 458279648, 457782173, 457731781, 457619781]
2896D57619781k37426l67203m40979l21465o39305k34604m13093r86366q49495o77567
2905.7D52452278n00603r96513r98497p43637j031799j260071j348953j661568j933861
2914.3D41976776j721001k160415k363091k350921k240486j773224j880112j631889
2922.1D25855637j296120r15527j287346j412392o17676n84030l25050l89977l26042
2930.7D18701477p0229N30472J378327J314850J812629J826630J693878K131844K321586
2939.4D31641464K357636K319755K754746L102493L407135L156891K671852K739105
2947.1D54151077K856369K936402K740211K850800L148613L133125K764664K771072
2954.8D77352333K885590K505455K729606K997895K994995K989769K876548K560997
$$ y = [457619781, 457382355, 457015152, 456574173, 456252708, 455613403, 455378799, 454965706, 453979340, 453129845, 452452278, 451951675, 450955162, 449956665, 449213028, 448181229, 446921158, 445572205, 443910637, 441976776, 440255775, 438095360, 435732269, 433381348, 431140862, 429367638, 427487526, 425855637, 424559517, 423643990, 422356644, 420944252, 420326576, 419742546, 419417496, 419027519, 418701477, 418631248, 419161720, 420540047, 421854897, 423667526, 425494156, 427188034, 429319878, 431641464, 433999100, 436318855, 439073601, 442176094, 445583229, 448740120, 451411972, 454151077, 457007446, 459943848, 462684059, 465534859, 468683472, 471816597, 474581261, 477352333, 480237923, 482743378, 485472984, 488470879, 491465874, 494455643, 497332191, 499893188]
2962.6D99893188K213212K457618K556076K072106J880569K156983K232322K329827
2970.3E17791901K424812K297172K184754J959457J592789J784172K225952J603508
2978E33864517J670990K242851J965752J693726J136970J184006J417808J725960J776657
2986.7E48679237O83060P80258J519814J277504P67059P32689R78203P66716K66037
2995.3E56450577L38669P54737M42963J49193K98843L85475R5139j01700J21193k29492
3005E58705597n75981j90697j44730o96792m40102j90162m71383n46722p00302n88875
3014.6E54159851j115723r19227k44446o27213q65516j415978j235847p98798r26819
3023.3E46010284j000137r30176o28013j069031j336708j448097j258698q69560j276970
$$ y = [499893188, 502106400, 504564018, 507120094, 509192200, 511072769, 513229752, 515462074, 517791901, 520216713, 522513885, 524698639, 526658096, 528250885, 530035057, 532261009, 533864517, 535535507, 537778358, 539744110, 541437836, 542574806, 543758812, 545176620, 546902580, 548679237, 549362297, 550142555, 551662369, 552939873, 553706932, 554439621, 555417824, 556184540, 556450577, 556789246, 557543983, 557986946, 558136139, 558434982, 558820457, 558915596, 558813896, 558935089, 558705597, 558129616, 557938919, 557794189, 557097397, 556657295, 556467133, 555995750, 555449028, 554748726, 554159851, 553044128, 552124901, 551880455, 551253242, 550387726, 548971748, 547735901, 546937103, 546010284, 545010147, 544079971, 543451958, 542382927, 541046219, 539598122, 538339424, 537469864, 536192894]
3032E36192894j442490j401214j436348j295052r60960j221428j378288j248131j135750
3040.7E24673233r54170j799927j630211j033439j318894j439857j456490j198120
3048.4E13842125j353149j443482j730652j813507j502228j394119j006889j221886
3056.1E02376213j663208j713104j264382j577758j410790n85441j546250j701698
3063.8D90913582j458244j228791j076813j872596j954384j534577q18061j461068
3071.5D79509048j937179j322975j060982p92274j659890j782646j210709j321716
3079.2D68420677j357765j609917j907844j897087j230469r54170j469536j824989
3087D56168900j255570j110535j493721j176452j582222j650353j249237j324959j394538
$$ y = [536192894, 534750404, 533349190, 531912842, 530617790, 529656830, 528435402, 527057114, 525808983, 524673233, 523719063, 521919136, 520288925, 519255486, 517936592, 516496735, 515040245, 513842125, 512488976, 511045494, 509314842, 507501335, 505999107, 504604988, 503598099, 502376213, 500713005, 498999901, 497735519, 496157761, 494746971, 494161530, 492615280, 490913582, 489455338, 488226547, 487149734, 485277138, 483322754, 481788177, 480970116, 479509048, 477571869, 476248894, 475187912, 474395638, 472735748, 470953102, 469742393, 468420677, 467062912, 465452995, 463545151, 461648064, 460417595, 459463425, 457993889, 456168900, 454913330, 453802795, 452309074, 451132622, 449550400, 447900047, 446650810, 445325851, 443931313]
3095.6D43931313j670418j518288j063805r19227j232453j569900j908951j582947
3103.4D32465324j494140j807671r69696r27925j123009j230201j556359j296768j354713
3112D20704842j339417j507492j444244j481667j288147q68492j421890j601906j410637
3120.7D08340950q75549j278153j580925p54738j370163j789894j669120j373826q95042
3129.4C96753540j242943j241836j082001j506729j542778j122322q93402q24395j213951
3138.1C86083183j152954j104278j515465j287155j398583j268539j164170j522445
3145.8C75669594j323242p77932q38928j525955j317482j209984r47723q91304j507302
3154.5C65329742r92736r18427j225319j017113p02056j086274j669616j315842j079025
$$ y = [443931313, 442260895, 440742607, 439678802, 438759575, 437527122, 435957222, 434048271, 432465324, 430971184, 429163513, 428193817, 427265892, 426142883, 424912682, 423356323, 422059555, 420704842, 419365425, 417857933, 416413689, 414932022, 413643875, 412775383, 411353493, 409751587, 408340950, 407465401, 406187248, 404606323, 403851585, 402481422, 400691528, 399022408, 397648582, 396753540, 395510597, 394268761, 393186760, 391680031, 390137253, 389014931, 388121529, 387297134, 386083183, 384930229, 383825951, 382310486, 381023331, 379624748, 378356209, 377192039, 375669594, 374346352, 373568420, 372729492, 371203537, 369886055, 368676071, 367728348, 366837044, 365329742, 364337006, 363418579, 362193260, 361176147, 360474091, 359387817, 357718201, 356402359, 355323334]
3163.1C55323334q49114q50219r93271j196099j012001q02345j277695j071739j037369
3171.8C46233482r59358j060181j109542m75502n76668j122704j720695j130104o74591
3180.5C37404137p85714p11097r95407p76596q66280q33244j010628j094360m88472
3189.2C29842339p07322j020317j245918j090088r80759j127891p31773m19121q45795
3197.9C21673355j350517j003361n91354j77174n04093j182671j219520q36125n44834
3206.5C14263706r80568l62854l23505j066094p49015o58055n09872r10778r23825
3215.2C07779140l47614n78804p91550r01641j302376j014538k35558m09832k74524
3223.9C01922703m92783j074848p64732o88992m81682n91583o27251m25796m51031
$$ y = [355323334, 354474220, 353624001, 352630730, 351434631, 350422630, 349620285, 348342590, 347270851, 346233482, 345274124, 344213943, 343104401, 342628899, 342052231, 340929527, 339208832, 338078728, 337404137, 336618423, 335907326, 334911919, 334135323, 333269043, 332435799, 331425171, 330330811, 329842339, 329135017, 328114700, 326868782, 325778694, 324797935, 323670044, 322938271, 322519150, 321673355, 320322838, 319319477, 318728123, 318550949, 318046856, 316864185, 315644665, 314808540, 314263706, 313283138, 312920284, 312596779, 311530685, 310781670, 310123615, 309613743, 308702965, 307779140, 307431526, 306852722, 306061172, 305159531, 303857155, 302842617, 302607059, 302197227, 301922703, 301429920, 300355072, 299590340, 298901348, 298419666, 297828083, 297200832, 296775036, 296324005]
3232.6B96324005o18858q14095o69021p39498n74112o50044n71423o37874o94008q9951
3242.2B90265121l38687p46308j020431l75519m09222r70974m22954j73302O9904q15258
3251.9B85062370q20026n46723r96322j11294k76737n17445n42583m33941l12824n41592
3261.5B79962883m88243o15063O104n589k87285p03926r47132m59709l42674m8848
3271.2B76070518n61695k32219j07994q30002n70202m93755O2522k51236p96794p08943
3280.8B71580200l38898J27373l07235n54963o91661l76893j69029r5520j02176n75181
3290.4B68496017m45308m78001l89652m15421m09240n28756o61926L34835L26538n15327
3300.1B65313759o28967m26407n20859k64683N3749l01018m12807n61352o73103n14221
$$ y = [296324005, 295705147, 294891052, 294222031, 293482533, 292908421, 292258377, 291686954, 291049080, 290355072, 290265121, 289926434, 289180126, 288159695, 287784176, 287374954, 286403980, 285981026, 285807724, 285877628, 285062370, 284242344, 283695621, 282699299, 282588005, 282311268, 281793823, 281251240, 280817299, 280504475, 279962883, 279474640, 278859577, 278865681, 278860092, 278572807, 277868881, 276921749, 276462040, 276119366, 276070518, 275508823, 275276604, 275168610, 274338608, 273768406, 273274651, 273337173, 273085937, 272289143, 271580200, 271241302, 271368675, 271061440, 270506477, 269814816, 269437923, 269268894, 269173374, 269071198, 268496017, 268050709, 267572708, 267183056, 266767635, 266358395, 265829639, 265167713, 265502548, 265829086, 265313759, 264684792, 264258385, 263737526, 263472843, 263526592, 263225574, 262812767, 262251415, 261578312, 261064091]
3309.7B61064091j41316j81198l94916k08245l00579l22227n19829o07929q07858p09400
3319.4B56870594q4133J40056Q3619m98143l92093l35427n98354n62992m78077l01151
3329B53843899q42190k92072K24895m29077q54053n41840J71108l89442p29752m39453
3338.7B49722023j69582m45500p34329l59268l27892L17306j34163o73199l98387n44472
3348.3B46252537k86293q50430n32360O1283k10094J90182j02826q94451r34524m26770
3357.9B42266254k25620k64873l80288j60560j54705o60553m18720l90168l56655k26707
3367.6B39027405m48380m94327n47505k28538P1945N9566o5574l10860m82864k51999
3377.2B36328869j87893j63422j7223m09184l37314l04547l07960l41492o08406k66151
$$ y = [261064091, 260922775, 260741577, 260346661, 260138416, 259837837, 259515610, 258995781, 258387852, 257579994, 256870594, 256786461, 256926517, 257010136, 256511993, 256119900, 255784473, 255186119, 254623127, 254145050, 253843899, 253001709, 252709637, 252934532, 252505455, 251651402, 251109562, 251280670, 250891228, 250161476, 249722023, 249552441, 249106941, 248372612, 248013344, 247685452, 248002758, 247868595, 247195396, 246797009, 246252537, 245966244, 245115814, 244583454, 244644737, 244434643, 244624825, 244521999, 243627548, 242693024, 242266254, 242040634, 241775761, 241395473, 241234913, 241080208, 240419655, 240000935, 239610767, 239254112, 239027405, 238579025, 238084698, 237537193, 237308655, 237380600, 237440166, 237374592, 237063732, 236580868, 236328869, 236140976, 235977554, 235960331, 235551147, 235213833, 234909286, 234601326, 234259834, 233651428, 233385277]
3386.9B33385277l84541n9623K23522n23548o71692k40670J98460M39568L37295o6032
3396.5B32638016k77939l33843j16959k72751l84407K19479J58214j9302j87359k02904
3406.2B31220245j58405l9444n1842m36172K83146p2994n64843J431M5299K93465m3697
3416.8B30476189R5462K80171j08547m2324L7307K54765q7872n4855L86448m9362o88782
3427.4B30498600k23331Q80470O97384j49575l09200p3986J41525O1016m86869M3449
3437B31079483J158428J200943L34282m02107L15285L76224M3125l4504L06683J170769
3446.7B35548611l40081j77784L65620l76015O50063R49097M28390K44599N76858P11651
3456.3B38581009L83453k2983k92015K3746K77195R69353Q29964N40428K37350J00861
$$ y = [233385277, 233000736, 232941113, 233164635, 232641087, 231969395, 231728725, 231927185, 232366753, 232704048, 232638016, 232360077, 232026234, 231909275, 231636524, 231252117, 231471596, 231629810, 231610508, 231423149, 231220245, 231061840, 231022396, 230970554, 230534382, 230817528, 230744534, 230179691, 230181122, 230226421, 230519886, 230476189, 230571651, 230851822, 230743275, 230700951, 230738258, 230993023, 230905151, 230850296, 231236744, 231187382, 230498600, 230275269, 231155739, 231853123, 231703548, 231394348, 231320362, 231461887, 231522903, 231036034, 231079483, 232237911, 233438854, 233773136, 233371029, 233686314, 234062538, 234105663, 234071159, 234377842, 235548611, 235208530, 235030746, 235396366, 235020351, 235670414, 236619511, 237047901, 237292500, 237869358, 238581009, 238964462, 238941479, 238649464, 238673210, 238950405, 239919758, 240749722, 241290150, 241527500, 241628361]
3466B41628361O87923J06507M15687M71020K91042N73216M13322Q34179N96046L42865
3475.6B46360168P8125L96481P86381Q24146J018314K61631M07582J91154J69316M67662
3485.2B50960960M89254R31492K62070L12900P45450J146583R79576L33710N01442
3493.9B56663437l681J76239N36766P01198J165829P85809L76415R22966J094818J44024
3503.6B62563820N00164O92844N92499Q36220J032009J003990j47343M63715J589184
3512.2B69127102J411686O76117O1474Q0795M99706Q61893P72190Q78696O57940J111298
3521.9B76138897J245632M29192O91814Q69045J209965J89152j71623Q67195J284675
3530.6B82753944R22928M24576J188450J004677J530533Q41426p686J368847O60686
$$ y = [241628361, 242316284, 242422791, 242838478, 243309498, 243600540, 244173756, 244587078, 245421257, 246017303, 246360168, 246438293, 246834774, 247621155, 248445301, 249463615, 249725246, 250132828, 250323982, 250493298, 250960960, 251450214, 252381706, 252643776, 252956676, 253702126, 254848709, 255828285, 256161995, 256663437, 256659756, 256835995, 257372761, 258073959, 259239788, 260025597, 260402012, 261324978, 262419796, 262563820, 263063984, 263756828, 264349327, 265185547, 266217556, 267221546, 267074203, 267537918, 269127102, 270538788, 271214905, 271276379, 271357174, 271856880, 272718773, 273490963, 274369659, 275027599, 276138897, 277384529, 277813721, 278505535, 279374580, 280584545, 280773697, 280602074, 281469269, 282753944, 283676872, 284101448, 285289898, 286294575, 287825108, 288666534, 288658848, 290027695, 290688381]
3539.2B90688381R58672Q15353P99923R84326P90939J429825Q05149J326027J90963
3547.9B98789558J121445J421776J240959K775231k10095J24817J102734J565685J789284
3556.6C09721394K33078J851863J871033R76582L07007J653709J729736J028157M037551
3565.3C23410110J100922k07252N58548N99937L517113K054977J857491J561584J420365
3574C35873795J295585J494026K531281Q50677J999741K274475J312332J962471K435265
3582.6C52029648K026253J196479L628273K003212k51045J725998L13988L553810L590202
3591.3C69816818K791443J169396J130065L882370M33007K361488L347626J023788
3599C85956001L364678J770172O47468K422715K594909K726784L698235K673492p29446
$$ y = [290688381, 291647053, 292462406, 293262329, 294246655, 295037594, 296467419, 297272568, 298598595, 298789558, 299911003, 301332779, 302573738, 305348969, 305138874, 305263691, 306366425, 307932110, 309721394, 309954472, 311806335, 313677368, 314653950, 314960957, 316614666, 318344402, 319372559, 323410110, 324511032, 324303780, 324862328, 325462265, 328979378, 331034355, 332891846, 334453430, 335873795, 337169380, 338663406, 341194687, 342045364, 344045105, 346319580, 347631912, 349594383, 352029648, 354055901, 355252380, 358880653, 360883865, 360632820, 362358818, 362672806, 366226616, 369816818, 372608261, 373777657, 374907722, 378790092, 379223099, 381584587, 384932213, 385956001, 389320679, 391090851, 391738319, 394161034, 396755943, 399482727, 403180962, 405854454, 405125008]
3607.7D05125008L310203R80797J019058P107697J533012j234894M365769J100883
3615.4D23307533L955460M500580J540146J851120j352540J817513M431381K755051
3623.1D42806244J941566K941513L156510L158684O438942n7602q147507M399681M548378
3631.8D61186409N546036J799164j238060K592811L562279L170738J153107J856727
3639.5D79629211K766571K756844J513786J136284L300743M108124N884590j79329
3647.3E00916824k372703L942375j854095j562462J274223P139473N373840L888436
3655E16745911L834190p954712K857857N892563K256088K219658J140289K608185J488228
3663.6E31088257J526222J722641J319847M763031L448563O21948k18086n409775L360100
$$ y = [405125008, 408435211, 409416008, 410435066, 417542763, 419075775, 417840881, 422206650, 423307533, 427262993, 431763573, 433303719, 435154839, 433802299, 435619812, 440051193, 442806244, 444747810, 447689323, 450845833, 454004517, 460443459, 460385857, 452238350, 456638031, 461186409, 466732445, 468531609, 467293549, 469886360, 473448639, 476619377, 477772484, 479629211, 482395782, 485152626, 486666412, 487802696, 491103439, 495211563, 501096153, 500916824, 498544121, 502486496, 500632401, 499069939, 500344162, 507483635, 512857475, 516745911, 520580101, 512625389, 515483246, 521375809, 523631897, 525851555, 526991844, 529600029, 531088257, 532614479, 534337120, 535656967, 540419998, 543868561, 544490509, 544272423, 538862648, 542222748]
3672.3E42222748R032936R662323r97353j8020706L353043P842064M547462j428566
3680E56213951P03354L367043K755661K006073J113815J185150M831619O955147q075561
3688.7E71056252k625809P827377n962524K22664N103721Q85163K537956J138496K17400
3697.4E80400696K052612J257210K268562J983681m242287o72760M779587J818733
3705.1E89646034J151047J475945L180580L730507p169686M180641L418656j2569542
3712.8E87044182N786743M684181J25694J063042L362541K025757k960701J370201
3720.5F02501640N984345k639923m206848N839271J729965j478195l125229J010132
3728.3F05615158M939118J652450N658417l472405o467819J0951729J223297j0855789
$$ y = [542222748, 551255684, 560918007, 559920654, 541899948, 545252991, 553095055, 557642517, 556213951, 556917305, 560284348, 563040009, 565046082, 566159897, 567345047, 572176666, 579131813, 571056252, 568430443, 576257820, 570295296, 570517960, 575621681, 576506844, 579044800, 580183296, 580400696, 582453308, 583710518, 585979080, 587962761, 583720474, 583047714, 587827301, 589646034, 590797081, 592273026, 595453606, 599184113, 592014427, 596195068, 599613724, 587044182, 592830925, 597515106, 597640800, 598703842, 602066383, 604092140, 601131439, 602501640, 608485985, 605846062, 601639214, 607478485, 609208450, 607730255, 604605026, 605615158, 610554276, 612206726, 617865143, 614392738, 607924919, 618876648, 620099945, 609244156]
3736F09244156j002426K450218J112366L384056M263420l328285L906555J1674042
3743.7F31704102j3625756j2600364J1703796O875648P103348m875679j0601043J1859741
3751.4F27543793n867615n876083O296272N057106L457413n898934K250900N323983
3759.1F32286835q164902j236191M962616K065010R94225L912353k938957m176750
3766.8F27704239M048004N521469K53906r206123K109757L063964M23584J240692L73688
3775.5F35533180J574097R19571L116493j591377q209305L793945L114128J751252
3783.2F40001984K262649l260193r71260K435494J583328j9302j09101J202088R83200
3791.9F44108887P64160l46375J595993L008271m378968k315139L243179M011078N236282
$$ y = [609244156, 608241730, 610691948, 611804314, 615188370, 619451790, 616123505, 620030060, 631704102, 618078346, 605477982, 617181778, 624057426, 631160774, 626285095, 615684052, 627543793, 621676178, 615800095, 622096367, 627153473, 630610886, 624711952, 626962852, 632286835, 624121933, 622885742, 627848358, 629913368, 630907593, 634819946, 631880989, 627704239, 631752243, 637273712, 637527618, 628321495, 630431252, 633495216, 633918800, 635159492, 635533180, 637107277, 638026848, 641143341, 639551964, 631342659, 635136604, 638250732, 640001984, 642264633, 639004440, 638033180, 640468674, 642052002, 642032700, 641923599, 643125687, 644108887, 644873047, 644526672, 646122665, 649130936, 644751968, 642436829, 645680008, 649691086, 654927368]
3800.6F54927368p296448r039115M276161K985000M878235N971451r330139m369888
3808.3F43002625N299606J932983K81677J179734Q52127J682587N091552l050766j3725052
3817F42547073O552582P264481N861892O73981k0338745L098984N887832K861405L317184
3825.7F57726669l31268m094238M94690L216629L957519O43616p919922L812180P197036
3834.3F64702911o760025Q26493R303741j1037826m556656J0082321m751740j447143
3842.1F56362076O639328k364197l262329L562698J396179j11236J505356r87549L375702
3850.7F66116028P502670o646118l196106j4560089M130249J1102676j414413j961594
3858.4F61073303L274994L224793K723617m879684M94995O740875o061478m889373
$$ y = [654927368, 647630920, 638591805, 642867966, 645852966, 650731201, 656702652, 647372513, 643002625, 648302231, 650235214, 650516891, 651696625, 652548752, 654231339, 659322891, 656272125, 642547073, 649099655, 656364136, 662226028, 662900009, 642561264, 645660248, 651548080, 654409485, 657726669, 657395401, 653301163, 653795853, 657012482, 660970001, 661613617, 653693695, 657505875, 664702911, 657942886, 658769379, 668073120, 657035294, 652478638, 662560959, 657809219, 656362076, 663001404, 660637207, 657374878, 660937576, 662333755, 662222519, 663727875, 662740326, 666116028, 673618698, 666972580, 663776474, 649216385, 653346634, 664449310, 663034897, 661073303, 664348297, 667573090, 670296707, 665417023, 665912018, 672652893, 666591415, 661702042]
3866.2F61702042L837356M817658O329193r776840r259110N826950P082215L635940
3873.9F74195404j0425644Q03604M499893L99247K162475L371048o712646o657181
3881.6F61636200O859894K110061J891861M318772j2982102K444687M843826J207200
3889.3F72330399N250473j671906j1481857J576233N092849K10343J377487J185303
3897F73869324K584610N77011r606323O307830K203446n903778M446792k864990j388855
3905.7F70225067Q88443Q32825J808853l18756J51138M59366O98090l46527m99497
3914.4F73899002J642609K066879l449173l159180M660797j87149l274917K901840
3922.1F75100708J621552J059494k854767l338929K798768J922988P90406r11866l45764
$$ y = [661702042, 665539398, 670357056, 676686249, 666909409, 657650299, 663477249, 670559464, 674195404, 663769760, 664573364, 669073257, 669472504, 671634979, 675006027, 668293381, 661636200, 668496094, 670606155, 672498016, 676816788, 663834686, 666279373, 671123199, 672330399, 677580872, 675908966, 664427109, 666003342, 671096191, 671306534, 672684021, 673869324, 676453934, 677030945, 667424622, 673732452, 675935898, 670032120, 674478912, 671613922, 670225067, 671113510, 671946335, 673755188, 673436432, 673587570, 674046936, 674745026, 674398499, 673899002, 675541611, 677608490, 674159317, 671000137, 675660934, 675473785, 672198868, 675100708, 676722260, 677781754, 674926987, 671588058, 674386826, 676309814, 677100220, 676188354, 675842590]
3930.8F75842590J764145k423477r40170J343231J9836J071473O59942m61426K05079
3939.5F77081223r5826J419220J352768m282455n44510K088318R12628J149750k026291
3948.1F77054825J085357O87943k677917J900939O47049q47396M3792K94953P11746
3956.8F78901291o29349k17285k31552Q42666J041642j427155k9526J519318J98975
3965.5F79969025o17371J3275L27072j42898n02548Q40911L47901j192551L08151O96030
3975.1F80046997J09634l91235l815M00010J55258N30472k40250l11890P0877O52008
3984.8F81018066R4300q36945N12695M19922J20926l50723n73425L62320K79083J47171
3994.4F81193390k14615L6926L93143M11911N01709M19617
$$ y = [675842590, 677606735, 675183258, 674243088, 675586319, 675606155, 676677628, 677337570, 676876144, 677081223, 676985397, 678404617, 679757385, 675474930, 674930420, 677018738, 677931366, 679081116, 677054825, 678140182, 678828125, 676150208, 678051147, 678698196, 677850800, 677894592, 678189545, 678901291, 678271942, 678054657, 677823105, 678665771, 679707413, 678280258, 678250732, 679770050, 679969025, 679351654, 679364929, 679692001, 679549103, 679046555, 679887466, 680235367, 679042816, 679350967, 680046997, 680156631, 679765396, 679761581, 680161591, 680316849, 680847321, 680607071, 680295181, 680366058, 681018066, 681112366, 680275421, 680788116, 681208038, 681328964, 680978241, 680404816, 680767136, 681046219, 681193390, 680978775, 681015701, 681408844, 681820755, 682322464, 682742081]
4000.2F82742081
$$ y = [682742081]
##END=$$ End of the data block
