##TITLE=$$ Begin of the data block
##JCAMP-DX=5.00 $$ ACD/SpecManager v 10.08
##SPECTROMETER/DATA SYSTEM=Varian
##DATE=20 Nov 2012 09:53:00
##DATA TYPE=INFRARED SPECTRUM
##DATA CLASS=XYDATA
##ORIGIN=
##OWNER=
##NPOINTS=3735
##FIRSTX=399.26403809
##LASTX=4000.35498047
##MAXX=4000.35498047
##MINX=399.26403809
##MAXY=78.64681244
##MINY=17.16604614
##XFACTOR=1.0000000000
##YFACTOR=0.000000100000000
##FIRSTY=47.76072693
##DELTAX=0.96440572
##XUNITS=1/CM
##YUNITS=TRANSMITTANCE
##XYDATA=(X++(Y..Y))
399.3D77607269j3445663l722305j959954l34739N24559k171250k284546N92652R16595
$$ 477607269 464161606 460439301 458479347 458144608 458669167 456497917 454213371 454806023 455722618
407.9D55722618O38352J051292m36630M246750q02575l917465P818909J201172l326760
$$ 455722618 456360970 457412262 456975632 461222382 460419807 456502342 464321251 465522423 462195663
416.6D62195663O974984J823692r915352K130814N00450j306343l262329n161362k530518
$$ 462195663 469170647 470994339 461078987 463209801 463710251 462403908 459141579 453980217 451449699
425.3D51449699O141587R13658p898255k593078J678314k171974l9787Q36563k300797
$$ 451449699 457591286 458504944 450606689 448013611 449691925 447519951 447480164 448316727 446015930
434D46015930k567406N85175O54144m073829l624306j730766K155723O846886M346504
$$ 446015930 443448524 444033699 444687843 440614014 436989708 435258942 437414665 444261551 448608055
442.7D48608055P1373K155113L000946N192070O458512m596215k726135O536179k40631
$$ 448608055 448679428 450834541 453835487 459027557 465486069 460889854 458163719 464699898 464459267
451.3D64459267m199448r08356J012726R86214Q61473o1379l447113K866593J223602
$$ 464459267 460259819 459351463 460364189 461350403 462211876 462150497 458703384 461569977 462793579
460D62793579k095833m361801m065704J667213k213707m088173K119179Q86307n066071
$$ 462793579 460697746 456335945 452270241 453937454 451723747 447635574 449754753 450641060 445574989
468.7D45574989q62121K113075n902557l713189P762986j229515o530114r26857J007805
$$ 445574989 444712868 446825943 440923386 437210197 444973183 443743668 437213554 436286697 437294502
477.4D37294502j078834k99874q11843l274918k386055N29289k163353K189942K979393
$$ 437294502 436215668 435915794 435103951 431829033 429442978 429972267 427808914 429998856 432978249
486.1D32978249k735367P28721J092797j770439j864510P16400j33591l507423r08813
$$ 432978249 430242882 430971603 432064400 430293961 428429451 429145851 429012260 425504837 424596024
494.7D24596024J070594K155457l8109l119507l183098J74904J142578m637336l614540
$$ 424596024 425666618 427822075 427783966 424664459 421481361 421656265 422798843 418161507 414546967
503.4D14546967q15201K942352J027412l827934k634811k265969J679612k65160l084068
$$ 414546967 413731766 416674118 417701530 413873596 411238785 408972816 410652428 410387268 407303200
512.1D07303200k308998k683182l78342k191353m845466l274040j081200j477280j530800
$$ 407303200 404994202 402311020 401932678 399741325 394895859 391621819 390540619 389063339 387532539
520.8C87532539k061958j644325O46210l88299j858406j726226Q02726n99212j339379
$$ 387532539 385470581 383826256 384472466 384084167 382225761 380499535 381302261 380703049 379363670
529.5C79363670m37545l6622K665596J127434M92630M13590J174659L584481K787437
$$ 379363670 378926125 378889503 381555099 382682533 383175163 383588753 384763412 388347893 391135330
538.1C91135330J605950J545181L968849K986336J446800K750130R89036k28958M46930
$$ 391135330 392741280 394286461 398255310 401241646 402688446 405438576 406427612 406198654 406645584
546.8D06645584O92978O38924j715393k479325M68025L56789j324806j701889j492348
$$ 406645584 407338562 407977486 406262093 403782768 404250793 404607582 403282776 401580887 400088539
555.5D00088539R9297q51364j604004j624489j808624j436921k541046j736908k450180
$$ 400088539 400187836 399336472 397732468 396107979 394299355 392862434 390321388 388584480 386134300
564.2C86134300k708244k805443l978043l615913m656677k519608k238159k022209
$$ 386134300 383426056 380620613 376642570 373026657 368369980 365850372 363612213 361590004
571.9C61590004j587753j120644j0338r23347J553688j73302J280098K540512J761513
$$ 361590004 360002251 358881607 358871269 357947922 359501610 359328308 360608406 363148918 364910431
580.6C64910431M959488L015442K689819M387474M299317K913284K765121L202400
$$ 364910431 369869919 372885361 375575180 379962654 384261971 387175255 389940376 393142776
588.3C93142776K664376J208496J74103J122398P33452P96242K84881P42836N42679
$$ 393142776 395807152 397015648 397189751 398312149 399045601 399841843 400126724 400869560 401412239
597D01412239j274223m6807R6817P14417M54559o61468o48041j18866N46455r91478
$$ 401412239 400138016 400091209 400188026 400902443 401357002 400695534 400047493 399928627 400475082 399483604
606.6C99483604R7123M48303J3504J205635J495666J487656M41856J278725J431732
$$ 399483604 399580727 400029030 400042534 401248169 402743835 404231491 404673347 405952072 407383804
615.3D07383804L54538m44336P14951K162857J315002K540131L398628L037491J187744
$$ 407383804 407738342 407294006 408008957 410171814 411486816 414026947 417425575 420463066 421650810
624D21650810R34448J634446O02989J345749J262321J680908J440468L35655R44024
$$ 421650810 422585258 424219704 424822693 426168442 427430763 429111671 430552139 430887794 431831818
632.7D31831818J669273J701431O29158O67382R50470J278953Q05283k6627N96237
$$ 431831818 433501091 435202522 435831680 436499062 437449532 438728485 439533768 439507141 440103378
641.3D40103378Q48770J097603K88430k89917J024551K135658J396256J345787J256714
$$ 440103378 440952148 442049751 442338181 442048264 443072815 445208473 446604729 447950516 449207230
650D49207230o40870m41207L77464J187324P52449N68276J593017L47748J30844l814
$$ 449207230 448566360 448125153 448502617 449689941 450442390 451010666 452603683 452951431 453082275 453078461
659.7D53078461O56662J117401J60332O45256M24537O39839J037407J673088J913376
$$ 453078461 453735123 454852524 455012856 455658112 456082649 456722488 457759895 459432983 461346359
668.3D61346359j571541N35508J901054J145134N61142K304687R13048q14895o7330
$$ 461346359 459774818 460310326 462211380 463356514 463917656 466222343 467135391 466320496 466253166
677D66253166L3035J039277J63536k77062K164498K423820J93749p7820J442795P84339
$$ 466253166 466286201 467325478 467489014 467211952 469376450 471800270 471994019 471916199 473358994 474143333
686.7D74143333o54525j0262N67818p94678J11122J515541O2599q54949j569405j039276
$$ 474143333 473488808 473478546 474046364 473251686 473362808 474878349 474940948 474085999 472516594 471477318
696.3D71477318P171j147575j630058j057701r42116j085739j602211k587929j984177
$$ 471477318 471484489 470336914 468706856 467649155 466707039 465621300 464019089 461431160 459446983
705D59446983n43785o18667j162186l90930J461830Q54683M79317J957130J851807
$$ 459446983 458903198 458284531 457122345 456731415 458193245 459047928 459527245 461484375 463336182
713.7D63336182R34143J184501K535401K821312K453537J970024K688522M138298L945656
$$ 463336182 464270325 465454826 467990227 470811539 473265076 475235100 477923622 482061920 486007576
722.3D86007576L347549K956086L080749K613335K061538K789193L590851K543411
$$ 486007576 489355125 492311211 495391960 498005295 500066833 502856026 506446877 508990288
730.1E08990288J890030K204284J898423K341270J971283J286736Q54110P71828J060066
$$ 508990288 510880318 513084602 514983025 517324295 519295578 520582314 521436424 522208252 523268318
738.7E23268318J142159J136627K96631J199760P97730j528321q47244L94211L68614
$$ 523268318 524410477 525547104 525843735 527043495 527841225 526312904 525465660 525859871 526228485
747.4E26228485r83162k522049k264328k119522k389946k163277k310447k183266j780090
$$ 526228485 525245323 522723274 520458946 518339424 515949478 513786201 511475754 509292488 507512398
756.1E07512398j503830j486359k457466k980728j893883j371269j943779j824951
$$ 507512398 506008568 504522209 502064743 499084015 497190132 495818863 493875084 492050133
763.8D92050133o40145L62626j20202J00213J124420J403618K492027L527145L385582
$$ 492050133 491409988 491772614 491652412 491752625 492877045 494280663 496772690 500299835 503685417
772.5E03685417L752747L937111L739967M411392M425278L755150M586143N759354
$$ 503685417 507438164 511375275 515115242 519526634 523951912 527707062 532293205 538052559
780.2E38052559M416504L854408L893852L242607L469162K694626J813545K292405
$$ 538052559 542469063 546323471 550217323 553459930 556929092 559623718 561437263 563729668
787.9E63729668L609771K926140K181092J515884J454430L142776K344894K417107
$$ 563729668 567339439 570265579 572446671 573962555 575416985 578559761 580904655 583321762
795.6E83321762J696205J087456K109451K177582K044869J258735K777367K088051
$$ 583321762 585017967 586105423 588214874 590392456 592437325 593696060 596473427 598561478
803.4E98561478R13620J127510K75573J021576J243668R98573o25839r74770m35829
$$ 598561478 599475098 600602608 600878181 601899757 603143425 604141998 603516159 602541389 602105560
812F02105560k64206M11415K79465K65999n40657n58968j406555r34295M96330l6545
$$ 602105560 601841354 602252769 602532234 602798233 602257576 601698608 600292053 599357758 599854088 599817543
821.7E99817543n90248j293640q09746j910248k006416j129952j408767j792984k399254
$$ 599817543 599227295 597933655 597123909 595213661 593207245 592077293 590668526 588875542 586476288
830.4E86476288k105599l713569l617401k762032k333832j844940k300148q99200j399041
$$ 586476288 584370689 580657120 577039719 574277687 571943855 570098915 567798767 566899567 565500526
839E65500526k032280j938705k513275k761421k608261j657715k178116j775665j515618
$$ 565500526 563468246 561529541 559016266 556254845 553646584 551988869 549810753 548035088 546519470
847.7E46519470k091713j608658j681823k331353l130073l039589k326775j704025
$$ 546519470 544427757 542819099 541137276 538805923 535675850 532636261 530309486 528605461
855.4E28605461k610702l549576l313217k705193j728935j215210M03099J756248L033524
$$ 528605461 525994759 522445183 519131966 516426773 514697838 513482628 513885727 515641975 518675499
864.1E18675499M923897N556869O143418M936561N222702O658898O157035O487465
$$ 518675499 523599396 529156265 535299683 540236244 545458946 552117844 558274879 564762344
871.8E64762344O791802O298637M449921L762054K928543K767067K300225J137619
$$ 564762344 571554146 577852783 582302704 586064758 588993301 591760368 594060593 595198212
879.5E95198212J016731r53446j227722j824646j513061j465454l423958l646584m246368
$$ 595198212 596214943 595261497 594033775 592209129 590696068 589230614 585806656 582160072 577913704
888.2E77913704l297005k875900l692665l522644l323708k950516l181304l704529
$$ 577913704 574616699 571740799 568048134 564525490 561201782 558251266 555069962 551365433
895.9E51365433l326073k373848k946358l819236l975144l772201l030053k882232
$$ 551365433 548039360 545665512 542719154 538899918 534924774 531152573 528122520 525240288
903.7E25240288l305741l894729m111138m522514m872284m746857n641174o110458
$$ 525240288 521934547 518039818 513928680 509406166 504533882 499787025 494145851 488035393
911.4D88035393m972954m852333n303917n693131o468277o367111n671425m378738
$$ 488035393 483062439 478210106 472906189 467213058 460744781 454377670 448706245 444327507
919.1D44327507m053497l842125l202782k129555q33053r13811q73070n17769R56040
$$ 444327507 440274010 436431885 433229103 431099548 430266495 429352684 428479614 427961845 428917885
927.8D28917885J153679J64718P31240R88769J133843J204986R43299J856613K511215
$$ 428917885 430071564 430236282 430967522 431956291 433090134 434295120 435238419 437095032 439606247
936.4D39606247J897850K684441L013534J811028J585121L171730M089012K807961
$$ 439606247 441504097 444188538 447202072 449013100 450598221 453769951 457858963 460666924
944.2D60666924K087287M54712m61082o50063k471199l408508l965607m566879n514641
$$ 460666924 462754211 463208923 462747841 462097778 459626579 456218071 452252464 447685585 442170944
952.8D42170944n535431n445213p221718p570419p749252p368737p259903p983474
$$ 442170944 436635513 431190300 423968582 416398163 408648911 401280174 394020271 386036797
960.6C86036797q085175q764954q242225r347801q882218q313255q999024q432617
$$ 386036797 377951622 369186668 360944443 351596642 342714424 334401169 325402145 316969528
968.3C16969528r355221q496704r551048r426861r132519r543399q524323q988972
$$ 316969528 307614307 299117603 289566555 280139694 271007175 261463776 252939453 243950481
976B43950481p511901q244439p118530p034531o617012m839820n668621m202443n139923
$$ 243950481 236438580 228194141 221075611 214041080 207424068 202584248 196915627 192713184 187573261
984.7A87573261l019218k294579k320556j517201j957512k60238j321965k07557j020127
$$ 187573261 184554043 182259464 179938908 178421707 176464195 176203957 174881992 174674435 173654308
993.3A73654308o74209m50287q69351J055203L15018J454563m50802M01211J209793
$$ 173654308 172980099 172529812 171660461 172715664 173030682 174485245 174034443 174435654 175645447
1002A75645447O47678J031323q86155M98848j49650Q02765k63672j102181l63960j202145
$$ 175645447 176293125 177324448 176438293 176937141 176787491 177590256 177326584 176224403 175860443 174658298
1011.7A74658298J90640j028576M45652k91862L62434J238575j25923Q40378m22936
$$ 174658298 174848938 173820362 174266014 173974152 174336586 175575161 175449238 176289616 175866680
1020.3A75866680J249046N55058J512566J417064P19452K658425J237354J979904Q08125
$$ 175866680 177115726 177670784 179183350 180600414 181319866 183978291 185215645 187195549 188003674
1029A88003674J858062J698170J623478J845646K0790J483860O256P99599k99320Q0108
$$ 188003674 189861736 191559906 193183384 195029030 195049820 196533680 196539936 197339535 197040215 197120323
1038.7A97120323Q06046n13287K49062j294136J355915j56651n21755K57740n20897
$$ 197120323 197926369 197413082 197662144 196368008 197723923 197567272 197045517 197303257 196782360
1047.4A96782360Q09784K71931K011623j35002J177864J766758K625656M275265J781673
$$ 196782360 197592144 197864075 199875698 199740696 200918560 202685318 205310974 209586239 211367912
1056B11367912L681450K514172L455810L168907L297787M125767L332519N137826L505153
$$ 211367912 215049362 217563534 221019344 224188251 227486038 231611805 234944324 240082150 243587303
1064.7B43587303M387322L257465K802620J351528r09786j912441m985962l199024
$$ 243587303 247974625 251232090 254034710 255386238 254476452 252564011 247578049 244379025
1072.4B44379025n176583m771080l779125l307514j468277k117501R18656n49526J152248
$$ 244379025 239202442 234431362 230652237 227344723 225876446 223758945 224677601 224128075 225280323
1081.1B25280323J063690Q29563K712651J535415L102589J765423L579407L468933
$$ 225280323 226344013 227173576 229886227 231421642 234524231 236289654 239869061 243337994
1088.8B43337994L459529K843705J589164L439560K520123L717403J621876K547016
$$ 243337994 246797523 249641228 251230392 254669952 257190075 260907478 262529354 265076370
1096.5B65076370K398110N39570J368217J94435J386013n95054J20143m52442m24194
$$ 265076370 267474480 268014050 269382267 269576702 270962715 270367661 270487804 270035362 269611168
1105.2B69611168J205349p4425K031727J110573J634235J220589K269459K636661J207962
$$ 269611168 270816517 270742092 272773819 273884392 275518627 276739216 279008675 281645336 282853298
1113.9B82853298K423172Q51994K572803J913510K097606J752014O22006J431656q54531
$$ 282853298 285276470 286128464 288701267 290614777 292712383 294464397 295086403 296518059 295663528
1122.6B95663528M18053L86486K163639J896382O60762J858159Q54339K421093J635075
$$ 295663528 296081581 296468067 298631706 300528088 301188850 303047009 303901348 306322441 307957516
1131.2C07957516K461796J761302J169968J450081Q5735R68361j492939j521606k330971
$$ 307957516 310419312 312180614 313350582 314800663 314886398 315854759 314361820 312840214 310509243
1139.9C10509243k471104k351246l692016k044125l542480k830010k999153k393989
$$ 310509243 308038139 305686893 301994877 299950752 296408272 293578262 290579109 288185120
1147.6B88185120j977196k925663j774769k538242j481877j793022m0779m10023j137390
$$ 288185120 286207924 283282261 281507492 278969250 277487373 275694351 275653572 275243549 274106159
1156.3B74106159o237m90112J527996Q70151K114621J496486K052975L252945K485867
$$ 274106159 274099922 273609810 275137806 276007957 278122578 279619064 281672039 284924984 287410851
1165B87410851M097538L148689N154857N303479N736847O047897N946369P791214O502724
$$ 287410851 291508389 294657078 299811935 305115414 310852261 316900158 322846527 330637741 337140465
1173.7C37140465P107811O828499P412567O917572O137047O959495O133309O753120
$$ 337140465 344248276 351076775 358489342 365406914 371543961 378503456 384636765 391389885
1181.4C91389885O409645O179352N545273N591697N718689M777909M696731L860550
$$ 391389885 397799530 403978882 409524155 415115852 420834541 425612450 430309181 434169731
1189.1D34169731L668938L218498L058281K516594J578979J705056J219444J126709
$$ 434169731 437838669 441057167 444115448 446632042 448211021 449916077 451135521 452262230
1196.8D52262230J131973J074410O24351K38037O13747P34444M47044K64740R21974
$$ 452262230 453394203 454468613 455092964 455331001 455944748 456679192 457126236 457390976 458312950
1205.5D58312950J266594J913147J786423J442375K130852K307167K583503K239342
$$ 458312950 459579544 461492691 463279114 464721489 466852341 469159508 471743011 473982353
1213.2D73982353K173958K411308K690239K414704J788787K172547J812172J312866
$$ 473982353 476156311 478567619 481257858 483672562 485461349 487633896 489446068 490758934
1220.9D90758934J120644N01899J36872K06260k03209q28323q08296o78406p82356
$$ 490758934 491879578 492381477 492518349 492724609 492521400 491693077 490884781 490206375 489424019
1229.6D89424019j190186j386261j082420p91245o58340q86765q18786q02841j128540
$$ 489424019 488233833 486847572 485765152 484973907 484315567 483428802 482610016 481807175 480678635
1238.3D80678635j104889o16417k30293n79262k86827m7226J47743P14378L54119L5781
$$ 480678635 479573746 478957329 478727036 478147774 477860947 477813721 477961464 478675842 479029961 479065742
1247.9D79065742M74282J363945J246719P32651O24466Q72993J206856O23360M34189
$$ 479065742 479540024 480903969 482150688 482883339 483507805 484380798 485587654 486211014 486645203
1256.6D86645203O76078O89087L78838J2360L75862M40941K32963Q66890J188355P19528
$$ 486645203 487321281 488010368 488389206 488401566 488777428 489218369 489451332 490318222 491506577 492226105
1266.3D92226105J006355J325836J149750J054077J192513J113472P49359Q24661P60841
$$ 492226105 493232460 494558296 495708046 496762123 497954636 499068108 499817467 500642128 501402969
1274.9E01402969Q56591N55687J26876k25105m45251j9722k89955n46990k44827J5640
$$ 501402969 502259560 502815247 502942123 502717018 502271767 502252045 501962090 501415100 501170273 501185913
1284.6E01185913P2861j831j52664r6894N3482j29356l74260j109085j062164o91986
$$ 501185913 501258774 501256943 501104279 501007385 501060867 500931511 500557251 499448166 498386002 497694016
1294.2D97694016r99146j176758j135788j087341j368485j084899r98459j471024j417770
$$ 497694016 496694870 495518112 494382324 493294983 491926498 490841599 489843140 488372116 486954346
1302.9D86954346k00768j72806k141037j982460j562767j675911j233215j396484r05876
$$ 486954346 486753578 486580772 484439735 482457275 480894508 479218597 477985382 476588898 475683022
1311.6D75683022p11213p11479p58362r45701n78385r91554j068687j111298j063614
$$ 475683022 474971809 474260330 473501968 472556267 471977882 470986328 469917641 468806343 467742729
1320.3D67742729o94427j168938j359787j452141j457138j998329k465363k233276
$$ 467742729 467048302 465879364 464519577 463067436 461610298 459611969 457146606 454913330
1328D54913330k916183k917672k754173k778854k303009k168198j792717j813354j215248
$$ 454913330 451997147 449079475 446325302 443546448 441243439 439075241 437282524 435469170 434253922
1336.7D34253922j056290p39556p40928r86328K98690Q1978K11945M20L80439K76299
$$ 434253922 433197632 432458076 431717148 430730820 431029510 431111488 431323433 431323853 431704292 431980591
1346.3D31980591J52016P93914K09275M21333j45645k22359q3237N4551k14005j079788
$$ 431980591 432132607 432926521 433135796 433557129 433411484 433189125 433105888 433160439 432946434 431866646
1355.9D31866646k39258l03345o5307n30358p55691j09673k22969n88112j035881K26746
$$ 431866646 431627388 431324043 431258736 430728378 429972687 429863014 429640045 429051933 428016052 428242798
1365.6D28242798k69127r6321J90658l02467K74696q5525J087875N23110M27055P57904
$$ 428242798 427973671 427877350 428068008 427765541 428040237 427954712 429042587 429565697 429992752 430750656
1375.2D30750656P47261J244812J36795O60973L76167R14269P33108R77898J660690
$$ 430750656 431497917 432742729 432879524 433540497 433916664 434830933 435564041 436541939 438202629
1383.9D38202629Q04482K108650J985512K071342J888275K080155J753807J268997
$$ 438202629 439007111 441115761 443101273 445172615 447060890 449141045 450894852 452163849
1391.6D52163849J406669N58701O22559o83289O76422J69792o07338j452331k000351
$$ 452163849 453570518 454129219 454751778 454068489 454744911 454914703 454307365 452855034 450854683
1400.3D50854683l7422r30786n41191n83344j402550j085701r52797m05616j530381
$$ 450854683 450817261 449886475 449345284 448761940 447359390 446273689 445320892 444915276 443384895
1409D43384895j251144j346932j167869j215248j233902j20583l20472K24418j213798
$$ 443384895 442133751 440786819 439618950 438403702 437169800 437049217 436728745 436953163 435739365
1417.7D35739365k5101j439514j615982R91859j41945R69162q13904J15319R17015
$$ 435739365 435714264 434274750 432658768 433650627 433508682 434477844 433663940 433779259 434696274
1426.3D34696274K04887J065827M63791J341896j4534J399002J028595L78112J547966
$$ 434696274 434901161 435966988 436430779 437772675 437758141 439157143 440185738 440563850 442111816
1435D42111816j47132R8991M61540K286530J114654Q63266J136322L7918J344719J41144
$$ 442111816 441964684 442063675 442525215 444811745 445926399 446789665 447925987 447963905 449308624 449449768
1444.7D49449768J089020O22368L85551r35402j187324O95610o43463K32772j251373
$$ 449449768 450538788 451161156 451546707 450611305 449423981 450119591 449476128 449708900 448457527
1453.3D48457527j28937j00174j245994l48969l448524J857757j650924J511001M83361
$$ 448457527 448328590 448228416 446982422 446633453 443184929 445042686 443391762 444902763 445386124
1462D45386124R37042K513351k25372L643227J368408L417320K601776L612023M449424
$$ 445386124 446323166 448836517 448611145 452254372 453622780 457040100 459641876 463253899 467703323
1470.7D67703323L218651Q359146K018166O648292L882294M849053N152511L961678
$$ 467703323 470921974 479281120 481299286 487947578 491829872 496678925 501831436 505793114
1478.4E05793114M935188L193130N109177K785301M248734L798828L139076M344597
$$ 505793114 510728302 513921432 519030609 521815910 526064644 529863472 533002548 537347145
1486.1E37347145K296448M595299K068290M099579J822853L051071L962632J778793
$$ 537347145 539643593 544238892 546307182 550406761 552229614 555280685 559243317 561022110
1493.8E61022110L102837J022644K416191K706299K410621J610947J901741K838554
$$ 561022110 564124947 565147591 567563782 570270081 572680702 574291649 576193390 579031944
1501.6E79031944R22623K917633K091713L507881J545830o222878M299164J584473
$$ 579031944 579954567 582872200 584963913 588471794 590017624 583794746 588093910 589678383
1509.3E89678383L578300J272889J833000L8948J612167K328873M36554K188949k831497
$$ 589678383 593256683 594529572 596362572 596401520 598013687 600342560 600779114 602968063 600136566
1518F00136566L969994L595466J082878p05261j895904L395157J072349N09796L43704
$$ 600136566 604106560 607702026 608784904 608079643 606183739 609578896 610651245 611161041 611504745
1526.6F11504745J905060R62639M77410J700325M47998K367858q00361j887055J758004
$$ 611504745 613409805 614372444 614849854 616550179 616998177 619366035 618565674 616678619 618436623
1535.3F18436623J731529K180290Q40225J013718o601105M786720J217728o43005K633400
$$ 618436623 620168152 622348442 623188667 624202385 617601280 622388000 623605728 622962723 625596123
1544F25596123p06253m32930O16951J154213Q95424n10216j807938P90749K332268
$$ 625596123 624889870 624456940 625073891 626228104 627123528 626613312 624805374 625596123 627928391
1552.7F27928391P17506j997376l87687L326530L862457k263870p086029l822861N070496
$$ 627928391 628645897 626648521 626260834 629587364 633449821 631185951 624099922 620277061 625347557
1561.4F25347557J391831M14505J05819j213531m80881J221J433639M25301l915978
$$ 625347557 626739388 627153893 627259712 626046181 625565300 625566521 627000160 627425461 623509483
1570F23509483Q4572M68483o73866o12869J223106Q81042n880813l30391O59828k67067
$$ 623509483 623594055 624062538 623388672 622775803 623998909 624879951 618999138 618668747 619328575 619061508
1579.7F19061508l03230n99213p64122r44443r79118q38623j092834j225090r91326
$$ 619061508 618758278 618159065 617394943 616450500 615471382 614632759 613539925 612314835 611323509
1588.4F11323509o46019j078224j184730j061135q41255j362648j568337j090736j951828
$$ 611323509 610677490 609599266 608414536 607353401 606512146 605149498 603581161 602490425 600538597
1597F00538597j651878j464958j425591j877975j678696j223793j970520j461792j456833
$$ 600538597 598886719 597421761 595996170 594118195 592439499 591215706 589245186 587783394 586326561
1605.7E86326561j401291k557373j781845j810913k887573j429787k321472k017632
$$ 586326561 584925270 582367897 580586052 578775139 575887566 574457779 572136307 570118675
1613.4E70118675j976852l3875o62765q967552n44587n89447p49511k020569j068192
$$ 570118675 568141823 568107948 567445183 558477631 557933044 557343597 556594086 554573517 553505325
1622.1E53505325j791763m145699o83708j062317K97661k179680k625274j274376j245461
$$ 553505325 551713562 547567863 546884155 545821838 546119499 543939819 541314545 540040169 538794708
1630.8E38794708p88688j021614R29451O06727k802086l386078K72866p2708J16157
$$ 538794708 538006020 536984406 537913857 538520584 535718498 532332420 532605286 532532578 532648735
1639.5E32648735K48985o85043J145592k556J451073J426315j757164R52377J14899
$$ 532648735 532897720 532212677 533358269 533355713 534806786 536233101 534475937 535428314 535543213
1648.1E35543213K223701J562386K942009K977943k205810m153710L876877L966980
$$ 535543213 537766914 539329300 542271309 545249252 543043442 538889732 542766609 546733589
1655.9E46733589J761246J610718J096191J888313K138672K518730K491684k7732K609252
$$ 546733589 548494835 550105553 551201744 553090057 555228729 557747459 560239143 560211411 562820663
1664.5E62820663K025643K363167L045807K756729J048393J994438L923988J807023
$$ 562820663 564846306 567209473 570255280 573012009 574060402 576054840 579978828 581785851
1672.3E81785851L053741L431740J896667J162644L177414L244438L086090L448868
$$ 581785851 584839592 588271332 590167999 591330643 594508057 597752495 600838585 604287453
1680F04287453J959152L755684M523315K255287j960792M729538N047645L496819K677078
$$ 604287453 606246605 610002289 614525604 616780891 614820099 619549637 624597282 628094101 630771179
1688.6F30771179K723503K322235K370453L091545K995606L630066L237304j761550
$$ 630771179 633494682 635816917 638187370 641278915 644274521 647904587 651141891 649380341
1696.4F49380341L737640L953628M984284K528534m863968L925858L321380K583695
$$ 649380341 653117981 657071609 662055893 664584427 659720459 663646317 666967697 669551392
1704.1F69551392J076278J662064j30615Q98132K057648J265411N51910Q22678J759949
$$ 669551392 670627670 672289734 672159119 673057251 675114899 676380310 676932220 677754898 679514847
1712.8F79514847J420364N05676M94080K963181L70483n798187L672714K394485J319352
$$ 679514847 680935211 681440887 681934967 684898148 685268631 679470444 683143158 685537643 686856995
1721.4F86856995Q54416K02178m73709J45798R78012R01032J191559R96093k87780
$$ 686856995 687711411 687913589 687439880 687585678 688563690 689464722 690656281 691652374 691364594
1730.1F91364594K30407L207703L443756k188797m560547K136307K532959P95135J512146
$$ 691364594 691595001 694802704 698246460 696057663 691497116 693633423 696166382 696961517 698473663
1738.8F98473663j37176j106339K944336J529999M38995M93164J770249J667938P54318
$$ 698473663 698336487 697230148 700174484 701704483 702143478 702636642 704406891 706074829 706829147
1747.5G06829147J440277M81720K443238J24435P2937K809525J679306K264785K437745
$$ 706829147 708269424 708751144 711194382 711318817 711391754 714201279 715880585 718145370 720583115
1756.2G20583115M21371N62897J403885J338424K197113n13458k80990K584381J174698
$$ 720583115 721004486 721567383 722971268 724309692 726506805 725993347 725712357 728296738 729471436
1764.8G29471436J058807J378403J331710n95932J259690K891464O52466j525269j794967
$$ 729471436 730530243 731908646 733240356 732644424 733904114 736795578 737448044 735922775 734127808
1773.5G34127808K742996J414642o07834J393280O72150J198196K94495k38953O06232
$$ 734127808 736870804 738285446 737677612 739070892 739743042 740941238 741235733 740996780 741603012
1782.2G41603012R08814R65042n34745J45874R69620J050492K60238J028900J038208
$$ 741603012 742511826 743476868 742942123 743087997 744057617 745108109 745368347 746397247 747435455
1790.9G47435455m17556j654358j47858K980957N46265p76520R88312J149521M20150
$$ 747435455 747017899 745363541 745215683 748196640 748742905 747966385 748954697 750104218 750524368
1799.5G50524368o51703J159592n93338r0027J090164P29599R94416m2496K50473Q29697
$$ 750524368 749872665 751032257 750438919 750348892 751439056 752168655 753163071 753120575 753371048 754200745
1809.2G54200745P67364j001053m1122R14459J72196N25894J2283Q55713K45590j17645
$$ 754200745 754968109 753967056 753925934 754840393 755012589 755538483 755550766 756406479 756652069 756534424
1818.8G56534424J60217l7842Q98133K21634Q13903L73383j724930P6141J566849J858826
$$ 756534424 756694641 756656799 757554932 757776566 758590469 758963852 757238922 757315063 758881912 760740738
1828.5G60740738M51889k494812j14746J661529L14560K72904J07040m4555L32717
$$ 760740738 761192627 758697815 758583069 760244598 760559158 760832062 760939102 760894547 761227264
1837.2G61227264n37796O29883J03607J3428N05219J416244Q11157l938064J016922
$$ 761227264 760689468 761319351 761422958 761436386 761941605 763357849 764169006 760230942 761247864
1845.8G61247864J312256M9133l35693P6065L13873j74484N75637o8664L70178K00195
$$ 761247864 762560120 762609253 762273560 762349625 762663498 762489014 763064651 762995987 763366165 763566360
1855.5G63566360J84708J73874n50385L96882j64109R2011j26496L75977M96674P4920
$$ 763566360 763751068 763924942 763374557 763771439 763607330 763699341 763572845 763948822 764445496 764520416
1865.1G64520416Q44803k70767M64859j026383j066589R07822K38342K50931N6457
$$ 764520416 765365219 765094452 765559311 764532928 763466339 764374161 764612503 764863434 764919891
1873.8G64919891M61884k02332J85700L84750L43552O67572j83258q0109n66635M05273
$$ 764919891 765381775 765179443 765365143 765749893 766093445 766761017 766577759 766497650 765931015 766336288
1883.4G66336288L15629j49613K34985N8442J414642L53317j008224q9646J65406J08566
$$ 766336288 766651917 766502304 766737289 766795731 768210373 768563690 767555466 767465820 767631226 767739792
1893.1G67739792M14200K36664o87180L79257L43781L31344k02331l89405M76304K34832
$$ 767739792 768153992 768390656 767703476 768082733 768426514 768757858 768555527 768166122 768642426 768877258
1902.7G68877258M07715k4261K42157k28653l29666L18679R0561J01166l30810M04891
$$ 768877258 769284973 769260712 769502869 769274216 768944550 769263229 769353790 769454956 769124146 769529037
1912.4G69529037k92892q1482K16751j4419O45752j510392k33459R32083Q19855O45065
$$ 769529037 769236145 769154663 769371414 769356995 770002747 768492355 768258896 769190979 770010834 770655899
1922G70655899r75265l94135O09970L36685n69687K94800K27661k17819K09198j03378
$$ 770655899 769680634 769286499 769896469 770233154 769663467 769958267 770185928 769968109 770177307 770073929
1931.7G70073929M9743n17578K92893M27475J76163m2573p52258K57263M15879P77588
$$ 770073929 770123672 769606094 769898987 770326462 770502625 770460052 769707794 769965057 770380936 771158524
1941.3G71158524m91105j419372M81872M78745L08380J31073K77710l45840j42136
$$ 771158524 770667419 769248047 769729919 770208664 770517044 770648117 770925827 770579987 770437851
1950G70437851K02103L9520J87454k41547M5548J09482L52325J72043K66876J86615
$$ 770437851 770639954 770679474 770866928 770625381 770670929 770780411 771132736 771304779 771571655 771758270
1959.6G71758270j30691L76968l32489l70560l71170M4556K45667j43662L12119L52096
$$ 771758270 771627579 772004547 771672058 771301498 770930328 770974884 771220551 771076889 771389008 771741104
1969.3G71741104P35474N1269K42844K16675l19596p4157m64630j43662k87247J44654
$$ 771741104 772476578 772527847 772770691 772987366 772667770 772593613 772128983 771985321 771698074 771842728
1978.9G71842728K24304K79770M93774k3651K92893j06049J0986k50702j46026k52915
$$ 771842728 772067032 772346802 772840576 772816925 773109818 773003769 773014755 772764053 772618027 772365112
1988.6G72365112p71026N34439M91562m3640k29645N11169O53305J17951Q5220n79834
$$ 772365112 771594086 772128525 772620087 772576447 772346802 772857971 773511276 773629227 773714447 773134613
1998.2G73134613k80609o49872o27747j56860N7526K48413M7150N60684O6070M0436
$$ 773134613 772854004 772204132 771576385 771419525 771477051 771725464 771772614 772333298 772399368 772439804
2007.8G72439804K3575l44238o44150p86133J2817k34680K0447M01459K42920k01874
$$ 772439804 772463379 772119141 771474991 770688858 770701675 770466995 770487442 770888901 771131821 770929947
2017.5G70929947j52283K18430k14005k02713q25729q50754p01599l77655o638l44696
$$ 770929947 770777664 770996094 770782089 770579376 769753647 768902893 768201294 767823639 767817001 767472305
2027.1G67472305N6458N493N16129L73230k06605l93600o06232l09372o58493l66592
$$ 767472305 767528763 767534256 768050385 768423615 768217010 767823410 767217178 766907806 766249313 765882721
2036.8G65882721k93350k83661l06931L4790L57666M7913O77261j63421m28086m73098
$$ 765882721 765589371 765305710 764998779 765033569 765391235 765439148 766116409 765952988 765524902 765051804
2046.4G65051804n62058j19553p21588l68194n0507P34635M20227j64719J44882P5379
$$ 765051804 764489746 764370193 763648605 763280411 763229904 763964539 764384766 764220047 764364929 764440308
2056.1G64440308O05316j24130m84162p13348m82636J13297J37100N18341J8768M25187
$$ 764440308 765045624 764921494 764437332 763723984 763241348 763354645 763491745 764010086 764028854 764454041
2065.7G64454041L55987R7351J24054k85339l82538k58942L01438l63846j19629m58
$$ 764454041 764810028 764907379 765031433 764746094 764363556 764104614 764406052 764042206 763922577 763922119
2075.4G63922119n8822N11474N5084J47705l08609j9073L04871J73873k8686m55704
$$ 763922119 763863297 764374771 764429855 764577560 764268951 764249878 764554749 764728622 764699936 764244232
2085G64244232J17340M3106J56174r92L92838L17001m64935M1046j0147M5395l51105
$$ 764244232 764361572 764404678 764560852 764559860 764952698 765269699 764804764 764845810 764835663 764881058 764529953
2095.6G64529953J29318L17383l18985j2054J12686O34231j03454n02548k9526K37808
$$ 764529953 764659271 764976654 764657669 764645615 764758301 765392532 765289078 764786530 764757004 764994812
2105.2G64994812J27258q39M78745l4028K90604J56860k09426o3324P8048K31552n59463
$$ 764994812 765122070 765121231 765599976 765565948 765856552 766013412 765803986 765740662 765818710 766050262 765490799
2115.9G65490799J80893L07922J526m5624j72729J03149j68457M26941K04697L18374
$$ 765490799 765671692 765979614 765981140 765935516 765762787 765865936 765697479 766124420 766329117 766647491
2125.5G66647491J30768m45251j33972m13208p3471k04850J58234K19040K31018M04739
$$ 766647491 766778259 766333008 766199036 765785828 765712357 765507507 765665741 765884781 766115799 766520538
2135.1G66520538l34625N8670p6980J0223J12457J59073J04828l72314n35j34353P6370
$$ 766520538 766185913 766244583 766167603 766177826 766290283 766449356 766554184 766181870 766181335 766046982 766123352
2145.8G66123352K67410K58942k06604j11694J76391l18908L55835K11639K96326j33515
$$ 766123352 766390762 766649704 766443100 766331406 766507797 766188889 766544724 766756363 767052689 766919174
2155.4G66919174o76498K28195M49600M19388j91345K98614N40695l3264k8839K2660
$$ 766919174 766242676 766470871 766920471 767339859 767148514 767447128 767987823 767954559 767925720 767948380
2165G67948380K76947R8800L28217M8828K50473J63269l06397K72828N30090Q53653
$$ 767948380 768225327 768324127 768652344 768701172 768951645 769114914 768808517 769081345 769611435 770465088
2174.7G70465088j11313j25504L81165j6556M3259O5918N61066K05993M25110M04053
$$ 770465088 770353775 770228271 770609436 770592880 770636139 770702057 771263123 771469116 771894226 772298279
2184.3G72298279p6370K32925O3171J09940J75171N17883M71344N77164o2637p52869
$$ 772298279 772221909 772454834 772518005 772627945 772803116 773320999 773792343 774369507 774306870 773554001
2194G73554001j63574K28729P52487l2425L13187O63147o1569k3575j10398M93012
$$ 773554001 773390427 773619156 774371643 774339218 774652405 775315552 775253983 775230408 775120010 775613022
2203.6G75613022j87454l281M26865j80283J93176M12445O93970J00861K74810O28586
$$ 775613022 775425568 775422287 775849152 775668869 775862045 776274490 776968460 777069321 777344131 777972717
2213.3G77972717K52533j21536k19574M65851j67694l09220J11542K28653M08859O29578
$$ 777972717 778225250 778103714 777884140 778349991 778182297 777873077 777984619 778213272 778622131 779251709
2222.9G79251709J96381m93546M20227J61667j91803J68533L86200j09482q12377K21557
$$ 779251709 779448090 778954544 779374771 779536438 779344635 779513168 779899368 779789886 778977509 779199066
2232.5G79199066K12021K15454K23847K37732N29403j449K82440K23388n5847m76608
$$ 779199066 779411087 779626541 779850388 780088120 780617523 780616074 780898514 781121902 781066055 780589447
2242.2G80589447q0414J00632K5253N11933o8741J84021k9373K04544M86068p6370
$$ 780589447 780509033 780609665 780634918 781146851 781078110 781262131 781232758 781437302 781923370 781847000
2251.8G81847000M2191j4878K76337k57187p7743l4256L5476N08347q1177K52915j32828
$$ 781847000 781889191 781874313 782150650 781893463 781815720 781781464 781816940 782325287 782244110 782497025 782364197
2262.4G82364197K4948K00272J02386L17688k41394P706n0126j18103l20816L64914
$$ 782364197 782389145 782589417 782691803 783009491 782768097 782775803 782725677 782607574 782286758 782651672
2272.1G82651672O18668k441K96249M7455L23105j12381m8066J48926j09176Q8806
$$ 782651672 783270340 783267899 783564148 783611603 783934708 783822327 783774261 783923187 783814011 783902817
2281.7G83902817l91617J99585N8823j28403n0507R5444K40784k4186N97840J28555
$$ 783902817 783511200 783710785 783769608 783641205 783590698 783686142 783926926 783902740 784500580 784629135
2291.4G84629135L11585j75324p16095l46222m28009O90766K62756J91116M05960M00772
$$ 784629135 784940720 784765396 784049301 783703079 783275070 783965836 784228592 784419708 784825668 785226440
2301G85226440J23063n96009O23169M29764j74713o57501n23377K82669l6010l23258
$$ 785226440 785349503 784753494 785376663 785806427 785631714 784974213 784450836 784733505 784697495 784374237
2310.7G84374237m96216Q26035P60727L24630K82135j15356L59344o7214l76206r16672
$$ 784374237 783878021 784704056 785464783 785789413 786071548 785956192 786315536 786248322 785872116 784955444
2320.3G84955444Q1559Q30001L05558k60620j128159N36575J116486L1280j235885
$$ 784955444 785037003 785867004 786172562 785911942 784783783 785320358 786436844 786468124 785232239
2329G85232239n44434N09796J27716J06659q56170P2326O81610J83258m08401M12674
$$ 785232239 784687805 785197601 785325317 785431976 784575806 784648132 785329742 785513000 785104599 785517273
2338.6G85517273O18057m62265L03116p52411K58713q0185k199707j142807p5302L93448
$$ 785517273 786135330 785673065 785976181 785223770 785482483 785402298 783202591 782059784 781984482 782377930
2348.3G82377930J96228O70623M59595J043244J163940n42831q46482j039123O68335
$$ 782377930 782574158 783244781 783704376 784747620 785911560 785368729 784522247 783483124 784151459
2356.9G84151459j281510j358413j44272o05316J345901j16348J71509N04303k52991
$$ 784151459 782869949 781511536 781367264 780761948 782107849 781991501 782163010 782667313 782414322
2365.6G82414322j767426p38983J098862o46668k09350N7297p782l28522j79901l17307
$$ 782414322 780646896 779907913 781006775 780360107 780150757 780208054 780200272 779871750 779691849 779374542
2375.3G79374542j018753R4376L06930l55682q23669m99039m33045m90112l62854l07693
$$ 779374542 778355789 778450165 778757095 778401413 777577744 777078705 776645660 776155548 775792694 775485001
2384.9G75485001L88412M41132L62320l56827l66516o9504n01556p0496p10449n72434
$$ 775485001 775873413 776314545 776676865 776320038 775953522 775884018 775382462 775311966 774601517 774029083
2394.6G74029083o9122j4649M60663J14136l50189m79508L00446R6893k10952j23520
$$ 774029083 773959961 773945312 774405975 774520111 774169922 773690414 773990860 774087753 773876801 773753281
2404.2G73753281p83921p71560m35486L2577o4621r1323k30027J4878K42004l84979
$$ 773753281 772969360 772197800 771762314 771794891 771730270 771638947 771408920 771423798 771665802 771280823
2413.8G71280823k05002o10352o85272m38690j65253j55105n77545j64261l32184M4555
$$ 771280823 771075821 770465469 769780197 769341507 769176254 769021149 768443604 768279343 767947159 767991714
2423.5G67991714m5089k36664R5062l16467o27136r86481k47421j09558n76477n97458
$$ 767991714 767946625 767709961 767805023 767488556 766861420 765874939 765627518 765517960 764941483 764344025
2433.1G64344025j77460J92184n25665m17786m80041k61078k62222o60324l70407m99802
$$ 764344025 764166565 764358749 763833084 763415298 762935257 762674179 762411957 761751633 761381226 760881424
2442.8G60881424l2349k65197n74646l45383k31171m00238o57577n2262j16882j29852
$$ 760881424 760849075 760583878 760009232 759663849 759432678 759032440 758374863 758322601 758205719 758075867
2452.4G58075867k61154n30625n48324m16794k53907p26699l52173l34625k52762j77536
$$ 758075867 757814713 757284088 756735764 756318970 756065063 755338364 754986191 754651566 754398804 754221268
2462.1G54221268m88663l8300n8364k48414n08956k64206l25699k46964k5940o93741
$$ 754221268 753732605 753694305 753635941 753387527 752878571 752614365 752288666 752041702 752015762 751322021
2471.7G51322021m49600k56729l09524o57654p79419n93949k46276M92248K15225m6615
$$ 751322021 750872421 750615692 750306168 749648514 748869095 748275146 748028870 748521118 748736343 748689728
2481.3G48689728n04608l84064k96326m86679n5771k91900k35367o44455m18167L2272
$$ 748689728 748185120 747801056 747504730 747018051 746962280 746670380 746435013 745790558 745372391 745404663
2491G45404663o4163J49155k46354l94897q80508m38691J12763j05591j80512l70101
$$ 745404663 745340500 745489655 745243301 744848404 743967896 743529205 743641968 743536377 743355865 742985764
2500.6G42985764M08248L14103m90113p31201r9563Q6288l63998m8829l80859k39563
$$ 742985764 743394012 743708115 743218002 742486801 742387238 742473526 742109528 742060699 741679840 741440277
2510.3G41440277l09601n40237j6022J87302M1580m11224j85624j46865o1799p0190
$$ 741440277 741130676 740590439 740574417 740761719 740803299 740392075 740206451 740059586 739997787 739927597
2519.9G39927597l95431p47757q28858l0975l53394k88162Q0566P9270J22757o09055
$$ 739927597 739532166 738784409 737955551 737924576 737571182 737283020 737363586 737442856 737565613 736956558
2529.6G36956558l74450j17646l28979o39191o84967m13208n00259j71814m2267j1521
$$ 736956558 736582108 736464462 736135483 735496292 734811325 734398117 733897858 733726044 733683777 733672256
2539.2G33672256J05820k08282q64792p37000m28238o13861k26135O3934j85775j057663
$$ 733672256 733778076 733569794 732705002 731968002 731539764 730925903 730699768 730763702 730577927 729520264
2548.9G29520264o01960J38779l48816j96075p2174n9738o06080o57348k48337m45557
$$ 729520264 728918304 729057083 728708267 728512192 728440018 728380280 727774200 727116852 726868515 726422958
2558.5G26422958o99463q99505p0648R3689J42517Q7738m64630j52970m57153q48770
$$ 726422958 725723495 724823990 724753342 724847031 724989548 725077286 724612656 724459686 724002533 723153763
2568.1G23153763q68530l28064k21100o88858l33252N1651P4920k01492k22473n96619
$$ 723153763 722285233 721957169 721736069 721047211 720713959 720765610 720840530 720639038 720416565 719819946
2577.8G19819946n00641l35769o85349l54080n03693m39529l08990l04718k49024j11236
$$ 719819946 719319305 718983536 718298187 717944107 717440414 717000885 716691895 716387177 716138153 716026917
2587.4G16026917K75726j62506p05262o25076J68686q4610o76422n05676k66724J13144
$$ 716026917 716302643 716140137 715434875 714809799 714978485 714893875 714217453 713711777 713445053 713558197
2597.1G13558197l72314k89307k94952l33329l0670l23563j60140l18604k65121k20795
$$ 713558197 713185883 712896576 712601624 712268295 712237625 711914062 711753922 711435318 711170197 710949402
2606.7G10949402j65634n30777j010514m80346m02680r4909k19117m77371o05087o09512
$$ 710949402 710783768 710252991 709242477 708762131 708359451 708264542 708045425 707568054 706962967 706353455
2616.4G06353455l33252n05219j81503o35681m61502k14539q98895n47028m48837p66907
$$ 706353455 706020203 705514984 705333481 704697800 704236298 704021759 703122864 702575836 702126999 701360092
2626G01360092p47299j47934n66940r70917o82373p66602l24249m31900l17993p24182
$$ 701360092 700612793 700464859 699897919 698927002 698244629 697478027 697153778 696721878 696403885 695679703
2635.6F95679703j339646p58514k88620k69012n59540m60739j001664q28704l05329
$$ 695679703 694340057 693581543 693292923 693023911 692464371 692003632 691001968 690173264 689867935
2644.3F89867935q34198p48901p88574o30112k87476k06146p14035r31854o33621p64237
$$ 689867935 689033737 688284836 687496262 686866150 686578674 686372528 685658493 684726639 684093018 683328781
2654F83328781l62854n63202n99823l08227p02744j128692j094819m17175m59061n68389
$$ 683328781 682965927 682402725 681802902 681494675 680791931 679663239 678568420 678151245 677692184 677123795
2663.6F77123795n57862o38428m54177k96479l21121k86712j83869j103973j159363
$$ 677123795 676565933 675927505 675473328 675176849 674855728 674569016 674385147 673281174 672121811
2672.3F72121811n32608l76892k95334l09448j12381o52695m19617j82266n27954m56467
$$ 672121811 671589203 671212311 670916977 670607529 670495148 669842453 669422836 669240570 668712616 668256149
2681.9F68256149p22580q10547r29107m83093n65644m91409m1199p12738l29132J526
$$ 668256149 667533569 666723022 665793915 665310822 664745178 664253769 664212570 663499832 663170700 663172226
2691.6F63172226l79334m66461m93545r01947j106262n99595o42624o65740n06669
$$ 663172226 662792892 662326431 661832886 660930939 659824677 659225082 658582458 657916718 657410049
2700.3F57410049j84936j94550l25622m69284j088105o78100n47791p91015m89273
$$ 657410049 657225113 657030563 656704941 656235657 655147552 654469452 653921661 653130646 652641373
2708.9F52641373l33405p75070r68933j86539l11050o14853n88837n30701l97949n57632
$$ 652641373 652307968 651532898 650563965 650377426 650066376 649451523 648862686 648331985 647934036 647376404
2718.6F47376404n04532n99670m54712n22995m32053j51062l75366n05600q42972o60782
$$ 647376404 646871872 646272202 645817490 645294495 644862442 644711380 644336014 643830414 642987442 642326660
2728.2F42326660m20914n07049j73493j3122o36215r41277k95219M577p3394n46685
$$ 642326660 641905746 641398697 641225204 641212082 640575867 639634590 639339371 639343948 639270554 638723869
2737.9F38723869m38881l9672o34728p47414l92799l27110m52385m30908l47901l39966
$$ 638723869 638284988 638245316 637610588 636863174 636470375 636143265 635690880 635259972 634912071 634572105
2747.5F34572105m78859k33116K23580k34452o14929r50699p59391l47519m81415l04604
$$ 634572105 634093246 633860130 634083710 633849258 633234329 632283630 631524239 631176720 630695305 630390701
2757.2F30390701k77710j65138l62778j02462N8899n32265m01840n81131n65186j42708
$$ 630390701 630112991 629947853 629585075 629482613 629541512 629009247 628607407 628026276 627461090 627318382
2766.8F27318382m6272m74548p27196j10970L95127k9869r02100n54581n37033m60891
$$ 627318382 627272110 626797562 626070366 625959396 626354523 626324654 625422554 624867973 624330940 623870049
2776.4F23870049j62888r97429r69353o13479l12500l34702j63765j4915p29027q37593
$$ 623870049 623707161 622709732 621740379 621126900 620814400 620479698 620315933 620301018 619571991 618734398
2786.1F18734398o78101l43437q90999r26475k57607p01675p10182q41103r80682q96950
$$ 618734398 618056297 617712860 616821861 615895386 615637779 614936104 614225922 613384819 612404137 611507187
2795.7F11507187m03519k0828p59125j433525j263313o79817j020737q78143n46036
$$ 611507187 611103668 611082840 610323715 608890190 607626877 606947060 605926323 605048180 604502144
2804.4F04502144r39369j084748q95462o64406j267509j195831j025238j034050r75151
$$ 604502144 603562775 602478027 601582565 600918159 599650650 598454819 597429581 596395531 595420380
2813.1E95420380j449013j228638j025123n46837p97539j300926j145172j641922j370392
$$ 595420380 593971367 592742729 591717606 591170769 590373230 589072304 587927132 586285210 584914818
2821.8E84914818q63266j098366j610069j404991j013871j242561j539116j473274
$$ 584914818 584051552 582953186 581343117 579938126 578924255 577681694 576142578 574669304
2829.5E74669304q11882j207619j546821j387063j582145j543732j460686j349296
$$ 574669304 573857422 572649803 571102982 569715919 568133774 566590042 565129356 563780060
2837.2E63780060j800995j761208j824569k055664j739960j827240j725273k051888
$$ 563780060 561979065 560217857 558393288 556337624 554597664 552770424 551045151 548993263
2844.9E48993263k322159k071914j956368k432518k565918k042083k195359j771049
$$ 548993263 546671104 544599190 542642822 540210304 537644386 535602303 533406944 531635895
2852.6E31635895j551285j586952j264878j257400j457710j621666r58329j020698
$$ 531635895 530084610 528497658 527232780 525975380 524517670 522896004 521937675 520916977
2860.3E20916977j420784j404419j435585j997681k260666j398849k066460k518959
$$ 520916977 519496193 518091774 516656189 514658508 512397842 510998993 508932533 506413574
2868.1E06413574k503433k615013k073822k706528k765808k281532k299652k552529
$$ 506413574 503910141 501295128 499221306 496514778 493748970 491467438 489167786 486615257
2875.8D86615257k704849k642288k719574k450524k321968j838722j418648j357650
$$ 486615257 483910408 481268120 478548546 476098022 473776054 471937332 470518684 469161034
2883.5D69161034j665421j812286j424179j343766m83932l69110o52352q18939r07974
$$ 469161034 467495613 465683327 464259148 462915382 462431450 462062340 461409988 460591049 459683075
2892.2D59683075J29166j16845m60815k03400j14059l31230n77965m72527o18133j00594
$$ 459683075 459812241 459695396 459234581 459031181 458917122 458585892 458007927 457535400 456917267 456816673
2901.8D56816673p21969j005211l44277o66580o97861j019630j136780j295929j127243
$$ 456816673 456094704 455089493 454745216 454078636 453380775 452361145 451224365 449928436 448801193
2910.5D48801193r39102j308823j179351j847649k476273k367744j941376j858101
$$ 448801193 447862091 446553268 445373917 443526268 441049995 438682251 436740875 434882774
2918.2D34882774j842956j879997k118798j597366j639748j060066j032829j512184
$$ 434882774 433039818 431159821 429041023 427443657 425803909 424743843 423711014 422198830
2925.9D22198830q13942q66280l64380L0594L02086M31976J64032R54361J381989J549721
$$ 422198830 421384888 420518608 420154228 420184822 420486908 420918884 421082916 422037277 423419266 424968987
2935.6D24968987J597824J923866K254791J909523K232742K790146K976113K938690
$$ 424968987 426566811 428490677 430745468 432654991 434887733 437677879 440653992 443592682
2943.3D43592682K765350K909661L190116K932549K862549L067589L058433L030739
$$ 443592682 446358032 449267693 452457809 455390358 458252907 461320496 464378929 467409668
2951D67409668K723083K573243K817993L011932K882500L048706L136711L047752K789116
$$ 467409668 470132751 472705994 475523987 478535919 481418419 484467125 487603836 490651588 493440704
2959.7D93440704K345696K533302K282448K643585K850304K278671K468414K408715
$$ 493440704 495786400 498319702 500602150 503245735 506096039 508374710 510843124 513251839
2967.4E13251839K267570J850510K031212K157440K011375K393532K230225K121086
$$ 513251839 515519409 517369919 519401131 521558571 523569946 525963478 528193703 530314789
2975.1E30314789J544838J909141K364807J954689K084694J522942J191406J198426
$$ 530314789 531859627 533768768 536133575 538088264 540172958 541695900 542887306 544085732
2982.8E44085732J657638J815567J398239J423645R81598J181908J400795J012001
$$ 544085732 545743370 547558937 548957176 550380821 551362419 552544327 553945122 554957123
2990.5E54957123Q85734Q58765R10873O71387L69606P65534Q11538k098K35787M01344
$$ 554957123 555842857 556701622 557612495 558283882 558653488 559419022 560230560 560228462 560464249 560865593
3000.2E60865593N6419O3744m501J10778l63578n32265r766J07346m94042o54792k86179
$$ 560865593 560922012 560985756 560981255 561092033 560728455 560196190 560186424 560293770 559799728 559144936 558858757
3010.8E58858757p65915r54628o18935k76184m24156l89862n05333j387863j278801
$$ 558858757 558092842 557138214 556519279 556243095 555818939 555429077 554923744 553535881 552257080
3019.5E52257080r53865o50673q18939r37843p96471j131821j010513j324616j336059
$$ 552257080 551303215 550652542 549833603 548895760 548099289 546967468 545956955 544632339 543296280
3028.1E43296280j370430j255684j000252j108436q67501j546859j490364j445351
$$ 543296280 541925850 540670166 539669914 538561478 537693977 536147118 534656754 533211403
3035.9E33211403j596222j169548j068153p14646j318970j500701j570473j785736
$$ 533211403 531615181 530445633 529377480 528662834 527343864 525843163 524272690 522486954
3043.6E22486954j286202j059456j086959j613312j191559j240006j730995j356697
$$ 522486954 521200752 520141296 519054337 517441025 516249466 515009460 513278465 511921768
3051.3E11921768j509437j571656j449165j235466j604691j702690j418380j510888
$$ 511921768 510412331 508840675 507391510 506156044 504551353 502848663 501430283 499919395
3059D99919395j286773j362496j113319j021195j466293j896629j733589j283265j426582
$$ 499919395 498632622 497270126 496156807 495135612 493669319 491772690 490039101 488755836 487329254
3067.7D87329254j481285j555557j245690j436996j676636j200256j491051j393013
$$ 487329254 485847969 484292412 483046722 481609726 479933090 478732834 477241783 475848770
3075.4D75848770j276092j710244j517105j145515j285248j452255j823960j790466
$$ 475848770 474572678 472862434 471345329 470199814 468914566 467462311 465638351 463847885
3083.1D63847885r03625j273804j711540j393814j196938j007309j367264j654472
$$ 463847885 462944260 461670456 459958916 458565102 457368164 456360855 454993591 453339119
3090.8D53339119j851082j875648j566582j087647j177864j483612j055870j263008
$$ 453339119 451488037 449612389 448045807 446958160 445780296 444296684 443240814 441977806
3098.5D41977806j450729j363220j370202j360283j561889j465340j409683j391907
$$ 441977806 440527077 439163857 437793655 436433372 434871483 433406143 431996460 430604553
3106.2D30604553j383018j126290j250114j590729j264534j109619j314926j551895
$$ 430604553 429221535 428095245 426845131 425254402 423989868 422880249 421565323 420013428
3114D20013428j101151j145210j794663j721916j502342j237984r30862q16460j582412
$$ 420013428 418912277 417767067 415972404 414250488 412748146 411510162 410579300 409762840 408180428
3122.6D08180428j641808j140289j558152j576957j337395j157265r69734p87620j257630
$$ 408180428 406538620 405398331 403840179 402263222 400925827 399768562 398798828 398011208 396753578
3131.3C96753578j537819j510391j651154q82148r50699j223641j423568j399880q78334
$$ 396753578 395215759 393705368 392054214 391172066 390221367 388997726 387574158 386174278 385295944
3140C85295944j382751j327439j299285j194382j052971j176872r76334j455116j274567
$$ 385295944 383913193 382585754 381286469 380092087 379039116 377862244 376885910 375430794 374156227
3148.7C74156227j047096j062470j233673j511116r97848r84574j331672j438179j102181
$$ 374156227 373109131 372046661 370812988 369301872 368304024 367319450 365987778 364549599 363447418
3157.4C63447418r25331p12471n72472j110687j541252j449814q16536j265335j433487
$$ 363447418 362522087 361809616 361237144 360126457 358585205 357135391 356318855 355053520 353620033
3166C53620033p50770q27599j022987j049271q07991j190948j146393p88651r17930
$$ 353620033 352869263 352041664 351018677 349969406 349161415 347970467 346824074 346035423 345117493
3174.7C45117493p31240o55746r10530j507302r54284r74350j499863q29849n60913
$$ 345117493 344386253 343730507 342819977 341312675 340358391 339384041 337884178 337054329 336493416
3183.4C36493416p10945j418343j045723m38995j128121j516952j121903l84903o90002
$$ 336493416 335782471 334364128 333318405 332879410 331751289 330234337 329112434 328727531 328037529
3192.1C28037529j078110j033363p47109n09300n92537q43773j358451q42476p84989
$$ 328037529 326959419 325926056 325178947 324669647 324077110 323233337 321874886 321032410 320247421
3200.8C20247421q68664n31406p51095r57279j106243p12013n72129k97184m88567
$$ 320247421 319378757 318847351 318096256 317138977 316032734 315320721 314748592 314451408 313962841
3209.4C13962841j222610q54454k66438l35293j118183p18040o34366j257553q79306
$$ 313962841 312740231 311885777 311619339 311284046 310165863 309447823 308813457 307555904 306676598
3218.1C06676598o28872o99864r91153n12181n41935q24566n74989n89466l20072p06959
$$ 306676598 306047726 305347862 304356709 303844528 303302593 302478027 301903038 301313572 300993500 300286541
3227.8C00286541n45254o04191j062698n21412k35042l05195q12073q63552r17530
$$ 300286541 299741287 299137096 298074398 297552986 297317944 297012749 296200676 295337124 294419594
3236.4B94419594q94699k57283j90410o76575r34887n23529m27608m22860p50827o88935
$$ 294419594 293524895 293267612 293077202 292400627 291465740 290942211 290514603 290091743 289340916 288651981
3246.1B88651981K0581l87516p89013p34082o56223p25059l06321j01337o77948n91564
$$ 288651981 288672562 288285046 287496033 286761951 286105728 285380669 285074348 284973011 284295063 283703499
3255.7B83703499m37679l63064o76251n20382k71835p65533m88205l92361l96481J4611
$$ 283703499 283265820 282902756 282226505 281706123 281434288 280668755 280180550 279788189 279391708 279406319
3265.4B79406319r2354q89073p83596j41430l89919l60470l68919m29287o72836m80843
$$ 279406319 279313965 278424892 277641296 277499866 277109947 276749477 276380558 275951271 275278435 274797592
3275B74797592J47362k74639o71101p30896n22651n20859m60282k29568j96552j10741
$$ 274797592 274944954 274670315 273999214 273268318 272745667 272224808 271764526 271534958 271338406 271227665
3284.7B71227665o31027n06001k58026l15342j13010k20223k36454l57551m64917m84695
$$ 271227665 270596638 270090637 269832611 269517269 269404259 269184036 268947582 268590031 268125114 267640419
3294.3B67640419r2888k1534k24075l38173j082230o20174Q0948m47006o19908m17576
$$ 267640419 267547531 267525997 267301922 266963749 265881519 265261345 265342293 264895287 264275379 263857803
3303.9B63857803l81984j46561l21331o17790M196M8408k83584o09036r45873m84600
$$ 263857803 263475819 263329258 263007927 262390137 262394333 262442741 262159157 261550121 260604248 260119648
3313.6B60119648p1030O3095K5235k03152r13353q11062k96497o11382k63481k49901
$$ 260119648 260048618 260111713 260136948 259933796 259020443 258209381 257912884 257301502 257038021 256788120
3323.2B56788120l77159l97472p40834m23431p6408l08934p21302j86252p1297o30970
$$ 256788120 256410961 256013489 255272655 254849224 254772816 254463882 253742580 253556328 253485031 252854061
3332.9B52854061n70450o42185n44510l32031r4223J71299n0202n60913o27136p34291
$$ 252854061 252283611 251641426 251096916 250764885 250670662 250841961 250791759 250230846 249603710 248869419
3342.5B48869419o72703O8627j22643o77204q63419l58276K98119l36972p19146m03424
$$ 248869419 248196716 248265343 248142700 247465496 246602077 246243801 246541920 246204948 245485802 245082378
3352.2B45082378L1052J05000l79048p02915o54717o02684o02169k65770J48240K42595
$$ 245082378 245113430 245218430 244839382 244136467 243481750 242879066 242276897 242011127 242159367 242401962
3361.8B42401962p95078j023426j38512n41954o06041k5520j62067p09401m18796Q1749
$$ 242401962 241606884 240583458 240444946 239902992 239296951 239271431 239109364 238399963 237981167 238062916
3371.4B38062916l19004k88201L8281N0220k76909m66823l37048r9468m73595q36372
$$ 238062916 237743912 237455711 237493992 237544212 237267303 236800480 236463432 236363964 235890369 235053997
3381.1B35053997j61209l74489p4329L31688n27554n90305k80209n0525o18001k55489
$$ 235053997 234892788 234518299 234443970 234775658 234248104 233657799 233377590 233327065 232709064 232453575
3390.7B32453575O13213k77958n97534p0191L94554K51217l37963n09338k83757J99032
$$ 232453575 233066788 232788830 232191296 232121105 232515659 232766876 232428913 231919575 231635818 231834850
3400.4B31834850J39027l29323m74110M406L29686j20144m17729J76125L48740j19915
$$ 231834850 231973877 231644554 231170444 231174850 231504536 231384392 230966663 231142788 231491528 231371613
3410B31371613q0891k5730q869j06106N3692j75858l58257L64475K45609j86176k57034
$$ 231371613 231290722 231264992 231256123 231150017 231203709 231027851 230669594 231034069 231279678 231093502 230836468
3420.6B30836468N43785P03316j28346l93391o35871k11068O8798J61572k6398J08013
$$ 230836468 231380253 232083569 231955223 231561832 230925961 230714893 230783691 230945263 230918865 231026878
3430.3B31026878N89180p8716o4239R0599M84562M87384N2433K92454K76947K83623
$$ 231026878 231616058 231537342 231473103 231563702 232048264 232535648 232588081 232880535 233157482 233441105
3439.9B33441105k02103L72830O45446M29211M39358j9837N83363l43227J98288R34105
$$ 233441105 233239002 233611832 234257278 234686489 235125847 235106010 235689373 235346146 235544434 236478539
3449.6B36478539m3412M65775M81262L36094R2430J16348L29037L08819K75860k78073
$$ 236478539 236435127 236900902 237382164 237718258 237810688 237927036 238256073 238564892 238840752 238562679
3459.2B38562679L12615N01289K24094L70732Q61606J079674N39532K05421J69659
$$ 238562679 238875294 239376583 239600677 239971409 240833015 241912689 242452221 242657642 242827301
3467.9B42827301O76212J97583L77006P94907M63142P77168l0822L7212O36749N42755
$$ 242827301 243503513 243701096 244078102 244873009 245336151 246113319 246082497 246119709 246756458 247299213
3477.5B47299213M26712O92559J097984L73879K96268L03192P40471O11095K07139
$$ 247299213 247725925 248418484 249516468 249890347 250186615 250489807 251230278 251841373 252048512
3486.2B52048512P12966K53468P31487P20158M15974P12299M76437O50100Q27942O24371
$$ 252048512 252761478 253014946 253746433 254466591 254882565 255594864 256071301 256721401 257549343 258173714
3495.8B58173714L3207Q99391J424560N90878L21503O40106J057987J21136j76869
$$ 258173714 258206921 259106312 260530872 261121750 261443253 262083359 263141346 263262482 263085613
3504.5B63085613N11608J073132J322613J106720P16266J34068P14245M96368K50130
$$ 263085613 263597221 264670353 265992966 267099686 267815952 267950020 268664265 269160633 269410763
3513.2B69410763P25841Q50506J204758Q30326N79910Q77323L83587L02372J562576
$$ 269410763 270136604 270987110 272191868 273022194 273602104 274479427 274863014 275165386 276727962
3521.9B76727962J203576q278O17771J105575J277962L24688N18704Q31623N30834
$$ 276727962 277931538 277923260 278541031 279646606 280924568 281249256 281767960 282599583 283130417
3530.6B83130417Q23498J009693J501312P52487J229305R13296q77J119556P39174
$$ 283130417 283953915 284963608 286464920 287217407 288446712 289360008 289359131 290478687 291217861
3539.2B91217861Q87509O55975J442394J787090M34590K11315P87201K089500K60697
$$ 291217861 292105370 292761345 294203739 295990829 296425419 296636734 297423935 299513435 299774132
3547.9B99774132P55329J343956J393814J926785p32613J327305J931915J206093J420097
$$ 299774132 300529461 301873417 303267231 305194016 304461403 305788708 307720623 308926716 310346813
3556.6C10346813J197186K473468J393433P58381O36692K347088J988258O53916M032516
$$ 310346813 311543999 314017467 315410900 316169281 316805973 319153061 321141319 321795235 325827751
3565.3C25827751Q46443n07621J009025k58331K536125K066383J814270J527100K107964
$$ 325827751 326674194 326166573 327175598 326917267 329453392 331519775 333334045 334861145 336969109
3574C36969109J787262J425209J965828P97882K364120J748200J234359K151375K107735
$$ 336969109 338756371 340181580 342147408 342945290 345309410 347057610 348291969 350443344 352551079
3582.6C52551079K333221J434326L569222K335625j48774K211419N71289L066330L159484
$$ 352551079 354884300 356318626 359887848 362223473 362074699 364286118 364857407 367923737 371083221
3591.3C71083221K693596J850968K068939L697319o84586K022820L378830J677284
$$ 371083221 373776817 375627785 377696724 381394043 380709457 382732277 386111107 387788391
3599C87788391L692207J168023J182556K435341K148628K906456L623657L255768k03362
$$ 387788391 391480598 392648621 393831177 396266518 398415146 401321602 404945259 408201027 407997665
3607.7D07997665L110733N08423N89905P346840J603165p33490M384155Q6975M006767
$$ 407997665 411108398 411616821 412206726 419553566 421156731 420423241 424807396 424894371 428901138
3616.4D28901138M607086J007424K492561n00526J782379M412498K485428K144051
$$ 428901138 433508224 434515648 437008209 436507683 438290062 442702560 445187988 447332039
3624.1D47332039K875328K658653L721962O429329j372147q168029N347824N079574
$$ 447332039 450207367 452866020 456587982 463017311 461645164 453477135 458824959 463904533
3631.8D63904533N348816J658402j454506K821960L898392L162270R07821J329727
$$ 463904533 469253349 470911751 469457245 472279205 476177597 479339867 480247688 481577415
3639.5D81577415K775345K980500K079963J266060K706833M195862O363296k72674
$$ 481577415 484352760 487333260 489413223 490679283 493386116 497581978 503945274 503672600
3647.3E03672600k670632O745377q39157n368996J090355P123146N070801M060364
$$ 503672600 501001968 507747345 506908188 501539192 502629547 509752693 514823494 518883858
3655E18883858M144134p606315K982788N868110J715813J862221Q83026K383804J356774
$$ 518883858 523027992 515421677 518404465 524272575 525988388 527850609 528733635 531117439 532474213
3663.6E32474213J863250K747727J570282N022621L916130L36647k30865o889916L273163
$$ 532474213 534337463 537085190 538655472 543678093 547594223 547930870 547700005 540810089 544083252
3672.3E44083252R713860R913940j933250j9049759M844627Q587837M254990j641693
$$ 544083252 553797112 563711052 561777802 542728043 547572670 556160507 560415497 558773804
3680E58773804J167068K617378J924477K644997J378059J011810M833832O533089q836632
$$ 558773804 559940872 562558250 564482727 567127724 568505783 569517593 574351425 580884514 572047882
3688.7E72047882k356872Q266105o217155P73849O415138J345787J915932J033859
$$ 572047882 569691010 577957115 571739960 572513809 578928947 580274734 582190666 583224525
3696.4E83224525J755R87129J298867L315620K652626m965210j770859M940834K108727
$$ 583224525 583226280 584213409 585512276 588827896 591480522 586515312 584744453 589685287 591794014
3705.1E91794014J277390J247863K729111M460182n784111N099831M292984j4830971
$$ 591794014 593071404 594319267 597048378 601508560 595724449 600824280 605117264 590286293
3712.8E90286293M546509M534302P53555J285934K714005K147064k511520Q33435N365104
$$ 590286293 594832802 599367104 600120659 601406593 604120598 606267662 603756142 604589577 609954681
3721.5F09954681k797851l780327N764465J480828l96309j941147O93321M651337J615829
$$ 609954681 607156830 603376503 609140968 610621796 610225487 608284340 608977661 613628998 615244827
3730.2F15244827N809441l460274p063675J0767746J281853j0846138j205864L179665
$$ 615244827 621054268 617593994 610530319 621298065 622579918 611733780 610527916 613707581
3737.9F13707581J810569L437691L899460l889732M718780J2523689j6025657j3805924
$$ 613707581 615518150 618955841 622855301 618965569 623684349 636208038 620182381 606376457
3745.6F06376457J3067246Q280067O966133n634346j0582733J1229820n942421o212997
$$ 606376457 619443703 627723770 634689903 629055557 618472824 629702644 623760223 617547226
3753.3F17547226N993919N254097L931122n266418K813530N436477r024887j551857
$$ 617547226 623541145 628795242 632726364 627459946 630273476 635709953 626685066 625133209
3761F25133209N026131K240715O74019L785629k743874m614143M035187N270691N64308
$$ 625133209 630159340 632400055 633074074 636859703 634115829 629501686 633536873 638807564 639371872
3769.7F39371872q626518K455978L890038k3919P55692K51579J441765J281242L621521
$$ 639371872 630745354 633201332 637091370 637067451 637823143 638074722 639516487 640797729 644419250
3778.4F44419250j094207r318428L200226L045845J960372K848359l118973p12967
$$ 644419250 643325043 634006615 637206841 640252686 642213058 645061417 641942444 641229477
3786.1F41229477J219482L78571R05456K51770M86145Q75168J568833L26462J724090
$$ 641229477 642448959 642827530 643732986 643984756 644470901 645346069 646914902 647241364 648965454
3794.8F48965454L298645m831467l064041L666916M865875O772156p283859j2077637
$$ 648965454 652264099 647432632 644368591 648035507 652901382 659673538 652389679 640312042
3802.5F40312042M279785L670731N578918N245591j1491547k941437N863114K018432
$$ 640312042 644591827 648262558 653841476 659087067 647595520 644654083 650517197 652535629
3810.2F52535629N86930R63592M83246J644974N830688k827606j4407349O790467P061386
$$ 652535629 653122559 654086151 654569397 656214371 662045059 659217453 644810104 651600571 658661957
3818.9F58661957N504608J364593j9374389K719192O516342L133774K857590o00052
$$ 658661957 664166565 665531158 646156769 648875961 655392303 658526077 661383667 660783615
3826.6F60783615m479065K76642K404404L517990K121506p235260K524871O391449
$$ 660783615 656304550 656581192 658985596 662503586 664625092 657389832 659914703 666306152
3834.3F66306152o322326N94330P986450j0084839k031937R408875n973130q15124
$$ 666306152 659983826 660578156 668564606 658479767 656447830 665856705 659883575 659068451
3842.1F59068451O485825k950211l501816L285065J870804J002884K667541m96445
$$ 659068451 665554276 662604065 659102249 662387314 664258118 665261002 667928543 667432098
3849.8F67432098K400971N682068o447296j719819j7188491N027847J1859360j439438
$$ 667432098 669833069 675515137 669067841 667348022 650159531 655187378 667046738 665607300
3857.5F65607300j655045L317108K585907J753617n357590J446075P584458p007218
$$ 665607300 663952255 667269363 669855270 671608887 666251297 667697372 675281830 668274612
3865.2F68274612n083770M363708N104981P196350q398209r817276M847107P043152
$$ 668274612 663190842 667554550 672659531 679855881 671457672 661640396 666487503 673530655
3872.9F73530655L747635j1460648Q61054M216537j08871K740860M044952o556549
$$ 673530655 677278290 665817642 666678696 670895233 670786362 673527222 677572174 671015625
3880.6F71015625o310196P212601K004089J358490M628754j2607498J585540M989930
$$ 671015625 664705429 671918030 673922119 675280609 679909363 667301865 668887405 673877335
3888.3F73877335J248703L846359j780014r213333J808395M316483j94092J798019
$$ 673877335 675126038 678972397 677192383 667979050 669787445 674103928 673909836 675707855
3896.1F75707855Q62580K161636J223831r682770O370163K310639o014252M571610
$$ 675707855 676570435 678732071 679955902 670273132 676643295 678953934 672939682 677511292
3903.8F77511292m206849j801910J791916J636658K152710m70276j6556J0834N31463
$$ 677511292 673304443 671502533 673294449 674931107 677083817 676613541 676596985 676607819 677139282
3912.5F77139282j50604m94843J684800K197265k455597l137283L815689J6632l101425
$$ 677139282 676988678 676493835 678178635 680375900 677920303 674783020 678598709 678615341 675513916
3921.1F75513916K646561J612625Q55560k703552l157959J944427J687165J291198
$$ 675513916 678160477 679773102 680628662 677925110 674767151 676711578 678398743 679689941
3928.8F79689941r26208K53830K087707l237991j451187J371460L98788R87854L82004
$$ 679689941 678763733 679017563 681105270 677867279 676416092 677787552 678186340 679174194 679556198
3937.5F79556198o78024K63214P14569J747437J079101m604797q01697K252121J348724
$$ 679556198 678878174 679141388 679855957 681603394 682682495 678077698 677276001 679528122 680876846
3946.2F80876846J438675k551956j48773J1673k050934K602310J170578l58276K08587
$$ 680876846 682315521 679763565 679614792 679626465 677575531 680177841 681348419 680990143 681198730
3954.9F81198730J96305L96576o83289l81012p39593O68182P78427r63516N76858Q31604
$$ 681198730 681395035 681791611 681108322 680727310 679987717 680655899 681434326 680470810 681047668 681879272
3964.5F81879272Q1559j3504L46374N79071k90298n76172R85565N02930j537323l22876
$$ 681879272 681960831 681947327 682293701 682872772 682582474 682006302 682991867 683494797 681957474 681634598
3974.2F81634598P71484O19126M8828k47422P0115k07520K33383N38635j00631m24042
$$ 681634598 682406082 683025208 683074036 682826614 682896729 682689209 682922592 683461227 683360596 682936554
3983.8F82936554J22681P2250n493k8153R2774J334457O1722p51572J06583J64108
$$ 682936554 683059235 683131485 683125992 683097839 683190613 684525070 684586792 683835220 683941803 684105911
3993.5F84105911P20291m09698j004334K1820O53458P87125L20892
$$ 684105911 684826202 684416504 683412170 683433990 684087448 684874573 685195465
4000.2F85195465
$$ 685195465
##END=$$ End of the data block
