##TITLE=$$ Begin of the data block
##JCAMP-DX=5.00 $$ ACD/SpecManager v 10.08
##SPECTROMETER/DATA SYSTEM=Varian
##DATE=20 Nov 2012 09:52:52
##DATA TYPE=INFRARED SPECTRUM
##DATA CLASS=XYDATA
##ORIGIN=
##OWNER=
##NPOINTS=3735
##FIRSTX=399.26403809
##LASTX=4000.35498047
##MAXX=4000.35498047
##MINX=399.26403809
##MAXY=78.94551849
##MINY=17.25024796
##XFACTOR=1.0000000000
##YFACTOR=0.000000100000000
##FIRSTY=49.38126373
##DELTAX=0.96440572
##XUNITS=1/CM
##YUNITS=TRANSMITTANCE
##XYDATA=(X++(Y..Y))
399.3 493812637 464934425 467221413 465354767 467274094 469612503 468178368 468203850 463204613 457488251
407.9 457488251 453499336 458429222 462685280 463849945 463762970 462633247 468911705 473747482 480039902
416.6 480039902 490966263 500921135 488481865 467814140 465769577 464290009 462413940 466622810
424.3 466622810 467410889 464104996 460331917 455472260 448453751 446470032 448502884 449934387 450582085
433 450582085 446617165 445632782 447812195 443919525 441105309 440689049 440007133 440160980 442732391
441.7 442732391 450176239 453119698 455995445 461625900 461927834 459338341 459474907 464554329 469231758
450.4 469231758 469774246 468637199 465522728 469297714 470936432 464266510 461167946 462326851 463647766
459.1 463647766 466347237 468045273 464640617 461548805 460381470 456599159 456741562 458872261 456688766
467.7 456688766 453930244 451439934 448231010 446523437 444556847 442957649 444264297 441942024
475.5 441942024 436256905 433947830 435973625 437493401 437488670 436250610 433642464 434798088 434270325
484.1 434270325 431383553 429964943 429812775 431870728 430902405 429175415 429750900 433150063 435728455
492.8 435728455 434310226 431280518 430373268 431383858 430927773 430356636 425969849 424214287 426398773
501.5 426398773 422995644 420467262 417694855 416960716 418723755 419668121 418677292 415771751 415561447
510.2 415561447 413659706 409370422 405784988 403695259 400891037 396379890 393361206 391275635
517.9 391275635 392410698 392330780 389501266 386537552 385100327 384693222 383696480 384194679 382178764
526.6 382178764 382416801 383744049 383614311 381415672 379083214 381393814 381560211 382915611 385516281
535.2 385516281 386482010 387943649 389959717 393854599 395972862 398640671 401265793 403262787 406523666
543.9 406523666 407812195 407759438 407285500 408163109 408674660 407199516 406296387 406266785 405943375 404187469
553.6 404187469 402233276 400215645 400149193 400701714 399456100 397838631 395578346 394157867 392863808
562.3 392863808 390527878 387200623 384813271 382279663 377237320 371951065 367885208 366929245 364683685
570.9 364683685 363307304 362748871 360799637 360877800 360827293 361102219 360531998 362485123 364782829
579.6 364782829 366412811 371168442 373753128 375997581 379591331 383831520 387102470 390782623
587.3 390782623 394299889 395714760 397026978 398327522 400400620 400427399 400086861 401146011 401344452
596 401344452 401175575 401390686 402291832 401621971 401236458 401967316 401990433 401561813 400718002 400801659
605.6 400801659 400937843 400635605 400023537 401361618 403594170 403723526 403483963 404432640 406838303
614.3 406838303 406959991 406754150 408357430 409840279 411586151 412933083 415185585 416814346 418559990
623 418559990 421482925 423804893 425447502 426829185 428498688 429791565 431680717 433036423 433683205
631.7 433683205 434905090 436043777 437023315 437283325 438094177 438912621 438984222 439337044 440533257
640.4 440533257 441811867 442486610 443490524 443961754 444737053 445605164 446344910 447196960 447520485
649 447520485 448900337 449585457 449776382 450436096 451329994 452970123 453617516 453530121 453682365 454425735
658.7 454425735 454960136 455360451 456444321 456833649 457459450 458701515 458819695 458660164 458128433
667.4 458128433 455883141 458972130 461005096 462673607 464149246 464801750 466487389 467362251 466490288
676.1 466490288 466064301 466782074 468447037 469657936 469775543 469262009 470092354 471795845 473786011
684.7 473786011 476006050 476237640 475964966 475935364 475255203 474829063 474594955 474076691 473810501 473619957
694.4 473619957 472060661 471210670 472140083 471554337 469428101 468530083 468017921 465725021 463037834
703.1 463037834 461466637 460783958 459925308 458706169 458264122 458125191 458367653 459351692 460881500
711.7 460881500 462697525 464214592 465073166 466956444 470217094 472704582 475226746 477755356 480720062
720.4 480720062 484422226 487566528 490734940 494016037 497011185 499108887 501392708 504316940
728.1 504316940 507358093 509725914 511554718 513972092 515839043 517964859 520459518 521987534
735.8 521987534 523295326 524769135 525523338 525912628 526435242 526504822 527375793 528222771 527982521 527550812
745.5 527550812 526708527 525905037 524867096 523085251 521462860 519871902 517277374 514808769 513370361
754.2 513370361 511541672 509584312 508153534 505947075 503154984 500990295 499104919 496954231
761.9 496954231 495204735 494371414 493669815 492439423 491760368 492229195 492853203 494806747 498243828
770.6 498243828 501524239 504380531 507314377 511049423 515498848 520851250 526153946 530423279
778.3 530423279 534624023 538787918 542309532 546560440 550963593 554333153 557606201 561141815
786 561141815 564309425 566651230 569950180 573130226 575178680 576541595 578115997 580992889 582779770
794.7 582779770 583792343 584598312 586608887 589346733 590864410 592298317 594371872 597715530 599099960
803.4 599099960 599605408 600592194 601883278 603904076 603819427 603913155 603946075 603789177 603755531 603201904
813 603201904 603528290 603613472 603936005 603829269 603062363 602176781 601544647 601359749 601056175 599734077
822.6 599734077 597495575 596839867 596237755 595183983 593297729 590387688 588277016 586476631 584176750
831.3 584176750 581261368 579485779 576706619 573521538 572265930 570674286 568419380 566254997
839 566254997 565001373 562408485 559058189 556467133 553973160 552444420 550504951 548789291 547468758
847.7 547468758 545671120 543543510 540952568 538551712 536232452 533583412 530912704 529035912
855.4 529035912 526437263 523059311 519882278 516781502 514763489 514333725 515876007 518070068 520797997
864.1 520797997 525182495 530075607 535070648 540060539 546063652 552337303 558538437 565242233
871.8 565242233 571606903 577466736 581941795 586685562 590121574 592654724 594868317 595559158 596439819
880.5 596439819 596240005 595488434 593663177 591767616 589394302 585567284 581983185 578008881 575270691
889.2 575270691 572614326 568923874 565587349 562653389 559219551 554854050 550947037 547837524
896.9 547837524 545155830 541798553 538529663 535801926 532276421 528251457 524477997 521438599
904.6 521438599 517754478 513563652 509709206 504978218 499920387 495095024 490011559 484242630
912.3 484242630 477966919 472394753 466855354 461252441 455781708 449895363 444811554 440241127
920 440241127 436799202 434016113 431794701 430339546 428614120 428324242 428381195 428399048 428962669 429720268
929.7 429720268 430650826 431791000 433277855 434453392 435842590 436989098 438413353 440894127 444222527
938.4 444222527 447389908 449295082 451181526 453753281 457461166 460851059 462673454 463321648 463093681
947.1 463093681 462426491 460146332 456416245 452297516 447739410 442480087 436199036 429583435 422720108
955.7 422720108 416006203 408798332 401254730 393683891 385707207 377975540 369439926 360945435
963.4 360945435 352220459 343725014 334785576 325145378 315954399 306404724 298468342 289219837
971.2 289219837 279764576 270793228 261627998 253375912 244036922 236063271 227816811 220756245
978.9 220756245 213871880 207016430 201868019 196872597 193439426 188446350 185373764 182546997
986.6 182546997 179675388 178353310 176450424 175876064 173944225 173256168 172659206 172756405 173253212
995.3 173253212 172845440 173170414 172502480 173717690 173573971 174232464 175981598 176814251 177211246
1004 177211246 176420784 177536926 176846371 176851425 176684551 176020184 176029243 174795551 175176239 174337215
1013.6 174337215 174602299 174988937 175598164 175682487 175258045 177035809 177038383 178826580 179707127 180116405
1023.2 180116405 180770912 180994415 183391762 185191650 187649441 188627415 189874458 191127090 192842979
1031.9 192842979 194843044 195401211 197036018 196826401 197719917 197617130 197342911 197915440 197811184
1040.6 197811184 198778534 197965755 198325157 197633934 197783070 197938805 197712021 199069881 198457413
1049.3 198457413 199308300 199210873 201341248 203854675 205888023 208684521 209782104 213533974 216863995
1058 216863995 221850758 225324459 228121700 231957893 235076046 240507469 243731613 247721367 251159153
1066.6 251159153 253931007 255372810 254407692 252769432 248006153 244612923 239779358 235155163
1074.4 235155163 231377792 228466892 227548141 224773808 224415779 224398422 226217613 226864128 227402058
1083 227402058 230034580 231768532 235229664 236569252 239323654 242416782 246230297 250075359 251878490
1091.7 251878490 255434761 258299065 261787758 263275242 265042515 266746197 267770519 269894333
1099.4 269894333 269800892 270457764 269935608 270343761 270928211 270997448 271646652 271595707 273171005 273720856
1109.1 273720856 275822754 277239552 278710766 281266518 283367996 286728668 287649403 289259129
1116.8 289259129 291180782 293470802 294900570 294991169 296239719 296692410 297870846 297724094 298671074
1125.5 298671074 300052032 301516705 303623829 304543571 307169323 308414402 310148277 311690331
1133.2 311690331 313165417 314959087 314856110 315565414 314962368 313957767 311680622 309280453 306647625
1141.9 306647625 302886620 300382538 296836281 294256115 291071911 288297119 285389938 282462120
1149.6 282462120 281335831 279131260 278066711 275883198 274868031 274203930 273477592 274218216 274477158
1158.3 274477158 275696831 275468502 277246265 279190006 281430550 284665546 286972618 291003838
1166 291003838 294914818 300723743 306257305 312201900 318422546 324119720 330835609 336986313 344866600
1174.6 344866600 351798248 358075600 364938507 372325516 379181404 385126495 391968651 397681389
1182.4 397681389 403821602 409775391 415372887 420539856 424935379 430058174 434208908 438000946
1190.1 438000946 441284294 444171524 446729851 448343697 449769402 450974808 452378807 453381767
1197.8 453381767 454365273 455275650 455634956 456430969 457312431 457727470 458100319 459071388 460218086
1206.5 460218086 461893501 463953629 465551529 466968613 469141121 471987495 474147797 476328278
1214.2 476328278 478755608 481145363 483351021 485613327 487770653 489063339 490393867 491507378
1221.9 491507378 491874008 492080345 492361641 492041550 491285706 490825462 490451698 489863892 488921509 487960701
1231.5 487960701 486765289 485535469 484617882 483385925 482268600 481497345 480917549 480302086 479495850
1240.2 479495850 478751945 478292084 478427505 478343353 478335571 478476639 478780136 479602928 480007286 480914078
1249.9 480914078 482341423 483373871 483853073 484616432 485688858 486156540 487079391 487978516 488460579
1258.5 488460579 489044189 489360466 489292145 489052277 489422073 490425682 491552200 492542038 493700829
1267.2 493700829 495032768 495982628 496867371 497967987 498893242 499861603 501070824 501774940 502194328
1275.9 502194328 502586899 502913628 503084946 502899971 502474556 502297554 502327881 502013397 501788597 501278076
1285.5 501278076 500839081 501085358 501635971 501753845 501042366 500627098 500002975 499270744 498420334 497135429
1295.2 497135429 496128616 494773254 493612785 492647362 491583672 490296593 488734131 487204285
1302.9 487204285 485548439 484641762 483918648 482642441 481023216 479469528 478511581 477445450 476453667
1311.6 476453667 475586624 474708862 474076233 473351440 472278061 470791283 470073547 469556503 468399315
1320.3 468399315 467359390 466067543 464888954 463659363 462020035 460107880 457644997 454946785
1328 454946785 451957359 449042969 446523895 444202538 441646614 438985062 437117538 435490837 434333076
1336.7 434333076 433275375 432771149 432198029 431342926 431475677 431216850 431643257 431894836 432105598
1345.3 432105598 432505417 432757034 433462830 433839226 434088249 433797226 433811684 433512039 433363533 433343124
1355 433343124 432301445 432101402 431730614 431414986 430804787 430187683 430245361 429580269 428723259 428194199
1364.6 428194199 428590889 428441010 428461418 428559456 428464622 428797531 428471451 429294167 429257698 429676933
1374.3 429676933 431120224 431846924 433200912 433719368 434400063 434543381 435214958 436207962 437244835
1382.9 437244835 438613663 439740181 441796455 443064499 444980659 447259140 449652863 451628380
1390.7 451628380 452966843 454280014 454670067 454904709 453670082 453955345 454287376 454455795 453144226
1399.3 453144226 450975227 451139908 450426674 450184555 449431000 447498016 446648483 445678368 444749985
1408 444749985 443364639 442620125 441097755 439657707 438432083 437136154 436798897 436241531 436582336
1416.7 436582336 435823936 436090775 434595718 433132133 434545555 434715462 435327377 433841438 434148140
1425.4 434148140 435190773 435490265 436820793 436872292 437843208 438121567 439317741 440290146 440705299
1434.1 440705299 442082787 442491226 442775383 442382660 444784164 445973854 446951866 448625946 449032288
1442.7 449032288 450229645 450144501 450964775 451028786 450780449 450120392 449908447 451185646 450697403 450693703
1452.4 450693703 449017487 448852921 448848495 448683548 449898911 444068718 445845795 444374809 445434113
1461.1 445434113 445620232 446489029 449632835 450025711 452897034 454025345 457646675 460625534 464279213
1469.7 464279213 468661346 471786728 479280434 481623230 488427200 491905441 496980400 502390442
1477.5 502390442 506301765 511339417 514381218 519567909 522555046 526608658 530374985 533477554
1485.2 533477554 537585754 539987984 545462837 548049202 553089409 554774704 555940819 559262123
1492.9 559262123 561342926 564738617 566086006 568060608 570594597 573322830 575059700 576745682
1500.6 576745682 579667854 580774231 583397865 585455933 588697166 588512001 584806023 590246925
1508.3 590246925 590924606 593410759 594718513 596689758 596757240 598493500 600603485 600793648 603343620
1517 603343620 601295166 604857483 607690010 607953377 607874298 607053375 610719910 612321777 613069191
1525.7 613069191 612837105 614498367 614927101 615212822 617147026 617793961 620289993 619641724 618017578
1534.3 618017578 619857635 621052818 622911758 624475822 627189713 619325600 621638184 622491875
1542.1 622491875 623492661 626377373 625773087 625307770 625938416 627108154 627851677 627345200 625802040
1550.7 625802040 626578827 628161583 628664398 628379135 627974548 630844421 634608307 633933258 628790474
1559.4 628790474 622277184 626628189 627924309 628741302 628907166 626876373 626315804 626396790 627691956
1568.1 627691956 628535843 624786797 624021111 624459343 624274406 623677940 624537544 625278511 619746475
1576.8 619746475 619418640 620099564 620143318 619940605 619242439 618478508 617514267 616716232 615734367 614326935
1586.4 614326935 613219261 612115784 611197433 610295448 609420433 608073502 607022896 605979500 604440498
1595.1 604440498 603297844 601449394 599779701 598092422 596714401 595339661 593725014 592300835
1602.8 592300835 590390930 588921089 587246399 585709114 583141136 581074409 579161148 576590271
1610.5 576590271 575229988 572845802 570934219 568867416 568175888 567008667 559835434 559391823 558356628
1619.2 558356628 557374191 555360489 554779015 553038139 547374573 547040558 546803741 547162628 544865074
1627.9 544865074 542509270 541268044 540118752 539425659 538321152 538977089 539277840 537170372 534033051
1636.6 534033051 534104805 533703156 533739014 534254189 533601570 534740524 534654045 535956383 537725639 536786308
1646.2 536786308 537361145 536544762 538689270 540373306 543478355 546477203 544520912 542757530 544709816
1654.9 544709816 547877083 549576797 551418686 552882080 554924812 556970329 559177818 561936417
1662.6 561936417 562459564 564912567 567093887 569303551 572129288 575674515 576963844 577589684 580888138
1671.3 580888138 583084679 586553078 589867477 592029495 592880554 595716438 599170113 602260742
1679 602260742 605992393 608299332 611922340 616561966 619281693 617760429 621343346 625962830 629153786
1687.7 629153786 631758804 634825821 637158394 639708748 642751999 645437241 648791275 651799088
1695.4 651799088 652250366 655576859 658618164 663297424 664105377 660169830 664822311 668143082 670713959
1704.1 670713959 671789322 673169022 672788086 674060364 676307144 677465744 678318634 679239426 680748291
1712.8 680748291 682360077 683154755 683379059 686218033 687788010 682687378 684655533 686552887 687814713
1721.4 687814713 688495712 688469086 688288193 688855820 689561157 690203018 691454391 692701797 693073883
1730.1 693073883 692985535 695556488 698935394 697528992 692788162 694582138 697098618 697856064 699331818
1738.8 699331818 699408951 698059921 700985565 702857666 703197403 703745880 705470352 706970291 707883301
1747.5 707883301 709130020 709926300 712755280 713117752 712773666 715130768 716983795 719096069 720860672
1756.2 720860672 721231232 722410965 724190826 725757065 728094101 727683563 727495346 729819641 730699539
1764.8 730699539 731615677 732908325 734017334 733026657 734728317 737915497 738453522 737235489 735423737
1773.5 735423737 738297043 740046768 739350052 740419846 740856476 741946335 742419052 742216644 742648621
1782.2 742648621 743889313 745116882 744262543 744176331 744981003 745885239 746317902 747295303 748099594
1790.9 748099594 748186111 747118759 746450729 748850098 749609756 749281082 750117722 751515427 751847305
1799.5 751847305 750681839 751934433 751704636 751992493 752925415 753248978 754028473 754164810 754461823
1808.2 754461823 754852524 755577545 754729004 754549179 755497971 755891647 756540680 756666031 757324371 756885757
1817.9 756885757 756969299 757846756 757953568 758731766 758791199 759582520 760120087 758333282 758509293 760243607
1827.5 760243607 761863098 762422714 760492630 760135574 761529312 761437988 761402435 761582947 761724854
1836.2 761724854 762208252 761811829 762336426 762369537 762850113 763459854 764631424 765566101 761595230
1844.9 761595230 762792053 764084930 763646698 763047638 763293381 763875046 763833160 764441071 764163818
1853.6 764163818 764565887 764909058 764767227 764972153 764544754 764683990 764522858 764726257 764656296 765081329
1863.2 765081329 765704041 765736542 766095581 765921707 767000504 765749588 764315948 765265579 765812912
1871.9 765812912 766292419 765938721 766271896 766460648 766578064 766661682 766933746 767583160 767408524 767550125
1881.5 767550125 767274170 767572708 767609177 767428970 767703094 767813034 769327774 769622421 768366394
1890.2 768366394 768420868 768883057 768939362 769371872 769944992 769210358 769332123 769682312 770066605 769799728
1899.8 769799728 769343796 769786682 769912720 770249176 770153885 770052643 769745255 769707336 770048904 770005264
1909.5 770005264 770263901 770377426 770847855 770445786 770559921 770756073 770674362 771267700 769508591 769402161
1919.1 769402161 770414658 771111221 771586075 770436707 770121918 770823059 771216278 770900345 771051102
1927.8 771051102 770684052 770604172 771186676 770942764 770992966 770707855 771282272 771654205 771545181 771669769
1937.5 771669769 771209412 771258774 771055679 771789093 771913300 770664749 771007843 771372986 771651764 771786652
1947.1 771786652 772200089 772034836 771649399 771694031 771635132 771731110 771684570 771926880 772121506 772206802
1956.7 772206802 772202911 772743988 773447266 773447189 773258438 772876129 772825317 772516251 772705994 773006973 772506104
1967.3 772506104 772451706 772952423 773786316 773688965 773748474 773902054 773678665 773425522 772796936 772723083
1977 772723083 772549667 772790070 773279190 773771820 774035339 774036255 774465256 774180298 774130707 773952026 773784866
1987.6 773784866 773660660 773233948 773788986 774035797 773634872 773649216 774542160 774739532 774530869 774661331
1997.2 774661331 774166031 773860016 773075867 772866898 773039017 772978058 773126373 772961502 773243942 773371277
2006.9 773371277 773663712 773901062 773758316 773080368 772178345 771879807 771484528 771667328 772039948 772269287
2016.5 772269287 771789627 771573563 772099991 771875000 771477509 770331726 769648285 769564743 769478378 769324875
2026.2 769324875 768797455 769101181 769211197 769384003 769422836 769185715 768852234 768222580 768086090 767706757
2035.8 767706757 767451096 766924210 766378632 766034470 765961227 766225586 766367035 767130737 766876373 766515350
2045.5 766515350 766366348 765840759 765580826 764968948 764861069 764994812 765618134 765686111 765345840 765487366
2055.1 765487366 765406113 765722504 765613480 765573502 765227509 764725113 764544678 764589767 765253296 765326691
2064.7 765326691 765778427 766062393 766136551 766101532 765575867 765459213 765300293 765508804 765421906 765267944
2074.4 765267944 765111465 765318832 765842590 765795288 766186142 765877991 765695953 765875702 765958176 766057053
2084 766057053 765607834 765703583 765664825 765739975 765942154 766270752 766516418 766276093 766351013 766190338 766250458
2094.6 766250458 766085358 766008987 766011505 765765305 765816422 765949402 766688232 766743774 766485214 766503143 766539307
2105.2 766539307 766825333 766955490 766931839 766809769 767420502 767444153 767224121 767452393 767648315 767893372
2114.9 767893372 767207565 766924744 766794891 766934433 767266312 767223282 767502747 767229843 767067871 767025681
2124.5 767025681 767485428 767914886 767746964 767658691 767256851 767192764 767101212 767349319 767603073 767765198
2134.2 767765198 767898941 767648315 767874298 767762527 767923126 768067322 768188095 768488388 767969284 767438278
2143.8 767438278 767233353 767500610 767709579 768055649 767950211 767737656 767887726 767393112 767827072 768467178
2153.5 768467178 768578491 768173752 767498550 767509918 767941513 768620148 768610840 768887711 769304123 769160461
2163.1 769160461 769253311 769608078 769875412 769755325 770140991 770395813 770597000 770706787 770576019 770837555
2172.8 770837555 771045990 771566315 771594543 771704254 772042847 772130508 772330399 772364960 772598724 772542191
2182.4 772542191 773028793 773638992 773815765 773789368 773459778 773896027 774487610 774969788 775089340 775458908
2192 775458908 775674438 775167770 775268326 775481491 775940628 776164780 776249161 776567459 776897507 777125397
2201.7 777125397 776978683 777236176 777103348 777084503 777438278 777444229 777422638 777640991 778123016 778256912
2211.3 778256912 778870544 779634781 779996490 779741821 779399338 779656448 779419708 779372330 779518051 779809494
2221 779809494 780175247 780551605 780821304 780741043 781242294 781326294 781152878 780865860 780884323 781237564
2230.6 781237564 780981293 780911789 780874176 781323318 781525879 781765289 782251053 782224121 782541962 782536926
2240.3 782536926 782468719 782140579 782051163 782261658 782184677 782410736 782719955 783143311 782790298 782883377
2249.9 782883377 783316803 783287201 783466873 783406601 783539810 783401184 783444977 783346710 783405075 783632050
2259.5 783632050 783488159 784051132 784098434 784391556 784583969 784345016 784664536 784755096 784638062 784324112
2269.2 784324112 784577713 784463654 784153061 784387436 784738693 785042419 785099792 785514679 785517502 785718002
2278.8 785718002 785559692 785261459 785460510 785168610 785452652 785365219 785241089 785268631 785419617 785798035
2288.5 785798035 785711746 786082993 786105499 786237717 786109924 785798569 785606689 785146027 785463486 785597763
2298.1 785597763 785891266 786030121 786458740 786620026 786061401 786682968 787004166 787109833 786672745 786013794
2307.8 786013794 786120834 786423798 786615219 786013794 786282425 786853180 787169724 787564011 788234329 788799210
2317.4 788799210 787978592 786907349 785908966 785819473 786572876 787590866 787676010 787169876 787930145 788922806
2327.1 788922806 789455185 788040314 786918411 786548080 786592560 786789627 785559845 786120453 787295837
2335.7 787295837 788117065 787991562 788107834 788234711 787518768 787587357 786083679 786072159 785956039 784336319
2345.4 784336319 784097137 784407425 784726105 784838333 785825272 785984344 786167603 787201462 786351929
2354.1 786351929 784925079 784970474 786738129 785929413 785186920 784435196 784185638 785315704 785061035
2362.7 785061035 786325073 786212769 785935059 784798889 783682556 782854919 781637268 782511292 782220535
2371.4 782220535 782288055 782280655 781585007 780837402 780365372 780968781 780755081 780373688 779587250 778680649
2381.1 778680649 778114548 777838669 777634430 777197876 777575989 778078613 778569870 778265915 778094254 778307266
2390.7 778307266 777319412 776679687 776030197 775599213 775402908 775363235 775775909 775922241 776213608 776061478
2400.3 776061478 775977631 775746460 775507965 775410080 774677963 774029846 773759155 773796082 773471222 773576736
2410 773576736 773694153 773602753 773404846 772545776 772585297 772582932 772295380 771706390 770974274 770647964 770212250
2420.6 770212250 770241928 769790268 769509735 769379883 769112167 769126358 768632126 768111954 767548599 767346954
2430.2 767346954 766956787 766258698 765782394 765827332 766181564 765496674 764768753 764451065 764554520 764462814
2439.9 764462814 763788605 762982559 762378159 762685242 762490082 762031403 761596527 761124802 760897903 760485229
2449.5 760485229 760261536 759707413 759384308 759067459 758664093 758382263 757928391 757788544 757604065 757377472
2459.2 757377472 756564636 755852356 755461884 755182724 754951477 754316635 754557648 754845428 754620819 754031754
2468.8 754031754 753681183 753578796 752928619 752602997 752090530 751834030 751468430 751059570 751154480 750854111
2478.5 750854111 750624542 750232773 750091705 749863129 749539948 749171600 748438797 748086472 747842560 747884979
2488.1 747884979 747324066 746971664 747376633 747479858 747393570 746804199 746515121 746049271 745389099 745077896
2497.7 745077896 744981384 745038757 744927826 745355835 745651550 745298767 744570847 744351273 744471817 744054642
2507.4 744054642 743682709 743207550 743100357 742939606 742499161 742208176 741972580 741851425 741640167 741916580
2517 741916580 742167511 742147293 741759262 741116333 740506592 739842758 739630966 739296417 739241714 739196548
2526.7 739196548 739015961 738841095 738294449 738453369 738599396 738187714 737282028 736132431 735346756
2535.4 735346756 735165329 735415039 735177307 735238571 735647430 735479050 734707489 733983765 733544083 733102112
2545 733102112 732599564 731652298 731197586 731121979 730939178 730885544 730723038 730521622 730179367 729864120
2554.6 729864120 729343719 729082565 728603973 727829742 727396393 726586761 726246719 726416855 726740417 726869125
2564.3 726869125 726795197 726548843 725571289 724787292 724278870 724000854 723350754 722715149 722615738 722399292
2573.9 722399292 722315674 721968613 721859741 721628571 721403809 721292114 720780945 720344009 719327164 718853531
2583.6 718853531 718792725 718654938 718844223 718520432 718018799 717637939 717415848 717178574 717228928 716824951
2593.2 716824951 715786209 715330048 715289001 715233459 714982681 715353394 715310135 714542007 714090881 713625717
2602.9 713625717 713468170 713252106 712892380 712247009 711922913 711761322 711094589 710837631 710505142 710150986
2612.5 710150986 709709015 709261703 708893051 708367538 707949677 707526627 707407379 706966324 706425323 705731583
2622.1 705731583 704973145 704496155 703559265 702837219 702327576 701952057 701339722 700608063 700185623 699641953
2631.8 699641953 699194260 698671036 698306503 697555542 696587524 695658722 694655685 694185410 693725052
2640.5 693725052 693632126 693490295 692694550 691577988 690748978 690086441 689090042 688596039 688116913 687637558
2650.1 687637558 687177048 686812439 686474304 685547409 685096741 684835739 684370270 683534851 682528992
2658.8 682528992 681566086 680462189 679966202 679631882 679166260 678718643 678531647 677986603 677236862
2667.5 677236862 676898804 676443634 676323853 675560532 674572067 673869858 672946320 672649231 672383194 672011871
2677.1 672011871 671701279 671647339 671493378 670926666 670296783 669429703 668683624 667676620 666724472 666383972
2686.8 666383972 666533585 666447220 665584030 665060501 664960785 664490814 663631821 662974243 662216110 661618652
2696.4 661618652 661321716 660697632 660327835 659989929 659608154 658962326 658374329 657942886 656995316 656209564
2706 656209564 655617142 655395660 654931488 654215698 653768234 653190002 652560730 651850967 651737137 651238556
2715.7 651238556 650333786 649870605 649270554 648821945 648299484 647682571 646863556 646518250 646622009 646127396
2725.3 646127396 645594711 645334244 645067749 644151764 643530426 643519287 642940750 642264099 642086258 641994934
2735 641994934 641519852 641037140 640452194 640002594 639617577 638901787 638333397 638060913 638218117 638004875
2744.6 638004875 637526855 637304306 636980858 636467247 636212959 636295662 635653038 634931717 634211884 633570709
2754.3 633570709 633424988 632935486 632569389 632242661 631696205 631196060 631437950 631810112 631266861 630533371
2763.9 630533371 629894142 629738121 629587288 629509239 629238319 628441887 628180580 628182182 628262634 627729759
2773.5 627729759 627057686 626644516 625955963 625262680 624381409 623981552 623432159 622679367 622318916 621988525
2783.2 621988525 621920090 621526451 620839233 620344505 619946899 619111519 618162804 617533035 616855965 616315193
2792.8 616315193 615725822 615044212 614274521 613513260 612793503 611944313 610707245 609632950 609204292
2801.5 609204292 608311539 607360535 606396065 605349083 604437485 603492355 603118820 602261848 600930252
2810.2 600930252 599844131 598965530 597787628 596167107 594924622 593923264 593409042 592463684 591136589
2818.9 591136589 589995956 588384590 586976929 585717430 584699478 583665009 582358665 581182823
2826.6 581182823 579981880 578563728 577190056 575967903 574157295 572926865 571978035 570384560
2834.3 570384560 568902702 567148514 565760651 564431534 562401352 560071831 558078270 556474800
2842 556474800 554594727 552816200 550945091 548864098 546712112 544477463 542102394 539519386 537329521
2850.7 537329521 535451126 533436584 531516991 530446320 529462547 527929192 525929832 524256439
2858.4 524256439 523883286 523016701 521531906 519921722 518247414 516505890 513973503 512020035 510265121
2867.1 510265121 508237076 506071358 503350258 500979118 498474731 495593262 493033447 490589828
2874.8 490589828 487863731 485266953 482858200 480383339 477895737 475460548 473606720 471904716
2882.5 471904716 470273857 468679695 467128296 466060867 464866714 463879318 463259850 462840691 462578697
2891.2 462578697 462200432 461405029 460507126 460319672 459959106 459542656 459472084 459609833 459465103 458529892
2900.8 458529892 458094902 457827606 457135429 456105042 455179710 454613876 453858719 453042603 451865997
2909.5 451865997 450989494 450053062 448341827 446309929 444201889 442380981 440478363 438775063 436596031
2918.2 436596031 434260826 432708130 431030769 429163017 426934853 425466995 424614220 423318024
2925.9 423318024 422482529 421937714 421435089 421290627 421303329 421162529 421916542 423240623 424274254
2934.6 424274254 426012497 428026657 429940720 431997299 434151993 436445084 439163208 442163925
2942.3 442163925 444865494 447755775 451010857 454005852 456567535 459400673 462417717 465444260
2950 465444260 468459015 471233749 474229469 477040787 479956474 482952538 485743599 489033012 492372551
2958.7 492372551 494833107 497064323 500198936 502907791 505338326 508017769 510186882 512523041
2966.4 512523041 514651337 516478271 518519287 520977592 523592796 525909042 527959938 530015259
2974.1 530015259 532028503 533489799 535375786 537601357 539717026 541895828 543599396 544950523
2981.8 544950523 546257477 547935219 549455147 551105080 552842712 553905182 554973335 556062698
2989.6 556062698 557125893 558005829 558964157 559933052 560484695 560711670 561190720 562201195 562518616
2998.2 562518616 562950058 563704071 563804054 563454056 563259583 563587532 563266182 562769547 562552490 562329788
3007.9 562329788 562171669 561834984 561449051 560851135 560255508 559463806 558733215 558136215 557934494 557690277
3017.5 557690277 556281700 554901962 553633461 552741470 551950455 550718269 550055542 549518967 548528404
3026.2 548528404 546794243 545353088 544607964 543882980 542756004 541077309 539694443 538493919 537499084
3034.9 537499084 536220856 534768791 533455544 532186127 531245461 529744835 528261375 526893692
3042.6 526893692 525521660 524484673 523224297 521810150 520195236 518655701 517055016 515798187
3050.3 515798187 514535332 512742310 511440086 510094185 508534470 507140808 505682220 504149551
3058 504149551 502745552 501391602 500273361 499238510 497628021 496096001 494389153 492908401 491551094
3066.7 491551094 489395218 487825661 486648941 485236778 483825035 482679558 481554146 480221252
3074.4 480221252 479116211 477738533 476134911 474413719 472791023 471322746 469668617 468002586
3082.1 468002586 466400146 465118027 463858109 462531738 461030731 459797287 458996582 457426910
3089.9 457426910 455379601 453729172 452517815 451000671 449337120 448013840 446719246 445727310
3097.6 445727310 444703369 443182945 441344910 439869499 438900986 437741737 436076241 434252739
3105.3 434252739 432914124 431927147 430572739 428770142 427262764 425899010 424668121 423334045
3113 423334045 421861877 421216965 420102158 418542404 416913986 414948082 413715591 412618141 411544800
3121.7 411544800 410395699 409012642 407620392 406320000 405160103 403734207 402411613 400778122
3129.4 400778122 399358482 398527145 397420158 395971298 394405975 393080788 391667824 390409317
3137.1 390409317 389384308 388498840 387221184 385548859 384418983 383081398 381970215 381021309 379548874
3145.8 379548874 378167191 377281075 376243668 374739799 374100609 373413048 372367096 370982399 369209709
3154.5 369209709 368249969 367076302 365875893 364656715 363366623 362371635 361288986 360334053 358964920
3163.1 358964920 357830772 356981354 356263962 355391045 353592949 351889038 350948486 350678215 350041962
3171.8 350041962 348972168 347676506 346491432 346009293 345124855 343754730 342264748 341099777 340176430
3180.5 340176430 339358597 338742332 337755890 336908646 336221542 335258102 334116745 333396683 332769470
3189.2 332769470 331507683 330284882 329367409 328787613 328128891 327042084 325854568 325120583 324620819
3197.9 324620819 323841362 322964058 321933441 321328392 320608521 319538212 318759460 318054581 317379246
3206.5 317379246 316435127 315520363 314681072 314295311 313825359 312648239 311968098 311477737 310710430
3215.2 310710430 309644413 308547478 307527542 306661625 306210461 305788040 305580025 304986229 304136372
3223.9 304136372 303369312 302766571 302316418 301529293 300978546 300401516 299743576 298931980 298074226 297309475
3233.5 297309475 296472034 296084461 295673389 295224781 294559364 293855400 293265171 292790527 292512836 291831264
3243.2 291831264 291413555 290586834 289787884 289471264 288805161 288310966 287698898 287345638 286757030 286118565
3252.8 286118565 285866413 285255985 284810905 284371986 283909073 283243179 282768898 282558155 281880589 280999336
3262.5 280999336 280385532 280312634 280044022 279906693 279965534 279650154 278929214 278151741 277880993 277514057
3272.1 277514057 277245522 276581879 275788422 275753536 275296745 274436684 274030838 274173489 273847027 273160000
3281.8 273160000 272762814 272378597 272135162 271881027 271395798 270732307 270411263 270088615 269629555 269253139
3291.4 269253139 268958817 268908978 268466740 268235168 267963257 267342911 267153473 267049427 266719685 265992298
3301 265992298 265654774 265500679 264790440 264197006 263790302 263362560 263120327 262948551 262633705 262370567
3310.7 262370567 262060356 261850834 261451988 260906315 260371952 259940643 259864693 258924446 258469315 258740730
3320.3 258740730 258444233 258198013 257646828 257368622 256910477 256317692 255827312 255084248 254942093 254526176
3330 254526176 254185410 253910484 253174171 252659225 252625790 252775574 252052460 251161556 250803471 250778503
3339.6 250778503 250617943 249879990 249365540 249343033 249116173 248600636 248290234 247881718 247585144 247003880
3349.3 247003880 246234417 245974598 245676060 245574093 245212040 245006485 244873428 244055328 243427773 243227043
3358.9 243227043 242929897 241982403 241781235 241668129 241038952 240858860 240190868 239836330 239696980 239325333
3368.6 239325333 238793964 238456001 238615360 238305302 238141632 238038807 237728958 237100391 236404190 236270447
3378.2 236270447 236453247 236516399 235964375 236036263 236110401 235780106 235734692 235122795 234552174 234154873
3387.8 234154873 234067879 233968220 233573208 233368702 233190784 233043137 232714405 232752647 232726250 232483864
3397.5 232483864 232451820 232193432 232181454 232119026 232208405 232558842 232087288 231737137 232180538 232002754
3407.1 232002754 231264019 230968552 231192913 231359119 231095428 230989189 231274967 231616383 231164207 230885525
3416.8 230885525 231298256 231344948 231596298 231520538 231912174 232453499 232097073 231820965 231386776 231612320
3426.4 231612320 231667976 231289024 231119652 231172028 231805553 231833630 232248783 232857628 232910690 232914543 232778988
3437 232778988 232800980 232946510 233328724 233416424 233661060 233938999 234510384 235203571 235368118 236014118
3446.7 236014118 235557270 235658760 236359501 236293507 237008076 237328300 237194939 237173958 237419910 237881889
3456.3 237881889 238520889 238980446 239125309 239884377 239951458 240230026 241068420 241741199 242430897 242504692
3466 242504692 243143349 243899937 244261608 244542885 245065861 245634193 245618954 246108360 246798134 247108154
3475.6 247108154 247377815 248054066 248592930 248828144 249170437 249564800 250326920 250478096 250970421 252004910
3485.2 252004910 252773933 253372440 253664417 254504681 255382004 256086121 256271477 256330490 256935692 257521286
3494.9 257521286 258373318 259024773 259662533 260474567 261414680 262076092 262442513 262851200 262960644 263664722
3504.5 263664722 264334698 265185337 266150227 267231579 268117599 268208447 269272785 269733372 270118923
3513.2 270118923 270854797 271293640 272474709 273332367 274215622 275080185 275705051 276396523 277477341
3521.9 277477341 278343410 278278713 279473839 280941944 281825047 282455387 283259945 283599873 284125767
3530.6 284125767 285693512 286275845 286904507 287699165 288604050 289556484 290300770 291326408 291694889
3539.2 291694889 293016071 294140701 294757233 295907593 297329292 298374710 298178616 299832592 300916176
3547.9 300916176 301445999 302508869 304101639 306440334 306452427 307388401 308593788 309972992 311702919
3556.6 311702919 312221069 314073448 315682049 316873760 318026695 320167465 321910591 323095512
3564.3 323095512 327076836 327316284 326585846 328170090 328827705 331798897 333330193 334315987 336067429
3573 336067429 338434181 340266418 341982117 344233627 345093918 347122650 348822975 349902420 351995773
3581.7 351995773 354450798 356687889 358398819 362461586 364380722 363201904 364577980 365578804
3589.4 365578804 369639854 373047066 375841484 377734451 379225845 382807083 382514076 384635391
3597.1 384635391 388010330 389363899 392777977 394271965 395648384 397939186 400078278 403178062
3604.8 403178062 406917229 409842377 409653664 412863998 412821426 413660660 421587906 423765373 422394409
3613.5 422394409 425936050 426637993 431268311 435760994 435731201 437490311 437907181 439840469 443562698
3622.2 443562698 446298409 448905296 451859627 455175362 458972740 465206261 465364456 456207695
3629.9 456207695 461063232 466112595 471205864 473420753 472589989 475236664 478707962 481767235
3637.6 481767235 482964783 484135628 486545715 489643288 491707115 492610588 495286598 499319191
3645.3 499319191 505142746 504525223 502122459 508138237 507516670 504246941 505602036 512642403 517454185
3654 517454185 521232567 526245346 519699097 522045555 527262611 528424988 529658127 530796776 533968430
3662.7 533968430 535655785 537375298 539343452 540873489 546041603 548715630 548311958 548500481 542452469
3671.4 542452469 546006889 555440178 565188980 563329048 545360985 550598106 559048119 563758507
3679.1 563758507 562314758 562562408 565345573 567695198 569483986 570225410 571751213 577139626 583536186
3687.8 583536186 574562149 572091255 579999390 574590645 575694237 581487579 582498245 584843369
3695.5 584843369 585495872 585263023 587306328 588664093 591258888 593619804 589125671 587707634 592402153
3704.1 592402153 594068069 594625130 596224327 599962349 604449272 597697754 601955719 606254692
3711.9 606254692 592509079 597364693 602288322 603363113 604639854 607396736 609298973 606227455
3719.6 606227455 607685661 613528557 609887543 605997276 612011909 613483047 612818756 609870338
3727.3 609870338 610347595 615726204 617549171 623038254 619909058 612881012 624043083 625653229
3735 625653229 613540154 613581886 617163239 618188820 621805458 626060295 621404953 624839211 636683006
3743.7 636683006 624188156 611854630 623047829 629586716 635595779 630221977 620033379 631710815
3751.4 631710815 625682755 619098053 625898361 631492767 635553093 630585365 633224564 638447418
3759.1 638447418 629181213 628604698 633816528 635344734 636144371 639505615 636272278 632356033 636803017
3767.8 636803017 642347107 642253418 632852097 634897537 638896599 639483910 640248337 640777588 642330170
3776.5 642330170 643306122 646471100 645689087 637927055 640946274 643555756 645135498 647592621 644232864
3785.2 644232864 643211594 645116882 646204071 647119827 647091217 647149506 647871475 649240875 649286728
3793.8 649286728 651009445 654508896 650646973 648417969 651307602 655306549 662178268 655215607
3801.5 655215607 643139496 647451172 651171112 656989594 663169327 651064072 646454926 652749634
3809.3 652749634 655239410 656054459 657050323 657385483 659129944 664831467 663524704 649475937 654725342
3817.9 654725342 661651306 667686615 668246155 646607437 650686646 658219299 661255646 663602982
3825.7 663602982 662737045 658770523 659312210 662059174 665850525 667021484 658775864 662500000 670602341
3834.3 670602341 664225082 663886642 672354889 662985306 659439240 668287277 662933960 661512146
3842.1 661512146 667755051 664977112 661616592 665632629 667494888 667879181 670306320 669512329 671927567
3850.7 671927567 678800507 675047760 674983978 654507980 657469788 669528732 668264923 666806488
3858.4 666806488 670512772 673541489 675877838 670483170 671065216 677602615 669975204 665881119
3866.2 665881119 671626968 677303543 683184128 673296890 664709473 669917450 676160049 678781433
3873.9 678781433 667658615 668430023 672720184 673455505 676847458 681806107 675314255 668406143
3881.6 668406143 675631866 676577072 677673035 682957153 669481583 671154022 676120224 677252121
3889.3 677252121 681523666 679524384 670566406 672879028 677166595 676605148 677890854 679540939
3897 679540939 682815323 683576813 673402328 680048447 682201233 675867920 680529251 676295242 674312820
3905.7 674312820 676129837 677687836 679792328 679557037 679265060 678291550 679238281 680784912 680408936
3914.4 680408936 681573792 683995819 680707779 676729126 680801392 681038895 678194885 681362610
3922.1 681362610 682958527 683153076 679928741 676834412 679892502 682160797 682937927 682003784 682180023
3930.8 682180023 684441833 681446686 679427490 680405121 680394592 681409454 682250748 681769180 681733932
3939.5 681733932 682286453 684268265 685228882 680996094 680489655 682322540 684147797 686132202 683116455
3948.1 683116455 683550644 684158936 681200180 683477173 684290161 683463058 683873825 683798218 683996887
3956.8 683996887 683917618 684373245 684390182 685232086 685378342 683481064 683594055 684516983 684749451 684328308
3966.5 684328308 684602966 685668564 685168991 683968201 684672546 685577774 685016632 685152054 685993042
3975.1 685993042 686575623 686042175 685381927 685135117 685186996 686567307 687072067 686141586 685156479 685608368
3984.8 685608368 686420212 685925217 685986557 686329880 687002335 687045288 686765976 687048569 686373215 686363831
3994.4 686363831 686723175 686997604 687022552 686508942 687042465 687598114
4000.2 687598114
##END=$$ End of the data block
