##TITLE=$$ Begin of the data block
##JCAMP-DX=5.00 $$ ACD/SpecManager v 10.08
##SPECTROMETER/DATA SYSTEM=Varian
##DATE=20 Nov 2012 09:52:46
##DATA TYPE=INFRARED SPECTRUM
##DATA CLASS=XYDATA
##ORIGIN=
##OWNER=
##NPOINTS=3735
##FIRSTX=399.26403809
##LASTX=4000.35498047
##MAXX=4000.35498047
##MINX=399.26403809
##MAXY=79.08396149
##MINY=17.23043633
##XFACTOR=1.0000000000
##YFACTOR=0.000000100000000
##FIRSTY=45.38821030
##DELTAX=0.96440572
##XUNITS=1/CM
##YUNITS=TRANSMITTANCE
##XYDATA=(X++(Y..Y))
$$ plain form
399.3 453882103 459439964 474255028 469811554 463613586 454198418 445618820 450506935 453977509
407 453977509 457097893 455881653 457567635 460084114 458187408 456599159 455225563 462415276 464234467
415.7 464234467 460008736 463448906 476393318 477393532 463341866 457090034 453935356 459164200
423.4 459164200 462199211 459536133 458332138 456829834 455705566 452816467 448509789 443383942
431.1 443383942 443567581 446864166 442217293 435984268 437334747 443854866 446371803 445363503 444760551
439.8 444760551 444754333 445585403 448701172 450589485 452256622 454719009 453857651 454892464 457534904
448.4 457534904 459825516 463575363 463832817 464142036 467059708 466757927 465476608 465423012 466183510
457.1 466183510 466862679 465176888 461373787 456998711 456800919 459593964 459450836 456565285 452920151
$$ packed form
399.3D53882103N557861J4815064m443474o197968r415168q579598M888115L470574
407D53977509L120384j216240J685982K516479j896706j588249j373596P189713J819191
415.7D64234467m225731L440170J2944412J000214j4051666o251832l154678N228844
423.4D59164200L035011k663078j203995j502304j124268k889099m306678n125847
431.1D43383942J83639L296585m646873o233025J350479O520119K516937j008300o02952
439.8D44760551o218Q31070L115769J888313J667137K462387q61358J034813K642440
448.4D57534904K290612L749847K57454L09219K917672l01781j281319n3596P60498
457.1D66183510O79169j685791l803101m375076j97792K793045j43128k885551l645134
$$ plain form
465.8 452920151 451382942 448781166 442075653 445382042 449851952 448887863 447655487 441027908 437908859
474.5 437908859 436288719 437782364 439723854 436158485 430223541 427955399 429686737 426256485
482.2 426256485 427032509 431499214 430493317 430290375 430055275 430615959 432084389 430832977 427266235
490.9 427266235 429225693 432508163 431793480 430863991 429802322 430659866 427986412 423639107 423260880
499.6 423260880 425729218 425751114 418002930 413231773 414900856 418827324 417349396 414829178 413763084
508.2 413763084 411461754 410498810 408049889 407794685 405423927 402831802 401869926 397947388 394273987
516.9 394273987 389637489 388339615 388375130 388325844 386751480 385847054 386940117 384739914 382687759
525.6 382687759 380734215 380558014 378099022 378366356 381890030 380748672 382712784 383827515 385004463
$$ packed form
465.8D52920151j537209k601776o705513L306389M469910r64089j232376o627579l119049
474.5D37908859j620140J493645J941490l565369n934944k268142J731338l430252
482.2D26256485P76024M466705j005897k02942k35100N60684J468430j251412l566742
490.9D27266235J959458L282470p14683r29489j061669Q57544k673454m347305l78227
499.6D23260880K468338K1896p748184m771157J669083L926468j477928k520218j066094
508.2D13763084k301330r62944k448921k55204k370758k592125r61876l922538l673401
516.9C94273987m636498j297874L5515m9286j574364r04426J093063k200203k052155
525.6C82687759j953544j76201k458992K67334L523674j141358J964112J114731J176948
$$ plain form
534.3 385004463 386696472 387047882 389110298 389839134 392637444 395324440 396933403 398695068 401840897
543 401840897 406196480 407650604 408419647 408751221 409621162 410336838 408673515 406551285 406087112
551.6 406087112 406267738 404064484 402188606 401112099 401406288 401300583 398591576 396333885 394556274
560.3 394556274 394853363 394497986 390882874 387088509 385610199 383264580 378288155 373348007 368454781
569 368454781 366790199 363763084 360581665 360291672 360256424 360389252 359742317 361602478 361859627 362493401
578.6 362493401 363830185 365613747 369996490 372716942 376512947 379990845 383251114 386637344
586.4 386637344 390277328 393571548 395311317 397665367 399001198 400422745 401105614 401355820 401247444
595 401247444 401020241 401947174 401373634 401625862 401874847 402311325 403045578 402383957 402106895 401595383
$$ packed form
534.3C85004463J692009L51410K062416P28836K798310K686996J608963J761665L145829
543D01840897M355583J454124P69043L31574Q69941P15676j663323k122230m64173
551.6D06087112J80626k203254j875878j076507K94189j05705k709007k257691j777611
560.3C94556274K97089l55377l615112l794365j478310k345619m976425m940148m893226
569C68454781j664582l027115l181419k89993l5248J32828o46935J860161K57149O33774
578.6C62493401J336784J783562M382743K720452L796005L477898L260269L386230
586.4C86637344L639984L294220J739769K354050J335831J421547O82869K50206j08376
595D01247444k27203R26933n73540K52228K48985M36478P34253o61621k77062n11512
$$ plain form
604.7 401595383 401757889 401463585 401671677 402369041 402855988 403924065 404328995 405767365 406025848
613.4 406025848 406092834 407432556 407625122 407314644 407966156 410697517 413726845 416129189 417942848
622 417942848 420161514 422017746 423517418 425878601 427524147 429314651 430889664 431630478 432250214
630.7 432250214 433094139 433774147 434335213 436275673 437659531 437644920 438487320 439932632 440309258
639.4 440309258 440303650 440671272 441706772 443743782 445025597 445745163 446285896 447257881 448727112
648.1 448727112 450611916 452278557 451684952 451732178 452051849 451893539 452904587 453483353 453819771
656.8 453819771 453973389 454687538 455333214 455618134 456837425 457714844 458269882 457953339 458067360 459952087
666.4 459952087 459753227 456860085 461429901 462990570 463967171 464609184 464988747 467513084 468383064
$$ packed form
604.7D01595383J62506k94304K08092O97364M86947J068077M04930J438370K58483
613.4D06025848O6986J339722J92566l10478O51512K731361L029328K402344J813659
622D17942848K218666J856232J499672K361183J645546J790504J575013P40814O19736
630.7D32250214Q43925O80008N61066J940460J383858j4611Q42400J445312L76626
639.4D40309258n608L67622J035500K037010J281815P19566N40733R71985J469231
648.1D48727112J884804J666641n93605M7226L19671j58310J011048N78766L36418
656.8D53819771J53618P14149O45676K84920J219291Q77419N55038l16543J14021J884727
666.4D59952087j98860k893142M569816J560669R76601O42013L79563K524337Q69980
$$ plain form
675.1 468383064 467627792 468131256 468841972 470043106 471276245 472488213 472643547 472552147 473344955
683.8 473344955 474330521 475837059 475845718 475579262 476731186 476782455 475359192 474525795 475168457 475586510
693.4 475586510 474983406 474590836 474938736 474592552 472664833 470595322 469592628 468394623 465812836
702.1 465812836 464065666 463167534 461793327 460833549 459986496 459371605 459303322 459848824 460707893 462156296
711.7 462156296 464204521 465347900 466232376 468259468 470778885 473308678 476006050 478474159 481315727
720.4 481315727 484585533 488436470 491875191 494136162 497073708 500408554 503248520 505406418
728.1 505406418 508773346 511925964 512809563 514680061 517523804 519934464 521277542 522009201 523245888
736.8 523245888 524532280 525638809 527021103 527992821 528237038 529880600 530152435 528250427 528597450
$$ packed form
675.1D68383064p55272N03464P10716J201134J233139J211968J55334r1400P92808
683.8D73344955R85566J506538Q659k66456J151924N1269j423263q33397O42662M18053
693.4D75586510o03104l92570L47900l46184j927719k069511j002694j198005k581787
702.1D65812836j747170q98132j374207r59778q47053o14891o8283N45502Q59069J448403
711.7D62156296K048225J143379Q84476K027092K519417K529793K697372K468109K841568
720.4D81315727L269806L850937L438721K260971K937546L334846K839966K157898
728.1E05406418L366928L152618Q83599J870498K843743K410660J343078P31659J236687
736.8E23245888J286392J106529J382294R71718K44217J643562K71835j902008L47023
$$ plain form
745.5 528597450 529479446 528749390 527227287 525385284 523976440 521641808 517837524 515759163 515131645
754.2 515131645 513456383 511470604 509278679 506638985 503986397 501300201 499112282 497192650
761.9 497192650 495316544 493703423 492962151 492667084 491893311 492539444 494147644 496173820 499624252
770.6 499624252 503110580 505830536 508581390 512050819 516343727 521682396 526556358 530283813
778.3 530283813 534985504 540427399 544870605 549012108 552663040 556283913 560088844 562873802
786 562873802 565266380 567166519 570377579 573959045 575884895 577653580 579739494 581830902 583816528
794.7 583816528 585787544 585945053 587137375 590025063 592001266 594160004 596223526 598676605 599918442
803.4 599918442 601376457 603021088 603318100 604227104 604570007 605285034 605337105 605072708 604781799 603829765
$$ packed form
745.5E28597450Q81996p30056j522103j842003j408844k334632l804284k078361o27518
754.2E15131645j675262j985779k191925k639694k652588k686196k187919j919632
761.9D97192650j876106j613121p41272k95067p73773O46133J608200K026176L450432
770.6D99624252L486328K719956K750854L469429M292908N338669M873962L727455
778.3E30283813M701691N441895M443206M141503L650932L620873L804931K784958
786E62873802K392578J900139L211060L581466J925850J768685K085914K091408J985626
794.7E83816528J971016J57509J192322K887688J976203K158738K063522K453079J241837
803.4E99918442J458015J644631K97012R09004L42903P15027N2071k64397k90909r52034
$$ plain form
813 603829765 604039268 604263992 604857903 605074348 604368744 603269882 602451553 602207642 601590500 600454483
822.6 600454483 599003677 598645401 597571907 594901657 592472801 591182365 589643936 587607498 585757408
831.3 585757408 582417984 579619064 576993980 574315834 572084694 569670715 568854790 567616577 565197258
840 565197258 561738739 558777084 556976585 554685631 553791504 552855911 550636711 548055649 545350494
848.7 545350494 543175201 541224518 539381485 537425537 534574509 531453857 529602509 526743431
856.4 526743431 522622871 519851265 517611809 515228271 513734665 514694595 517009506 519889679 524776535
865.1 524776535 530487556 536271057 540971184 546467628 553899879 560477371 566574440 572201080
872.8 572201080 578342857 583788681 586826782 589194450 592203712 594314117 595576973 596487694 595514565
$$ packed form
813F03829765K09503K24724N93911K16445p05604j098862q18329k43911o17142j136017
822.6F00454483j450806l58276j073494k670250k428856j290436j538429k036438j850090
831.3E85757408l339424k798920k625084k678146k231140k413979q15925j238213k419319
840E65197258l458519k961655j800499k290954q94127r35593k219200k581062k705155
848.7E45350494k175293j950683j843033j955948k851028l120652j851348k859078
856.4E26743431m120560k771606k239456k383538j493606R59930K314911K880173M886856
865.1E24776535N711021N783501M700127N496444P432251O577492O097069N626640
872.8E72201080O141777N445824L038101K367668L009262K110405J262856R10721r73129
$$ plain form
881.5 595514565 594787292 593815308 591796608 588929901 585592384 582658463 578648262 574566879 571177750
890.2 571177750 567884750 564673271 561034431 557213936 554398193 551173706 547301598 544630661
897.9 544630661 541428604 537725296 534757347 531830063 528332405 524247398 520277481 516497345
905.6 516497345 513187370 509759789 504723358 499088631 493961487 488224945 482615013 477641411
913.3 477641411 472146645 466019325 460446701 455523224 449660454 444138947 439729805 436600761
921 436600761 433962097 431427879 430155907 429417610 429028168 428706207 429197502 429723969 429975929 430597916
930.7 430597916 431330910 432592239 433583069 435110321 436870117 438511429 440593262 442993279 445798340
939.3 445798340 447968216 450237350 453407555 456983490 460240288 462418938 463208275 462754059 461468048
$$ packed form
881.5E95514565p27273r71984k018700k866707l337517k933921m010201m081383l389129
890.2E71177750l293000l211479l638840l820495k815743l224487l872108k670937
897.9E44630661l202057l703308k967949k927284l497658m085007l969917l780136
905.6E16497345l309975l427581n036431n634727n127144n736542n609932m973602
913.3D77641411n494766o127320n572624m923477n862770n521507m409142l129044
921D36600761k638664k534218j271972p38297l89442l21961M91295N26467K51960O21987
930.7D30597916P32994J261329R90830J527252J759796J641312K081833K400017K805061
939.3D45798340K169876K269134L170205L575935L256798K178650P89337m54216j286011
$$ plain form
948 461468048 459313278 456283989 452223854 447414780 442127495 435816879 429412270 422839966 415546188
956.7 415546188 407757187 400102310 392661819 384816322 376396751 367607918 359652443 351045074
964.4 351045074 342536812 334046783 325366020 316907578 306952553 297711010 287904053 279138660
972.1 279138660 270857468 261818447 253478756 244125004 236266804 228219986 221049690 214227333
979.8 214227333 207668152 202351379 196762466 192640247 187569008 184365692 181580753 179042740
987.6 179042740 177461185 175947552 175724144 173912830 173636036 172984200 173111153 173148212 172304363
996.2 172304363 173242874 173007164 174028568 174312382 175060291 174926243 174978828 176875305 176663666 176968288
1005.9 176968288 176431217 177047825 176439285 175943604 176441307 175519600 176262226 174622478 173879776
$$ packed form
948D61468048k154770l029289m060135m809074n287285o310616o404609o572304p293778
956.7D15546188p789001p654877p440491p845497q419571q788833p955475q607369
964.4C51045074q508262q490029q680763q458442r955025r241543r806957q765393
972.1B79138660q281192r039021q339691r353752p858200q046818p170296o822357
979.8B14227333o559181n316773n588913m122219n071239l203316k784939k538013
987.6A79042740j581555j513633k23408j811314k76794o51836J26953L7059q43849
996.2A72304363R38511k35710J021404K83814P47909j34048N2585J896477k11639L04622
1005.9A76968288n37071O16608o08540m95681M97703r21707P42626j639748p42702
$$ plain form
1014.6 173879776 173637428 173909111 174694138 174743290 176058159 176251678 177913818 178346672 179600582
1023.2 179600582 181011353 182079525 184303608 185025330 187450008 188053398 189502544 190822182 191688747
1031.9 191688747 193672066 194723263 196875420 196478348 197592983 198460464 198265190 197789650 197043819
1040.6 197043819 198633232 197646008 197749081 197513371 197910938 198405552 197432671 197857399 197911148 200313854
1050.2 200313854 200881195 202129669 203707542 205476303 209336300 211789455 215039234 216873188
1058 216873188 220662918 224139595 227139263 230988083 234692097 239867668 243476772 248203850 250752163
1066.6 250752163 252966099 254546928 254196720 252528992 246555309 242569256 238377323 235177040
1074.4 235177040 231898651 228611107 227256088 224734001 225180931 224680119 225567875 226133976 227137432
$$ packed form
1014.6A73879776k42348K71683P85027M9152J314869J93519J662140M32854J253910
1023.2A79600582J410771J068172K224083P21722K424678O03390J449146J319638Q66565
1031.9A91688747J983319J051197K152157l97072J114635Q67481j95274m75540p45831
1040.6A97043819J589413r87224J03073k35710L97567M94614r72881M24728N3749K402706
1050.2B00313854N67341J248474J577873J768761L859997K453155L249779J833954
1058B16873188L789730L476677K999668L848820L704014N175571L609104M727078K548313
1066.6B50752163K213936J580829l50208j667728n973683l986053m191933l200283
1074.4B35177040l278389l287544j355019k522087M46930n00812Q87756N66101J003456
$$ plain form
1083 227137432 229671135 230855808 234270535 236074295 239669991 243080254 246432533 249454365 251281490
1091.7 251281490 255025749 257520332 261688423 263937836 266052437 267557030 268049583 270632439
1099.4 270632439 270904579 270890694 269902821 270626163 270791092 270167618 270681343 270867233 273348961 274423008
1109.1 274423008 276275558 277315922 279165840 281905880 283452168 286559887 288052635 290736008
1116.8 290736008 291622238 292452850 294397602 295379658 296938820 296620922 297779884 298259144 299175968
1125.5 299175968 300753613 302077160 303613377 304300632 306740665 308021164 310758953 312700405
1133.2 312700405 313497677 314985027 315203762 315944557 314042759 312744427 311288929 308867645 306230640
1141.9 306230640 302666550 300502052 297013454 294365158 291036186 288166523 285817165 282806301
$$ packed form
1083B27137432K533703J184673L414727J803760L595696L410263L352279L021832J827125
1091.7B51281490L744259K494583M168091K249413K114601J504593M92553K582856
1099.4B70632439K72140j3885r87873P23342J64929o23474N13725J85890K481728J074047
1109.1B74423008J852550J040364J849918K740040J546288L107719J492748K683373
1116.8B90736008Q86230Q30612J944752R82056J559162l17898J158962M79260R16824
1125.5B99175968J577645J323547J536217O87255K440033J280499K737789J941452
1133.2C12700405P97272J487350K18735P40795j901798j298332j455498k421284k637005
1141.9C06230640l564090k164498l488598k648296l328972k869663k349358l010864
$$ plain form
1149.6 282806301 281276665 278866386 277672882 275816994 274848080 274451866 274387035 274873734 274647732
1158.3 274647732 276254063 276727734 278541260 279464798 281372337 285481586 288191242 292371941 296206303
1166.9 296206303 301421661 306343956 311947403 318036804 323768463 331163635 337804337 345307121
1174.6 345307121 351823578 358531265 365633354 372277298 378925056 384594841 391200333 397636147
1182.4 397636147 404426193 410730629 415932503 421002655 425969887 430685654 434414024 438150558
1190.1 438150558 441310120 444199142 446603508 448258934 449888077 451136093 452202530 452861176
1197.8 452861176 454318924 455914497 456580772 456823730 457110214 457885742 457904701 458783722 460981712
1206.5 460981712 462200165 463124352 465032883 467176285 469484558 472228012 474544067 476860275
$$ packed form
1149.6B82806301j529636k410279j193504j855888r68914l96214o4831M86699k26002
1158.3B74647732J606331M73671J813526R23538J907539M109249K709656M180699L834362
1166.9B96206303N215358M922295N603447O089401N731659P395172O640702P502784
1174.6C45307121O516457O707687P102089O643944O647758N669785O605492O435814
1182.4C97636147O790046O304436N201874N070152M967232M715767L728370L736534
1190.1D38150558L159562K889022K404366J655426J629143J248016J066437O58646
1197.8D52861176J457748J595573O66275K42958K86484P75528J8959Q79021K197990
1206.5D60981712J218453R24187J908531K143402K308273K743454K316055K316208
$$ plain form
1214.2 476860275 478875580 481176414 483793983 485885963 487766113 488930550 490068626 491431046
1221.9 491431046 492401390 492615318 492246284 492062874 491828537 491344337 490554848 489495049 488762474
1230.6 488762474 487954521 486786270 485809479 484903870 483893089 482887192 481891518 480987206 480191383
1239.3 480191383 479628181 478979187 478388138 478257179 477931938 478050842 478433456 478935814 480041275
1247.9 480041275 480786285 481647148 482545586 483197708 483792229 484732361 486126633 487146988 487753220
1256.6 487753220 487889900 488411674 489218254 489236946 489222450 489712639 490228195 490907173 491959763 492701874
1266.3 492701874 493460770 494603996 495809212 497075462 498445168 499436607 499920692 500560875 501366806
1274.9 501366806 502428017 502960968 503156929 503359566 503221588 503085442 502732849 502471199 502178726
$$ packed form
1214.2D76860275K015305K300834K617569K091980J880150J164437J138076J362420
1221.9D91431046R70344K13928l69034j83410k34337m84200p89489j059799p32575
1230.6D88762474q07953j168251r76791r05609j010781j005897r95674r04312p95823
1239.3D80191383n63202o48994n91049j30959l25241J18904L82614N02358J105461
1247.9D80041275P45010Q60863Q98438O52122N94521R40132J394272J020355O06232
1256.6D87753220J36680N21774Q06580J8692j4496M90189N15556O78978J052590P42111
1266.3D92701874P58896J143226J205216J266250J369706R91439M84085O40183Q05931
1274.9E01366806J061211N32951J95961K02637j37978j36146l52593k61650k92473
$$ plain form
1283.6 502178726 502072296 501947403 501500778 501453514 501667862 501735191 501533165 501583672 500984306 499537926
1293.3 499537926 498303719 497417145 496500168 495069656 493856392 492690811 491819305 490968246 489473610
1301.9 489473610 488074570 486408119 485254478 484444542 482990685 481330872 479658241 478561821
1309.7 478561821 477548676 476688728 476343269 475574722 474465866 473444939 472692261 471823196 470850334
1318.3 470850334 469774590 468586082 467448158 466067619 464932442 463687630 462143631 460165329
1326 460165329 457709122 455344582 452551804 449892387 447261581 444643173 442113495 439297104 437554474
1334.7 437554474 436200600 434973068 433751526 433287544 433107986 432024269 431848259 431720619 431915779
1343.4 431915779 432131271 432780037 433309250 433542480 434084969 434267082 434639702 434347725 434075623 433475914
$$ packed form
1283.6E02178726j06430j24893m46625m7264K14348O7329k02026N0507n99366j446380
1293.3D99537926j234207q86574r16977j430512j213264j165581q71506q51059j494636
1301.9D89473610j399040j666451j153641q09936j453857j659813j672631j096420
1309.7D78561821j013145q59948l45459p68547j108856j020927p52678q69065r72862
1318.3D70850334j075744j188508j137924j380539j135177j244812j543999j978302
1326D60165329k456207k364540k792778k659417k630806k618408k529678k816391j742630
1334.7D37554474j353874j227532j221542m63982j79558j083717j76010j27640J95160
1343.4D31915779K15492O48766N29213K33230N42489J82113L72620k91977k72102n99709
$$ plain form
1353.1 433475914 433133507 433155785 432872086 433093491 432200127 431812744 431541672 431157646 430952988 430009041
1362.7 430009041 429393387 428784065 429417419 429230423 429022980 429230995 428939705 429430389 429237480 430017204
1372.3 430017204 430331917 430704117 431316071 431759758 433161736 433613205 434457474 434755707 435827255
1381 435827255 436976547 437773743 439075317 439843636 441979942 443692284 445515900 447441139 449720459
1389.7 449720459 451643829 452619629 454359856 455267220 455280571 454164505 454419708 454259453 453746147
1398.4 453746147 453056145 451462364 451329346 450432472 449837456 449210243 447867813 446662178 445372353
1407.1 445372353 444786072 443533707 442690353 441326218 440074158 439222336 437682037 437045517 436713524
1415.7 436713524 437243500 437304420 437982025 435439720 433604736 434657440 434403877 435207710 434221916
$$ packed form
1353.1D33475914l42407K2278k83699K21405q93364l87383k71072l84026k04658r43947
1362.7D30009041o15654o09322O33354j86996k07443K08015k91290M90684j92909P79724
1372.3D30017204L14713L72200O11954M43687J401978M51469Q44269K98233J071548
1381D35827255J149292P97196J301574P68319K136306J712342J823616J925239K279320
1389.7D49720459J923370R75800J740227R07364J3351j116066K55203j60255n13306
1398.4D53746147o90002j593781j33018q96874n95016o27213j342430j205635j289825
1407.1D45372353n86281j252365q43354j364135j252060q51822j540299o36520l31993
1415.7D36713524N29976O0920O77605k542305j834984J052704k53563Q03833r85794
$$ plain form
1424.4 434221916 434281731 435431366 436311111 437879944 437891235 438509979 438702660 439978294 440567055
1433.1 440567055 440810661 442615585 443037910 443584251 443726006 445713081 446625557 447449570 448891678
1441.8 448891678 449335785 450856209 450960503 451542206 451583672 451405907 450755272 450501289 451397133 450551834
1451.4 450551834 450615082 449411545 449671669 450029221 449021797 448236923 443574905 445401573 444148560
1460.1 444148560 445732040 446394043 447378502 449749374 449888763 453459358 454576225 458195534 461119690
1468.8 461119690 464585457 468961601 472581177 480665321 482750168 489100723 492734833 498100929
1476.5 498100929 503113136 506746826 511465530 514736748 520130692 522949028 527129288 530606728
1484.2 530606728 533735275 538293991 540654411 545872345 548408127 552940674 554447517 556695900
$$ packed form
1424.4D34221916N9815J149635Q79745J568833J1291O18744J92681J275634N88761
1433.1D40567055K43606J804924M22325N46341J41755J987075R12476Q24013J442108
1441.8D48891678M44107J520424J04294N81703M1466j77765o50635k53983Q95844q45299
1451.4D50551834O3248j203537K60124L57552j007424p84874m662018J826668j253013
1460.1D44148560J583480O62003R84459K370872J39389L570595J116867L619309K924156
1468.8D61119690L465767M376144L619576Q084144K084847O350555L634110N366096
1476.5D98100929N012207L633690M718704L271218N393944K818336M180260L477440
1484.2E30606728L128547M558716K360420N217934K535782M532547J506843K248383
$$ plain form
1491.9 556695900 560360107 562054176 565268898 566755829 568481789 570415955 572969856 575049362
1499.6 575049362 577090530 580389175 581715317 584383583 586192398 589280815 588448029 584673500
1507.3 584673500 590833130 591455269 594228592 595479469 596965904 597109261 599375229 601570549 601776276
1516 601776276 605150414 602665977 605779839 607722244 606565514 607066765 606809692 611176567 612786636
1524.7 612786636 613302269 613351669 615106964 615437775 615535393 617410622 618026161 620402870 619632072
1533.4 619632072 618302689 619949951 621253738 623458595 624927444 628210602 620132217 622825394
1541.1 622825394 623833084 623867836 626975403 626301880 625699501 626366501 627555504 628318863 628107758
1549.8 628107758 627150002 627830658 629700317 630268784 629075890 628809433 632198334 635727272 628779488
$$ packed form
1491.9E56695900L664207J694069L214722J486931J725960J934166K553901K079506
1499.6E75049362K041168L298645J326142K668266J808815L088417q32786l774529
1507.3E84673500O159630O22139K773323J250877J486435J43357K265968K195320K05727
1516F01776276L374138k484437L113862J942405j156730N01251k57073M366875J610069
1524.7F12786636N15633M9400J755295L30811R7618J875229O15539K376709p70798
1533.4F19632072j329383J647262J303787K204857J468849L283158q078385K693177
1541.1F22825394J007690L4752L107567o73523o02379O67000J189003P63359k11105
1549.8F28107758r57756O80656J869659N68467j192894k66457L388901L528938o947784
$$ plain form
1558.5 628779488 625795174 622412720 626689796 628450813 629206619 629309692 626997948 626540947 627275696
1567.1 627275696 628440094 628354492 624696999 624877663 625349159 624880791 624724998 625688248 624264526
1575.8 624264526 618052635 620020256 621468201 621444206 621013832 620316544 619590797 618728256 617759361
1584.5 617759361 616373100 614821587 613613930 612638512 611874352 610741844 609969673 609009819 607809982
1593.2 607809982 606438065 604922981 603600731 601748466 600448761 598790283 597336502 595954170
1600.9 595954170 594306679 593128738 591696396 590151787 588033638 586378784 584080658 582423859
1608.6 582423859 580451813 577477036 576007156 573539391 571724968 569880829 569503365 568709793 561291351
1617.3 561291351 560695419 559254379 558057823 556403465 556053238 554168091 548560562 548505669 548095970
$$ packed form
1558.5F28779488k984314l382454M277076J761017P55806J03073k311744m57001P34749
1567.1F27275696J164398q5602l657493J80664M71496m68368j55793R63250j423722
1575.8F24264526o211891J967621J447945k3995m30374o97288p25747q62541r68895
1584.5F17759361j386261j551513j207657r75418p64160j132508p72171r59854j199837
1593.2F07809982j371917j515084j322250j852265j299705j658478j453781j382332
1600.9E95954170j647491j177941j432342j544609k118149j654854k298126j656799
1608.6E82423859j972046k974777j469880k467765j814423j844139l77464p93572p418442
1617.3E61291351n95932j441040j196556j654358l50227j885147n607529n4893m09699
$$ plain form
1626 548095970 548020439 545413551 543409004 542662086 541648941 540811996 539306526 539793015 540326843
1634.6 540326843 537215805 534005547 534591675 534690971 535060081 535623512 534979973 536030960 535933037
1643.3 535933037 537333984 538910065 537898598 539408569 538715057 540320129 541745110 544507103
1651 544507103 547193451 546812019 544796028 546398773 549909859 551537247 552875443 554158173 556470451
1659.7 556470451 558770790 560875587 563162003 563960838 566719589 568791199 571196365 574163971
1667.4 574163971 576968689 577891579 579548187 583148804 584990883 588396606 592227440 594638062
1675.1 594638062 594828644 597436218 600849991 604211197 608121452 610356255 613569908 617760277
1682.9 617760277 620755539 619793549 623117371 627524757 630912590 633630943 636400642 638736839
$$ packed form
1626E48095970p5531k606888k004547p46918j013145q36945j505470M86489N33828
1634.6E40326843l111038l210258N86128R9296L69110N63431o43539J050987r7923
1643.3E35933037J400947J576081j011467J509971o93512J605072J424981K761993
1651E44507103K686348l81432k015991J602745L511086J627388J338196J282730K312278
1659.7E56470451K300339K104797K286416P98835K758751K071610K405166K967606
1667.4E74163971K804718R22890J656608L600617J842079L405723L830834K410622
1675.1E94638062J90582K607574L413773L361206L910255K234803L213653M190369
1682.9F17760277K995262r61990L323822M407386L387833K718353K769699K336197
$$ plain form
1690.6 638736839 641202621 644487381 647647705 651227493 653680725 651869736 656442947 660550537
1698.3 660550537 665328445 664967270 660719147 666236420 669870148 672051620 672596054 673984985 674163589
1707 674163589 675593567 677635040 678746414 679396820 680239487 681883316 683703842 684889984 684644928
1715.6 684644928 687261353 689172058 684027100 685996017 687932053 689128723 689643860 689928894 689845200
1724.3 689845200 690379333 691598358 692142639 693232498 694677429 694626465 694220505 696712112 699726639
1733 699726639 697260056 692490158 695196152 698155518 699440613 701474838 701441879 699548340 702497177
1741.7 702497177 704307556 704175568 704271622 706230011 708292160 709657898 711230545 711480713 713735428
1750.4 713735428 713581772 713321609 716168518 718283234 720561295 722278442 722169342 723192062 725007401
$$ packed form
1690.6F38736839K465782L284760L160324L579788K453232j810989M573211M107590
1698.3F60550537M777908l61175m248123N517273L633728K181472N44434J388931J78604
1707F74163589J429978K041473J111374O50406Q42667J643829J820526J186142k45056
1715.6F84644928K616425J910705n144958J968917J936036J196670N15137K85034q3694
1724.3F89845200N34133J219025N44281J089859J444931n0964m05960K491607L014527
1733F99726639k466583m769898K705994K959366J285095K034225l2959j893539K948837
1741.7G02497177J810379j31988R6054J958389K062149J365738J572647K50168K254715
1750.4G13735428j53656k60163K846909K114716K278061J717147j09100J022720J815339
$$ plain form
1759 725007401 726716843 729375153 729126434 728349075 730436783 731731796 733163300 734606552 735702515
1767.7 735702515 734332809 735609818 738805313 739760590 738339233 736184769 739271545 740975952
1775.4 740975952 740085373 741395264 742148514 743432693 743571014 742985001 743656540 744684143 745924454
1784.1 745924454 745555267 745476303 746474686 747539520 747977448 749010544 749718933 749752350 748577347
1792.8 748577347 747960587 750144806 750433807 750080109 751116791 752725525 753151855 752114029 753662415
1801.5 753662415 753500824 753556519 754171143 754508514 755579987 755690384 755708084 755859528 756326447 755596542
1811.1 755596542 756020966 757071915 757272949 758012695 758018036 758666229 758758774 758882675 759400177 759524536
1820.8 759524536 760210876 760023270 760976639 761588669 759780807 759899063 761551208 763358383 763453674
$$ packed form
1759G25007401J709442K658310k48719p77359K087708J295013J431504J443252J095963
1767.7G35702515j369706J277009L195495R55277j421357k154464L086776J704407
1775.4G40975952q90579J309891P53250J284179J38321n86013O71539J027603J240311
1784.1G45924454l69187p8964R98383J064834M37928J033096P08389L3417j175003
1792.8G48577347o16760K184219K89001l53698J036682J608734M26330j037826J548386
1801.5G53662415j61591N5695O14624L37371J071473J10397J7700J51444M66919p29905
1811.1G55596542M24424J050949K01034P39746N341O48193R2545J23901N17502J24359
1820.8G59524536O86340j87606R53369O12030j807862J18256J652145J807175R5291
$$ plain form
1829.4 763453674 760830688 760883865 762461929 762701416 763024216 763193893 763126984 763255692 762795944 763561401
1839.1 763561401 763731155 764035568 764453049 765698242 766625748 762538605 763522034 764849701 765158768
1847.8 765158768 764873352 764783936 765228195 765007248 765481949 765523300 765959854 765926361 765633545 765808334
1857.4 765808334 765690308 766033325 765730667 766203461 766130524 766172638 766571655 766583405 767455902 767472229
1867.1 767472229 767905045 766478882 765370636 766274414 766762009 767505417 767417755 767558060 767497025 767764206
1876.7 767764206 768199692 768686371 769162445 768672867 768653107 768282471 768568878 768534164 768292999 768778534
1886.3 768778534 769099121 770399704 770324631 769203110 769448013 770167542 770580292 771022186 771471100
1895 771471100 770485229 770516815 770985641 771162643 770994110 771011505 771353455 771324997 771824493 771739426 771560440
$$ packed form
1829.4G63453674k622986N3177J578064K39487L22800J69677o6909J28708m59748P65457
1839.1G63561401J69754L04413M17481J245193R27506m087143R83429J327667L09067
1847.8G65158768k85416q9416M44259k20947M74701M1351M36554l3493k92816J74789
1857.4G65808334j18026L43017l02658M72794p2937M2114L99017J1750Q72497J6327
1867.1G67472229M32816j426163j108246R03778M87595P43408q7662J40305o1035K67181
1876.7G67764206M35486M86679M76074m89578j9760l70636K86407l4714k41165M85535
1886.3G68778534L20587J300583p5073j121521K44903P19529M12750M41894M48914
1895G71471100r85871L1586M68826J77002j68533J7395L41950k8458M99496q5067j78986
$$ plain form
1905.6 771560440 771207962 771282120 771752853 771728973 771911087 771632462 771966782 771778793 771870422 771902695
1915.3 771902695 771871796 772730331 770812225 770265732 771344223 772298050 773076553 772238007 771837463
1923.9 771837463 772110596 772269821 772077866 772477417 772434082 772143784 772329102 772215424 772503738 772184296
1933.6 772184296 772318878 772565689 772584076 772620010 772219696 772372360 772492371 773241653 773008423 771803055
1943.2 771803055 772337418 773150101 773373413 773084259 773369446 773209991 773066330 773017502 772852020 772884979
1952.9 772884979 772755280 773099213 773179169 773523026 773776016 774139252 774532089 774374695 774366684 773850555
1962.5 773850555 773889847 773914413 774143600 774518661 774095078 774253006 774560089 775043640 775009995 775055008
1972.2 775055008 775282059 775002289 774496002 773888779 773858719 773732224 774113235 774667206 775081863 775487671
$$ packed form
1905.6G71560440l52478P4158M70733k3880J82114k78625L34320j87989R1629L2273
1915.3G71902695l0899Q58535j918106n46493J078491R53827P78503q38546m00544
1923.9G71837463K73133J59225j91955L99551m3335k90298J85318j13678K88314l19442
1933.6G72184296J34582K46811J8387L5934m00314J52664J20011P49282k33230j205368
1943.2G71803055N34363Q12683K23312k89154K85187j59455j43661m8828j65482L2959
1952.9G72884979j29699L43933P9956L43857K52990L63236L92837j57394q011n16129
1962.5G73850555L9292K4566K29187L75061m23583J57928L07083M83551l3645M5013
1972.2G75055008K27051k79770n06287o07223l0060j26495L81011N53971M14657M05808
$$ plain form
1981.8 775487671 775798111 776181564 775820465 775688705 775335236 775203934 774859238 774100037 774733505 775097885
1991.5 775097885 774776993 774848938 775677795 775943298 775807648 775903854 775428009 775120850 774364929 774016571
2001.1 774016571 774154892 774517212 774906540 774686890 774760513 774780045 775088654 774977417 774529037 774053574
2010.7 774053574 773731003 773540726 772786255 773107834 773579025 773664703 773376923 773322601 773614960 773144073
2020.4 773144073 772971039 772227020 771499634 770963058 770770569 770908127 770591431 770972214 770901413 770661087
2030 770661087 770522995 770526428 770284424 769604874 769403839 768775024 768423843 767862625 767695694 768087769
2039.7 768087769 768169785 768200226 768077469 768691635 768489151 768136139 767798233 767141571 767148056 766850281
2049.3 766850281 766748657 766572800 766754837 766841888 766985168 767387543 767394409 767745895 767216187 766743622
$$ packed form
1981.8G75487671L10440L83453l61099j31760l53469j31302l44696p59201O33468L64380
1991.5G75097885l20892P1945Q28857K65503j35650R6206m75845l07159p55921l48358
2001.1G74016571J38321L62320L89328k19650P3623J9532L08609j11237m48380m75463
2010.7G74053574l22571j90277p54471L21579M71191Q5678k87780n4322K92359m70887
2020.4G73144073j73034p44019p27386n36576j92489J37558l16696L80783p0801k40326
2030G70661087j38092L433k42004o79550k01035o28815l51181n61218j66931L92075
2039.7G68087769Q2016L0441j22757O14166k02484l53012l37906o56662O485k97775
2049.3G66850281j01624j75857J82037Q7051J43280M02375O866L51486n29708m72565
$$ plain form
2059 766743622 766426773 766168747 766230392 766344910 767005234 767057266 767406921 767609558 767489853 767394943
2068.6 767394943 767092438 767108994 767121658 767223969 766712723 766600952 766491241 766648178 767504120 767369156
2078.2 767369156 767423630 767409973 767391510 767265396 767042770 767057800 767066116 767444992 767216110 767195663 767378159
2088.9 767378159 767713165 767891159 767822571 768088989 767819977 767859421 767764130 767838821 767766266 767525940
2098.5 767525940 767773895 767709274 768273849 768336945 768211136 768415833 768414993 768559570 768647232 768637238 768442307
2109.1 768442307 768880310 768849487 768928986 769136276 769087448 769468155 769036331 769166565 768966446 768642426
2118.7 768642426 768952942 768882980 769015732 768897858 769025345 769086151 769666061 770010757 769648743 769549332
2128.4 769549332 768854523 768575439 768542557 768927383 769217224 769300995 769750290 769667740 769667282 769489517 769551544
$$ packed form
2059G66743622l16849k58026O1645J14518O60324N2032L49655K02637j19705r4910
2068.6G67394943l02505J6556J2664J02311n11246j11771j09711J56937Q55942j34964
2078.2G67369156N4474j3657j8463j26114k22626J5030Q316L78876k28882k0447J82496
2088.9G67378159L35006J77994o8588K66418k69012L9444r5291P4691p2555k40326
2098.5G67525940K47955o4621N64575O3096j25809K04697q40J44577Q7662r994j94931
2109.1G68442307M38003l0823P9499K07290m8828L80707m31824J30234k00119l24020
2118.7G68642426L10516o9962J32752j17874J27487O0806N79910L44696l62014r9411
2128.4G69549332o94809k79084l2882L84826K89841Q3771M49295q2550m58j77765O2027
$$ plain form
2139 769551544 769427643 769373093 769702911 769345322 769115295 769077835 769107437 769333344 770149689 770327530
2148.6 770327530 769947433 769684143 769353867 770051193 770230865 770154495 769953842 769549942 769727859 769989014
2158.3 769989014 770658264 770778046 770996094 771137390 771043167 771210861 771213684 771427155 771283569 771546555
2167.9 771546555 771913834 772392044 772861481 772777481 772765503 772851715 773524246 773465576 773325043 773541870
2177.6 773541870 773636856 773930969 773751526 774213333 774928284 775330429 775196838 775070496 775535660 775896378
2187.2 775896378 776291733 776515427 777061234 777273712 777304230 777210312 776954346 777229462 777376633 777896881
2196.9 777896881 778048553 778274231 778571320 778439102 778673096 779015808 779595413 779373245 779092102 779013901
2206.5 779013901 778806610 778875885 779328995 780230789 780416489 781104507 781765976 781785431 781683044 781411438
$$ packed form
2139G69551544j23901n4550L29818l57589k30027l7460K9602K25907Q16345J77841
2148.6G70327530l80097k63290l30276O97326J79672p6370k00653m03900J77917K61155
2158.3G69989014O69250J19782K18048J41296r4223J67694K823K13471j43586K62986
2167.9G71546555L67279M78210M69437q4000j1978Q6212O72531n8670j40533K16827
2177.6G73541870R4986K94113j79443M61807P14951M02145j33591j26342M65164L60718
2187.2G75896378L95355K23694N45807K12478L0518r3918k55966K75116J47171N20248
2196.9G77896881J51672K25678K97089j32218K33994L42712N79605k22168k81143p8201
2206.5G79013901k07291O9275M53110R01794J85700O88018O61469J9455j02387k71606
$$ plain form
2216.1 781411438 781731720 781889801 781930237 781415253 781411209 782206573 782517014 782458496 782468185 783267670 783293686
2226.8 783293686 782986679 782623444 782615891 783176651 782791824 782916870 783028793 782996445 783135529 783555603
2236.4 783555603 784070129 783960190 784315262 784349060 784350357 784204102 784068985 784329224 784332123 784447021
2246 784447021 784440536 784970703 785102768 785182571 785586700 785519333 785550690 785456696 785588760 785451660 785384369
2256.7 785384369 785154572 785101013 785476990 785452957 786192780 786521683 786403427 786410294 786421814 786410599 786186066
2267.3 786186066 786197891 786035309 786232224 786094437 786138992 786456833 786574402 787007446 787236023 787749405
2276.9 787749405 787470932 787415009 787665024 787491760 787519226 787040939 787102661 786848221 786737747 787164688
2286.5 787164688 787451859 787626801 787440109 788051376 788294220 788511505 788671722 788055725 787349777 786909637
$$ packed form
2216.1G81411438L20282J58081M0436n14984m044P95364L10441n8518R689P99485K6016
2226.8G83293686l07007l63235p553N60760l84827J25046J11923l2348J39084M20074
2236.4G83555603N14526j09939L55072L3798J297j46255j35117K60239K899J14898
2246G84447021o485N30167J32065P9803M04129o7367L1357r3994J32064j37100o7291
2256.7G85384369k29797n3559L75977k4033P39823L28903j18256O867J1520j1215k24533
2267.3G86186066J1825j62582J96915j37787M4555L17841J17569M33044K28577N13382
2276.9G87749405k78473n5923K50015j73264K7466m78287O1722k54440j10474M26941
2286.5G87164688K87171J74942j86692O11267K42844K17285J60217o15997p05948m40140
$$ plain form
2296.2 786909637 787476730 787742996 788096466 788326263 788328934 788475494 788325653 788913803 789422226 789357529
2305.8 789357529 788806076 788649292 788657379 788574905 788534241 787839966 788351669 789203262 789513168 789208145
2315.5 789208145 789273300 790107803 790193863 789995193 788738022 788484344 789070053 789480057 789873962 788982925
2325.1 788982925 789453049 790689850 790839615 790261459 790139236 789347687 788732529 788625641 787019577
2333.8 787019577 787378464 788368683 788848724 789041901 789033737 789361115 788815155 788070679 786959000 787210388
2343.4 787210388 786934662 785702896 785283051 785444641 786214142 786907883 788195190 788419418 788813553
2352.1 788813553 789779587 788834991 787670288 787501297 789173126 787991867 786299820 785374527 784691925
2360.8 784691925 786081238 785856857 785941849 786100235 786317596 785191956 784261627 784257050 783813934 784368286
$$ packed form
2296.2G86909637N67093K66266L53470K29797K671J46560j49841N88150N08423o4697
2305.8G89357529n51453j56784Q087q2474m0664o94275N11703Q51593L09906l05023
2315.5G89208145O5155Q34503Q6060j98670j257171k53678N85709M10004L93905q91037
2325.1G88982925M70124J236801J49765n78156j22223p91549o15158j06888j606064
2333.8G87019577L58887R90219M80041J93177q164L27378n45960p44476j111679K51388
2343.4G87210388k75726j231766m19845J61590P69501O93741J287307K24228L94135
2352.1G88813553R66034r44596j164703j68991J671829j181259j692047r25293o82602
2360.8G84691925J389313k24381Q4992J58386K17361j125640r30329m577m43116N54352
$$ plain form
2370.4 784368286 783774643 783612289 783674698 783685837 783363724 782634277 782902145 782633667 782212524 781793060
2380.1 781793060 781581573 780876923 780055695 780172424 779915466 779911728 780164795 780350266 780112457 779822540
2389.7 779822540 779796143 779243851 778859482 778285751 777896347 777683411 777496185 777769547 778000793 777910614
2399.4 777910614 777607040 777890472 777808228 777375183 777024155 776839600 776849289 776293335 776056061 775792770
2409 775792770 775646591 775755539 775820541 775649719 775020523 774813690 774365997 773941269 773535919 773053894
2418.7 773053894 772582855 772077255 771973801 771895599 772319641 772044373 771427612 771253128 771099014 770830841
2428.3 770830841 769793015 769365005 768822937 768093719 767874146 768052979 768508606 768014526 767460480
2437 767460480 766851425 766574860 766440582 765775833 765150146 764785690 765101166 764536667 763816147 763815384
$$ packed form
2370.4G84368286n93643j62354O2409J1139l22113p29447K67868k68478m21143m19464
2380.1G81793060k11487p04650q21228J16729k56958l738K53067J85471k37809k89917
2389.7G79822540k6397n52292l84369n73731l89404k12936j87226K73362K31246r0179
2399.4G77910614l03574K83432q2244m33045l51028j84555R689n55954k37274k63291
2409G75792770j46179J08948O5002j70822o29196k06833m47693m24728m05350m82025
2418.7G73053894m71039n05600j03454p8202M24042k75268o16761j74484j54114k68173
2428.3G70830841j037826m28010n42068p29218k19573J78833M55627m94080n54046
2437G67460480o09055k76565j34278o64749o25687l64456L15476n64499p20520p63
$$ plain form
2446.6 763815384 763596573 763066330 762540970 762450638 761917877 761645508 761539383 760902863 760292053 760023880
2456.3 760023880 759920425 759492645 759185104 758694458 758338089 757806702 757375717 757536545 757256927 757095642
2465.9 757095642 756714783 756338730 756170502 755969315 755487671 754718857 754580460 754206161 753812027 753386765
2475.6 753386765 753129425 753197327 752890549 752835617 752671204 752488327 752230148 751870270 751323090 750734100
2485.2 750734100 750667343 750535126 750206909 749691849 749640427 749752045 749806671 749601593 749104538 748907700
2494.8 748907700 748348236 748117447 747619705 747129288 747212219 747212906 747491379 747150879 746755142 746494293
2504.5 746494293 746540146 746624985 746183777 746126556 745863876 745497742 745048676 744850616 744754791 744483948
2514.1 744483948 744617920 744817657 744824142 744169617 743797379 743578568 743280869 742894669 742127838 741941376
$$ packed form
2446.6G63815384k18811n30243n25360r0332n32761k72369j06125o36520o10810k68173
2456.3G60023880j03455m27780l07541m90646l56369n31387m30985J60828k79618j61285
2465.9G57095642l80859l76053j68228k01187m81644p68814j38397l74299l94134m25262
2475.6G53386765k57340O7902l06778n4932j64413j82877k58179l59878n47180n88990
2485.2G50734100o6757j32217l28217n15060n1422J11618N4626k05078m97055j96838
2494.8G48907700n59464k30789m97742m90417Q2931O87K78473l40500l95737k60849
2504.5G46494293M5853Q4839m41208n7221k62680l66134m49066j98060r5825k70843
2514.1G44483948J33972J99737O485o54525l72238k18811k97699l86200p66831j86462
$$ plain form
2523.8 741941376 741720047 741686783 741688385 741587067 741399612 740860062 740671844 740458221 739995499 739029770
2533.4 739029770 738699188 738449097 737700272 737715607 737728271 737990112 738027878 737505722 736748352 736162720
2543.1 736162720 735861816 735230255 734849472 734374390 734177475 733978806 733547668 733416672 733214264 732978058
2552.7 732978058 732603607 732429123 732001572 731543427 730944824 730457916 730127945 729187851 728998871 728758469
2562.4 728758469 728680649 728871460 728695374 728562393 727791061 727391510 727059860 726626587 726130219 725737534
2572 725737534 725650482 725119324 724973221 724721375 724453354 724013443 723484573 723191452 722791367 722745667
2581.6 722745667 721929550 721316986 721195984 720949478 721118393 720958252 720581512 720307999 719901276 719285202
2591.3 719285202 719202652 718735733 718091049 718267975 718156815 717968597 717703323 717557068 716986542 716386948
$$ packed form
2523.8G41941376k21329l3264J602j01318j87455n39550j88218k13623m62722r65729
2533.4G39029770l30582k50091p48825J5335J2664K61841L7766n22156p57370n85632
2543.1G36162720l00904o31561l80783m75082j96915j98669m31138j30996k02408k36206
2552.7G32978058l74451j74484m27551m58145n98603m86908l29971r40094j88980k40402
2562.4G28758469p7820J90811j76086j32981p71332l99551l31650m33273m96368l92685
2572G25737534q7052n31158j46103k51846k68021m39911n28870k93121m00085m5700
2581.6G22745667q16117o12564j21002k46506J68915j60141l76740k73513m06723o16074
2591.3G19285202q2550m66919o44684J76926j11160j88218k65274j46255n70526n99594
$$ plain form
2600.9 716386948 716369171 716099777 715996933 715712967 715456924 714898224 714604034 714558945 713871384 713580780
2610.6 713580780 713214493 712979584 712473679 711832199 711340637 710731812 710677032 710309830 710021591 709580536
2620.2 709580536 708970032 708199081 707147064 706821899 706340790 705618057 704794159 704312592 703989029
2628.9 703989029 703283157 702690048 701956482 701277008 700725632 700402145 699620132 698614883 697925720
2637.6 697925720 697351532 697100525 696617508 696351013 695824738 695006866 694344940 693495789 692611008 691843872
2647.2 691843872 691762009 691274490 690498886 689903717 689177933 688618774 688035278 687729721 687204666 686724243
2656.9 686724243 685908051 684788437 683941956 682781677 682203369 681735458 681448364 681536636 681173553
2665.5 681173553 680620651 679920807 679336777 678917389 678588028 677762604 676707535 675964127 675395279
$$ packed form
2600.9G16386948j7777k69394j02844k83966k56043n58700k94190m5089o87561k90604
2610.6G13580780l66287k34909n05905o41480m91562o08825n4780l67202k88239m41055
2620.2G09580536o10504p70951j052017l25165m81109p22733q23898m81567l23563
2628.9G03989029p05872n93109p33566o79474n51376l23487p82013j005249o89163
2637.6F97925720n74188k51007m83017k66495n26275q17872o61926q49151q84781p67136
2647.2F91843872q1863m87519p75604n95169p25784n59159n83496l05557n25055m80423
2656.9F86724243q16192j119614q46481j160279n78308m67911k87094Q8272l63083
2665.5F81173553n52902o99844n84030m19388l29361q25424j055069p43408n68848
$$ plain form
2674.2 675395279 675207367 674956055 674563370 674170456 674091873 673960953 673264465 672437439 671784210 671151657
2683.9 671151657 670419464 670197220 670049438 669632263 669017944 668375092 667978592 667779770 667556763 666503906
2693.5 666503906 665804749 665522690 665079498 664474716 663250580 662800369 662478027 661701889 661107254
2702.2 661107254 660671921 660291061 659824142 659588547 658870850 658167496 657535019 656575241 655973663 655718079
2711.8 655718079 655396271 654769135 654592896 654014893 653024139 652443924 651843109 651388168 650782471 650269012
2721.5 650269012 649618835 648973846 648760376 648806458 648705444 647918625 647335205 646698151 646102676 645760422
2731.1 645760422 645270691 644947052 644544525 644371033 644138031 643700333 643207703 642652130 642319107 642000275
2740.8 642000275 641736374 641337128 640783844 640346069 640037918 639836578 639643631 639083176 638790970 638581276
$$ packed form
2674.2F75395279j87912k51312l92685l92914p8583j30920o96488q27026o53229o32553
2683.9F71151657p32193k22244j47782m17175o14319o42852l96500j98822k23007j052857
2693.5F66503906o99157k82059m43192o04782j224136m50211l22342p76138n94635
2702.2F61107254m35333l80860m66919k35595p17697p03354o32477r59778o01578k55584
2711.8F55718079l21808o27136j76239n78003r90754n80215o00815m54941o05697n13459
2721.5F50269012o50177o44989k13470M6082j01014p86819n83420o37054n95475l42254
2731.1F45760422m89731l23639m02527j73492k33002m37698m92630n55573l33023l18832
2740.8F42000275k63901l99246n53284m37775l08151k01340j92947n60455k92206k09694
$$ plain form
2750.4 638581276 637891922 637708168 636918030 636210480 636222420 635779037 635535355 635048790 634807358 634761009
2760 634761009 634689331 634648132 634069557 633681984 633144341 632536125 632104416 632137718 631905212 631171455
2769.7 631171455 631368141 631466217 631026382 630373573 629782562 629206505 628565750 628079453 627542114 627257690
2779.3 627257690 626576729 625941315 625364532 624745407 624509239 624074440 623607712 622846832 622328033 621525383
2789 621525383 620676384 620546379 619799576 619016190 618451118 617808266 616917229 616025620 615304184 614447021
2798.6 614447021 613795204 612969055 612035065 610670204 609597511 609279938 608476830 607443161 606578712
2807.3 606578712 605638237 604580536 603903313 602919083 601521568 600104256 598750305 597871704 596566162
2816 596566162 595442772 594339867 593274727 592869606 591668549 590075874 588753967 587748947 586676102
$$ packed form
2750.4F38581276o89354j83754p90138p07550J1940m43383k43682m86565k41432m6349
2760F34761009p1678m1199n78575l87573n37643o08216m31709L3302k32506p33757
2769.7F31171455J96686R8076m39835o52809n91011n76057o40755m86297n37339k84424
2779.3F27257690o80961o35414n76783o19125k36168m34799m66728p60880n18799q02650
2789F21525383q48999j30005p46803p83386n65072o42852q91037q91609p21436q57163
2798.6F14447021o51817q26149r33990j364861j072693l17573q03108j033669q64449
2807.3F06578712r40475j057701o77223r84230j397515j417312j353951q78601j305542
2816E96566162j123390j102905j065140m05121j201057j592675j321907j005020j072845
$$ plain form
2824.7 586676102 585253792 583730927 582281303 581266747 580139732 578915977 577531204 576039848
2832.4 576039848 574485435 572839508 571421127 569889984 568427391 566996803 565515442 563433685
2840.1 563433685 561125259 559404221 557519646 555527267 553516617 551556587 549646912 547605057
2847.8 547605057 545122452 542643280 540890846 538905182 536689568 534829865 533473473 531917534
2855.5 531917534 530197563 528822708 527407494 526230888 524767685 523418961 521999092 520364113
2863.2 520364113 518886986 516735229 514677696 512667732 510723000 508360176 505650711 503346214
2870.9 503346214 500299377 497874222 495827217 492847939 490292168 488216057 485524673 482524719
2878.7 482524719 480328140 478437424 476340828 474147797 472160988 470374794 469016647 468048210
$$ packed form
2824.7E86676102j422310j522865j449624j014556j127015j223755j384773j491356
2832.4E76039848j554413j645927j418381j531143j462593j430588j481361k081757
2840.1E63433685k308426j721038j884575j992379k010650j960030j909675k041855
2847.8E47605057k482605k479172j752434j985664k215614j859703j356392j555939
2855.5E31917534j719971j374855j415214j176606j463203j348724j419869j634979
2863.2E20364113j477127k151757k057533k009964j944732k362824k709465k304497
2870.9E03346214l046837k425155k047005k979278k555771k076111k691384k999954
2878.7D82524719k196579j890716k096596k193031j986809j786194j358147r68437
$$ plain form
2886.4 468048210 466870728 466230240 465294991 464377556 464131317 463609886 463307915 463071861 462868195
2895.1 462868195 462180252 461641655 461657181 461344643 461304207 461036644 460470009 459608879 458844910 458074951
2904.7 458074951 457011185 456536980 455658379 454367714 452909164 452032814 451676979 450122185 448214493
2913.4 448214493 446294174 444186096 442070580 440058556 438017197 435895271 434075851 432125626
2921.1 432125626 430346413 428928070 427955360 426711044 425182991 424549828 424019547 423449898 423180923
2929.8 423180923 423229027 423392525 423862038 424982376 426089478 427367210 429209862 431552773 433881607
2938.5 433881607 435987282 438190041 441027184 444097023 446776543 449932213 453148842 456218147
2946.2 456218147 459193497 461666222 464321404 467355614 470461464 473224335 475806885 478706627
$$ packed form
2886.4D68048210j177482o40488r35249r17435k46239n21431l01971k36054k03666
2895.1D62868195o87943n38597J5526l12538m0436k67563n66635q61130p63969p69959
2904.7D58074951j063766m74205q78601j290665j458550q76350l55835j554794j907692
2913.4D48214493j920319k108078k115516k012024k041359k121926j819420j950225
2921.1D32125626j779213j418343r72710j244316j528053o33163n30281n69649k68975
2929.8D23180923M8104J63498M69513J120338J107102J277732J842652K342911K328834
2938.5D33881607K105675K202759K837143L069839K679520L155670L216629L069305
2946.2D56218147K975350K472725K655182L034210L105850K762871K582550K899742
$$ plain form
2953.9 478706627 482041397 485197144 487961807 490706406 493485374 496616745 499592476 502310524
2961.6 502310524 504820061 507166405 509851418 512380791 514446297 516394539 518682175 521117172
2969.3 521117172 523480453 525735435 528063087 530487213 532572212 534613991 536448708 538292236
2977 538292236 540438881 542434196 544351387 546383553 548255348 549509201 550714569 552308083 554070892
2985.7 554070892 555730629 556901817 557748337 559089355 560494957 561174240 562186050 563170738 563656082
2994.4 563656082 564202118 564929161 565896416 566234398 566186790 566300240 566770325 567149811 566861305 566827888
3004 566827888 566777306 566174698 565822334 566045418 565866585 565533905 565515327 564963036 563886909 562974014
3013.7 562974014 562690125 561967850 561014481 560289879 559360428 558626022 557554855 556414871 555374069
$$ packed form
2953.9D78706627L334770L155747K764663K744599K778968L131371K975731K718048
2961.6E02310524K509537K346344K685013K529373K065506J948242K287636K434997
2969.3E21117172K363281K254982K327652K424126K084999K041779J834717J843528
2977E38292236K146645J995315J917191K032166J871795J253853J205368J593514J762809
2985.7E54070892J659737J171188Q46520J341018J405602O79283J011810R84688M85344
2994.4E63656082N46036P27043R67255L37982m7608J13450M70085L79486k88506l3417
3004E66827888n0582o02608l52364K23084j78833l32680j8578n52291j076127r12895
3013.7E62974014k83889p22275r53369p24602r29451p34406j071167j139984j040802
$$ plain form
3022.4 555374069 554662781 554001083 553181572 552520485 551166267 549986687 548771477 547677765 546638718
3031 546638718 544559021 542919617 541963539 541273689 540125237 538711090 537293015 535878258 535102730
3039.7 535102730 533956375 532609367 531233444 530020103 528744011 526795769 525059700 523753128
3047.4 523753128 522891273 521583633 520006790 518791466 517461624 515803986 513893738 512570381
3055.1 512570381 511398392 509851303 508140411 506752090 505613022 504158020 502464218 500812225
3062.9 500812225 499757614 498440323 497222252 496001282 493961067 492204094 490601921 489402237
3070.6 489402237 487810974 485823822 484590759 483688049 482913475 481566658 480081024 478505135 476699333
3079.2 476699333 475083313 473372078 471926575 470474548 468915710 467328224 465874634 464717064
$$ packed form
3022.4E55374069p11288o61698q19511o61087j354218j179580j215210j093712j039047
3031E46638718k079697j639404r56078o89850j148452j414147j418075j414757p75528
3039.7E35102730j146355j347008j375923j213341j276092j948242j736069j306572
3047.4E23753128q61855j307640j576843j215324j329842j657638j910248j323357
3055.1E12570381j171989j547089j710892j388321j139068j455002j693802j651993
3062.9E00812225j054611j317291j218071j220970k040215j756973j602173j199684
3070.6D89402237j591263j987152j233063r02710p74574j346817j485634j575889j805802
3079.2D76699333j616020j711235j445503j452027j558838j587486j453590j157570
$$ plain form
3087 464717064 463549767 462276344 460666275 458948326 457588463 456437759 454763908 453015251 451500168
3095.6 451500168 450241089 449501305 448333588 447054443 445586433 443738441 442329903 440993118
3103.4 440993118 439613113 437928505 436216965 435144653 433867569 432082138 430504150 429296112
3111.1 429296112 428309212 426845703 425216637 424196129 422803955 421261711 419898987 418528519
3118.8 418528519 417380638 416411324 415423355 413458977 411831207 411241646 410194359 408335838 406488113
3127.5 406488113 405248833 403935661 402808113 401572609 400129814 398765182 397321281 396270332
3135.2 396270332 395106049 394218903 393206635 391986771 390517044 388303070 386973763 385967560
3142.9 385967560 384804611 383605766 382368164 381422501 380235558 378975029 377493172 376333961
$$ packed form
3087D64717064j167297j273423j610069j717949j359863j150704j673851j748657j515083
3095.6D51500168j259079p39784j167717j279145j468010j847992j408538j336785
3103.4D40993118j380005j684608j711540j072312j277084j785431j577988j208038
3111.1D29296112r86900j463509j629066j020508j392174j542244j362724j370468
3118.8D18528519j147881r69314r87969j964378j627770n89561j047287j858521j847725
3127.5D06488113j239280j313172j127548j235504j442795j364632j443901j050949
3135.2C96270332j164283q87146j012268j219864j469727k213974j329307j006203
3142.9C85967560j162949j198845j237602r45663j186943j260529j481857j159211
$$ plain form
3150.6 376333961 375350075 374042053 372632790 371620674 371155052 369829369 368102036 366958809 366369095
3159.3 366369095 365197144 363742676 363049049 361776543 360605659 359622650 358303070 357207146 356280785
3168 356280785 355380707 354191818 353199120 352129364 351056252 349915733 348595276 347861023 347422371
3176.6 347422371 346529007 344890289 343729744 343007164 342301712 341295776 340116844 339273262 337726936
3185.3 337726936 336843834 336304550 335273056 334534912 333224258 332077141 331478271 330980721 330166283
3194 330166283 329122849 328281326 327298241 326009521 324810905 324577675 324186592 323177719 322120171
3202.7 322120171 321047783 320257492 319351025 318449726 317795296 317542305 316874142 315908890 315423393
3211.4 315423393 314583092 313679581 312861195 312123108 311551666 310877075 310077839 309541779 308979702 307983208
$$ packed form
3150.6C76333961r83886j308022j409263j012116m65622j325683j727333j143227n89714
3159.3C66369095j171951j454468o93627j272506j170884r83009j319580j095924r26361
3168C56280785r00078j188889r92698j069756j073112j140519j320457p34253m38652
3176.6C47422371q93364j638718j160545p22580p05452j005936j178932q43582j546326
3185.3C37726936q83102n39284j031494p38144j310654j147117n98870m97550q14438
3194C30166283j043434q41523r83085j288720j198616k33230l91083j008873j057548
3202.7C22120171j072388p90291r06467r01299o54430k52991o68163r65252m85497
3211.4C15423393q40301r03511q18386p38087n71442o74591p99236n36060n62077r96494
$$ plain form
3221 307983208 307410564 306680946 305871544 305050697 304342384 304131317 303112564 302072754 301390514 300990410
3230.7 300990410 300824833 300138187 299240799 298361015 297895393 297507877 297003727 296313934 295637798 295018253
3240.3 295018253 294237976 293711567 293062553 292664871 291977901 291017685 290594406 290358829 290161362 289673996
3249.9 289673996 289375877 288621159 287800694 287340107 286776543 286687870 286003914 285154133 284730568 284311256
3259.6 284311256 283758678 283285179 282898254 282053337 281750622 281397552 280687351 280042267 279418354 279331627
3269.2 279331627 279456921 279384117 278520412 277844009 277233944 276747303 277017250 276802177 276615372 275924091
3278.9 275924091 275252819 275070419 274210892 273860378 273971634 273956032 273334923 272298298 271993980 271910343
3288.5 271910343 271503162 271220531 271160946 270631695 269636612 268958092 268914928 268691158 267960396 267525711
$$ packed form
3221C07983208n72644p29618q09402q20847p08313k11067j018753j039810o82240m00104
3230.7C00990410j65577o86646q97388q79784m65622l87516n04150o89793o76136o19545
3240.3B95018253p80277n26409o49014l97682o86970r60216m23279k35577j97467m87366
3249.9B89673996k98119p54718q20465m60587n63564q8673o83956q49781m23565m19312
3259.6B84311256n52578m73499l86925q44917l02715l53070p10201o45084o23913q6727
3269.2B79331627J25294p2804q63705o76403o10065m86641K69947k15073j86805o91281
3278.9B75924091o71272j82400q59527l50514J11256j5602o21109j036625l04318q3637
3288.5B71910343m07181k82631n9585n29251r95083o78520m3164k23770p30762m34685
$$ plain form
3298.2 267525711 267513351 267460117 266968555 266373425 266008511 265780792 265493793 265308723 265213928 265047817
3307.8 265047817 264747181 263676586 262977695 263286705 263349476 262526646 261699333 261514664 261038342 260500889
3317.4 260500889 259800224 259532585 259917850 259344673 258676319 258477421 258292522 257921066 257508373 256897488
3327.1 256897488 256234493 255948143 255281868 255039902 254770813 254106445 253668365 253015804 252762299 252720871
3336.7 252720871 252611752 251951542 251202927 250907001 250467262 250116005 249672279 249509926 249217987 248765774
3346.4 248765774 248446846 248052425 247938671 247485886 247070827 246598892 246166306 246019287 245787582 245886326
3356 245886326 245324001 244517021 244290142 243883991 243081169 242277260 242013550 242177429 241918640 240816860
3365.7 240816860 240395260 240470314 239875088 239571877 239651184 239347973 238820267 238651505 238440838 237987232
$$ packed form
3298.2B67525711j2360n3234m91562n95130l64914k27719k86999j85070r4795j66111
3307.8B65047817l00636j070595o98891L09010O2771q22830q27313j84669m76322n37453
3317.4B60500889p00665k67639L85265n73177o68354j98898j84899l71456m12693o10885
3327.1B56897488o62995k86350o66275k41966k69089o64368m38080o52561k53505m1428
3336.7B52720871j09119o60210p48615k95926m39739l51257m43726j62353k91939m52213
3346.4B48765774l18928l94421j13754m52785m15059m71935m32586j47019k31705R8744
3356B45886326n62325q06980k26879m06151q02822q03909k63710J63879k58789j101780
3365.7B40816860m21600P5054n95226l03211P9307l03211n27706j68762k10667m53606
$$ plain form
3375.3 237987232 237384033 237025223 237266445 236919422 236420288 236426220 236234570 235965176 235762424 235647297
3384.9 235647297 235394764 235068398 235025959 234820538 234422321 234011459 233483849 233465424 233686028 233786106
3394.6 233786106 233829060 233561077 233427601 232954006 232849007 233311539 233073463 232764740 232512627 232319851
3404.2 232319851 232204628 231990089 231739693 231627617 231809559 231771717 231923561 232021904 231768265 231566525
3413.9 231566525 231613140 231583290 231065407 231024094 231573925 232578011 232789688 231741199 231297855 231365833
3423.5 231365833 231661186 231553478 231425686 231564445 231521969 231846485 232113361 232536755 232603931 232222023
3433.2 232222023 232347088 232788963 233426685 233766651 233774853 233649464 233700962 234006081 234110889 234255753
3442.8 234255753 234811058 235603809 236383877 236805382 236084652 235906353 236631031 236772938 237221413 237909737
$$ packed form
3375.3B37987232o03199l58810K41222l47023m99134N932j91650k69394k02752j15127
3384.9B35647297k52533l26366m2439k05421l98217m10862n27610j8425K20604J00078
3394.6B33786106M2954k67983j33476m73595j04999M62532k38076l08723k52113j92776
3404.2B32319851j15223k14539k50396j12076J81942l7842J51844R8343k53639k01740
3413.9B31566525M6615k9850n17883m1313N49831J004086K11677j048489m43344O7978
3423.5B31365833K95353j07708j27792J38759m2476L24516K66876M23394O7176l81908
3433.2B32222023J25065M41875O37722L39966Q202j25389N1498L05119J04808J44864
3442.8B34255753N55305P92751P80068M21505p20730j78299P24678J41907M48475O88324
$$ plain form
3452.5 237909737 237958641 238058624 238183918 238190460 238725300 239339981 239808922 240274239 240320778 240740681
3462.1 240740681 241579227 241953468 241972389 242573051 243436031 243648758 244100456 244519196 244960480 245411682
3471.7 245411682 245678501 246447372 246662731 246899834 247810059 248310337 248762207 249445934 249978199 250447369
3481.4 250447369 250876999 251513405 252547531 253032990 253192959 253417892 253993797 255223732 255865498
3490.1 255865498 256013412 255688381 256044140 257760696 258955936 259275513 259228630 259428120 260097561
3498.7 260097561 261154041 262298889 263545208 264639282 264592133 264823074 265478020 265703678 266086197
3507.4 266086197 267083282 267834110 268302002 269503059 270388107 271016655 271850796 272592297 273180218
3516.1 273180218 273937721 274941483 275726185 276339798 276630764 277765560 279034386 279458122 280480881
$$ packed form
3452.5B37909737M8904R9983J25294O542N34840O14681M68941M65317M6539M19903
3462.1B40740681Q38546L74241J8921O00662Q62980K12727M51698M18740M41284M51202
3471.7B45411682K66819P68871K15359K37103R10225N00278M51870O83727N32265M69170
3481.4B50447369M29630O36406J034126M85459J59969K24933N75905J229935O41766
3490.1B55865498J47914l25031L55759J716556J195240L19577m6883J99490O69441
3498.7B60097561J056480J144848J246319J094074m7149K30941O54946K25658L82519
3507.4B66086197R97085P50828M67892J201057Q85048O28548Q34141P41501N87921
3516.1B73180218P57503J003762P84702O13613K90966J134796J268826M23736J022759
$$ plain form
3524.8 280480881 281513977 282386169 282542992 283103619 284274712 285236721 286126442 286554317 287494488
3533.5 287494488 288744526 290305729 290526829 290108528 291476917 292805042 293990726 294379253 295304012
3542.1 295304012 297080879 298362522 299214420 299692440 300720081 300475464 301731281 303724575 305210304
3550.8 305210304 307161655 307532539 308694649 309604664 310906277 312547684 313324738 315461731 317066765
3559.5 317066765 318141403 319158516 321606712 323401527 323907623 327090416 326991158 326800461 328797874
3568.2 328797874 329879761 333135834 334709206 335406799 337064743 339460106 341251411 343183632
3575.9 343183632 345418053 346174126 348513565 350690308 351872787 354034805 356598320 358417778
3583.6 358417778 359873047 364011192 365818825 364847794 366927185 367460289 370619354 374370499 377895279
$$ packed form
3524.8B80480881J033096Q72192J56823N60627J171093R62009Q89721M27875R40171
3533.5B87494488J250038J561203K21100m18301J368389J328125J185684L88527R24759
3542.1B95304012J776867J281643Q51898M78020J027641k44617J255817J993294J485729
3550.8C05210304J951351L70884J162110R10015J301613J641407P77054K136993J605034
3559.5C17066765J074638J017113K448196J794815N06096L182793r9258j90697J997413
3568.2C28797874J081887L256073J573372O97593J657944K395363J791305J932221
3575.9C43183632K234421P56073K339439K176743J182479K162018K563515J819458
3583.6C58417778J455269M138145J807633r71031K079391N33104L159065L751145L524780
$$ plain form
3592.3 377895279 379926147 381204910 384623146 384674530 386773224 389635811 391068764 395196037 396676826
3601 396676826 397958450 400998268 403153839 405506783 408572807 411291809 411445122 414902802 416077461
3609.6 416077461 417274666 424321442 425622139 424563675 429155540 429748764 433412247 438408432
3617.4 438408432 439740181 441006699 440550690 442373772 446317635 448955650 451530914 455505524
3625.1 455505524 459114113 462318916 468652344 467564201 457982826 463067284 467750778 473138542
3632.8 473138542 475297775 474370689 477887383 481956596 484868240 485714302 487165604 489877319 492826576
3641.5 492826576 495237656 496565437 499144554 502986031 508666153 507921295 505348892 511795540
3649.2 511795540 511513863 507462082 508301315 515515900 520636711 524136581 527601357 519802208 523873444
$$ packed form
3592.3C77895279K030868J278763L418236N1384K098694K862587J432953M127273J480789
3601C96676826J281624L039818K155571K352944L066024K719002J53313L457680J174659
3609.6D16077461J197205P046776J300697j058464M591865N93224L663483M996185
3617.4D38408432J331749J266518m56009J823082L943863K638015K575264L974610
3625.1D55505524L608589L204803O333428j088143r581375N084458M683494N387764
3632.8D73138542K159233r27086L516694M069213K911644Q46062J451302K711715K949257
3641.5D92826576K411080J327781K579117L841477N680122p44858k572403O446648
3649.2E11795540k81677m051781Q39233P214585N120811L499870L464776p799149M071236
$$ plain form
3657.9 523873444 530360374 531715164 533326340 534459305 537015800 538616066 540728302 542770729
3665.6 542770729 543987617 549016304 551691933 551497536 551488647 545788002 549992409 559571762 569463844
3674.3 569463844 566908875 548479080 553910446 562333069 566841583 565166969 566053543 568427544
3682 568427544 569939766 572073059 573134956 574218712 578791504 584617615 575901527 575224419 585025787
3690.6 585025787 578974762 578304520 583782883 585435600 588224678 588743706 588492737 590203705 591479034
3699.3 591479034 594698982 597160759 592165718 591098633 595934410 597466125 598349991 599930344
3707 599930344 603466301 608076744 600708199 604876976 609199295 595102348 600390015 605310478
3714.8 605310478 606341095 607899208 610758133 612264481 609055824 610912628 616570854 613126259
$$ packed form
3657.9E23873444O486930J354790J611176J132965K556495J600266K112236K042427
3665.6E42770729J216888N028687K675629j94397q889n700645M204407R579353R892082
3674.3E69463844k554969j8429795N431366Q422623M508514j674614Q86574K374001
3682E68427544J512222K133293J061897J083756M572792N826111q716088o77108R801368
3690.6E85025787o051025o70242N478363J652717K789078N19028k50969J710968J275329
3699.3E91479034L219948K461777m995041j067085M835777J531715Q83866J580353
3707E99930344L535957M610443p368545M168777M322319j4096947N287667M920463
3714.8F05310478J030617J558113K858925J506348l208657J856804N658226l444595
$$ plain form
3722.5 613126259 608908119 614012222 616322441 616763611 614174347 614181175 618857460 621037369 626653633
3731.2 626653633 623686409 616689148 626609535 627381668 616411285 616824570 619589615 620675583
3738.9 620675583 624463844 628732071 625137215 628328705 639094353 624448357 613187065 625972061
3746.6 625972061 632569084 639021912 635157547 624923401 637046852 631113434 624011421 630108223
3754.3 630108223 634972572 638592148 633061638 635439568 640437622 631618652 631032791 636552010
3762 636552010 639082413 640036469 643325348 640294724 635814209 639542084 645546951 646252594 636445274
3770.7 636445274 638676262 642058029 642187881 643352966 644074402 645438461 645871964 648981400 647567673
3779.4 647567673 640001144 644030609 646782684 648585129 651460037 648723602 647288895 648743057
$$ packed form
3722.5F13126259m218140N104103K310219M41170k589264O828M676285K179909N616264
3731.2F26653633k967224o997261R920387P72133j0970383M13285K765045J085968
3738.9F20675583L788261M268227l594856L191490J0765648j4645996j1261292J2784996
3746.6F25972061O597023O452828l864365j0234146J2123451n933418p102013O096802
3754.3F30108223M864349L619576n530510K377930M998054q818970n85861N519219
3762F36552010K530403R54056L288879l030624m480515L727875O004867P05643r807320
3770.7F36445274K230988L381767J29852J165085P21436J364059M33503L109436j413727
3779.4F47567673p566529M029465K752075J802445K874908k736435j434707J454162
$$ plain form
3787.1 648743057 649709244 650284500 651214447 651926575 652132645 653009796 652813644 654436722 657459641
3795.8 657459641 652934799 650301514 653740311 658368454 664677734 657465057 646793289 650861588
3803.5 650861588 653802490 659327621 665295410 654319916 650355911 655980301 658534012 659522400
3811.2 659522400 660241470 660227737 661909332 667728271 665432968 651778641 658022537 665176620 670714645
3819.9 670714645 670698090 650726166 654495468 661044235 663874817 666856689 666262360 662070236 662772751
3828.6 662772751 665196991 668829422 670814819 663019104 666164474 673745117 667442322 667460251 676005630
3837.2 676005630 665727539 662029800 671265182 665665741 664536133 670903168 668168411 665095062
3844.9 665095062 668793869 670553513 670938416 673113403 672518234 675528793 682297440 676426849 676749039
$$ packed form
3787.1F48743057R66187N75256R29947P12128K06070Q77151j96152J623078L022919
3795.8F57459641m524842k633285L438797M628143O309280p212677j0671768M068299
3803.5F50861588K940902N525131N967789j0975494l964005N624390K553711R88388
3811.2F59522400P19070j3733J681595N818939k295303j3654327O243896P154083N538025
3819.9F70714645j6555j9971924L769302O548767K830582K981872n94329m192124P02515
3828.6F62772751K424240L632431J985397p795715L145370P580643o302795J7929Q545379
3837.2F76005630j0278091l697739R235382n599441j129608O367035k734757l073349
3844.9F65095062L698807J759644L84903K174987n95169L010559O768647n870591L22190
$$ plain form
3853.6 676749039 659550400 661263733 671883850 670622253 670252762 673801117 676338272 678246765
3861.3 678246765 672643814 673638611 680298691 672742920 668005371 673676834 679572601 685310287
3869.1 685310287 676474609 667732620 672547760 679263153 682091370 670975418 672423477 676837463
3876.8 676837463 676693573 679705658 685091095 678755188 670770569 677763443 679821243 681338120
3884.5 681338120 685490952 671626205 674498825 680344849 681640320 685610199 683404999 674036179
3892.2 674036179 675753708 680302048 680312119 681527634 682601318 685485992 686861877 676767883
3899.9 676767883 682577591 684701462 679764862 684199829 678689804 677394333 679230194 680450134
3907.6 680450134 682785187 682482834 682548981 682370529 682725754 683321533 683414078 684932175 687134171
$$ packed form
3853.6F76749039j7198639J713333J0620117j261597l69491L548355K537155J908493
3861.3F78246765n602951R94797O660080p555771m737549N671463N895767N737686
3869.1F85310287q835678q741989M815140O715393K828217j1115952J448059M413986
3876.8F76837463j43890L012085N385437o335907p984619O992874K057800J516877
3884.5F81338120M152832j3864747K872620N846024J295471L969879k205200r368820
3892.2F74036179J717529M548340J0071J215515J073684K884674J375885j0093994
3899.9F76767883N809708K123871m936600M434967n510025j295471J835861J219940
3907.6F80450134K335053l02353O6147j78452L55225N95779R2545J518097K201996
$$ plain form
3916.3 687134171 683486481 679624100 684462967 684648972 680900192 683731003 685981674 687403717
3924 687403717 684946442 681324387 683233566 685390244 686599579 685637665 685622559 687527771 684187698
3932.7 684187698 682235794 683850327 684178848 685013885 685474014 685047760 685975952 686567383 687991333
3941.4 687991333 688907623 684431076 684005966 685871277 686942520 688633270 686193161 686198807 686501083
3950.1 686501083 684531784 686796570 686900787 685856171 686080933 686569595 687894592 687835770 687617111
3958.7 687617111 687133713 688377380 689206772 687143097 687597504 688813858 688647232 688068542 688181458
3967.4 688181458 689216003 688994293 688077545 688524475 688848419 688599930 689224091 689439087 689602509
3976.1 689602509 689682312 689053345 688623352 688886414 689874725 690011444 689811249 689484177 689111710 689466400
$$ packed form
3916.3F87134171l647690l862381M838867J86005l748780K830811K250671J422043
3924F87403717k457275l622055J909179K156678J209335r61914j5106J905212l340073
3932.7F84187698j951904J614533L28521Q35037M60129m26254R28192N91431J423950
3941.4F87991333R16290m476547m25110J865311J071243J690750k440109N646L02276
3950.1F86501083j969299K264786J04217j044616K24762M88662J324997n8822k18659
3958.7F87617111m83398J243667Q29392k063675M54407J216354j66626n78690J12916
3967.4F88181458J034545k21710r16748M46930L23944k48489O24161K14996J63422
3976.1F89602509P9803o28967m29993K63062R88311J36719k00195l27072l72467L54690
$$ plain form
3985.7 689466400 689693756 690119476 690359421 690354156 690389404 690680542 690872955 690586472 690516129 689889679
3995.4 689889679 689751740 690467911 690579834 690509949 690891418
4000.2 690891418
$$ packed form
3985.7F89466400K27356M25720K39945n265L5248K91138J92413k86483p0343o26450
3995.4F89889679j37939P16171J11923o9885L81469
4000.2F90891418
##END=$$ End of the data block
