##TITLE=Azida - LPD-51c $$ Begin of the data block
##JCAMP-DX=5.00 $$ ACD/SpecManager v 10.08
##SPECTROMETER/DATA SYSTEM=Alpha
##DATE=01 Dec 2014 08:11:42
##DATA TYPE=INFRARED SPECTRUM
##DATA CLASS=XYDATA
##ORIGIN=
##OWNER=
##NPOINTS=1765
##FIRSTX=399.76428223
##LASTX=3997.64306641
##MAXX=3997.64306641
##MINX=399.76428223
##MAXY=1.00815701
##MINY=0.61301720
##XFACTOR=1.0000000000
##YFACTOR=0.000000010000000
##FIRSTY=1.00000000
##DELTAX=2.03961372
##XUNITS=1/CM
##YUNITS=ARBITRARY UNITS
##XYDATA=(X++(Y..Y))
399.8 100000000 99912977 99890190 99950564 99884671 99810433 99915022 99968642 99839383 99773031 99845278 99819291
422.2 99819291 99762344 99728996 99630684 99548024 99554783 99510336 99400055 99369901 99346024 99219948 99131209 99151552
446.7 99151552 99132031 99030852 98952180 98907107 98854333 98815548 98790985 98746818 98676062 98607218 98551261 98486018
471.2 98486018 98439556 98446661 98455429 98414946 98359632 98329151 98275518 98186547 98137230 98096669 97986442 97889787
495.6 97889787 97835296 97694224 97485161 97345668 97197264 96951419 96749914 96585393 96295202 95968610
516 95968610 95735252 95447528 95083886 94833767 94615519 94274729 93978679 93777812 93464953 93102127
536.4 93102127 92887163 92653733 92268705 91925448 91607958 91116798 90625721 90354127 90167028 90091300
556.8 90091300 90394014 90949947 91435462 91871536 92294002 92540848 92715412 93043697 93395203 93657023
577.2 93657023 94022745 94479460 94782484 95028192 95380270 95637840 95756078 95985210 96239364 96294677
597.6 96294677 96345246 96522278 96601588 96599442 96715158 96808439 96751112 96734583 96772546 96662903 96507037
620 96507037 96481144 96411335 96206802 96050930 95915771 95648873 95392662 95292759 95255029 95287853 95423681
642.5 95423681 95413679 95109648 94750839 94463295 94079632 93593216 93141514 92654157 92092109 91664535
662.9 91664535 91420949 91233039 91287029 91617459 91937071 92224079 92584926 93036216 93483281 93914878
683.3 93914878 94316614 94555050 94526130 94203651 93497229 92346549 90982413 89900786 89520007 89914852
703.7 89914852 90830368 91890836 92840916 93620580 94252604 94725370 95016223 95179743 95317155 95462888
724.1 95462888 95613790 95792794 96000272 96182370 96319008 96443838 96517122 96471149 96336645 96141762
744.5 96141762 95828503 95418710 95030510 94678622 94341856 94126344 94091094 94146776 94299686 94648463
764.9 94648463 95119673 95571357 96011150 96423894 96694380 96847314 96975303 96983898 96787202 96494287
785.3 96494287 96125752 95560348 94821310 93964159 92810833 91224855 89417332 87769687 86650628
803.6 86650628 86299592 86543828 86849725 86898923 86825788 86825264 87002879 87529826 88444942 89492923 90450466
826 90450466 91248071 91732162 91803038 91635108 91371793 90970933 90532696 90298837 90349901 90718406 91532844
848.5 91532844 92717391 93956304 95081341 96060646 96750724 97079986 97181749 97090840 96730345 96212190
868.9 96212190 95708323 95237118 94876301 94809234 95026881 95384204 95865077 96436244 96928406 97292268
889.3 97292268 97614723 97869438 98005772 98112917 98229033 98271984 98263657 98297346 98348987 98397279 98535585
911.7 98535585 98781222 99040085 99301052 99574596 99773580 99875313 99956429 100000000 99958628 99856991
932.1 99856991 99726129 99508542 99223602 98964936 98747486 98577183 98530388 98603553 98688841 98741406 98752850
954.5 98752850 98651576 98428828 98197436 98039222 97993332 98125035 98421586 98760217 99061608 99317741
974.9 99317741 99492717 99569398 99609387 99640584 99627769 99591166 99570954 99528468 99439776 99356282 99286425 99183685
999.4 99183685 99059272 98933792 98751372 98459965 98044223 97442108 96510965 95213097 94086158 94072175
1019.8 94072175 95305830 96808606 97711837 97994763 98044193 98081738 98098356 98065680 97999996 97901285
1040.2 97901285 97775203 97656250 97558242 97476649 97423387 97398692 97365063 97297484 97213370 97127551 97036308
1062.6 97036308 96942914 96849900 96742529 96611911 96466833 96314210 96151841 95978159 95796543 95605731
1083 95605731 95398813 95184362 94983190 94799614 94623947 94451469 94278365 94081467 93828160 93503761
1103.4 93503761 93087560 92563671 92035615 91702867 91665411 91886294 92304134 92849839 93415982 93915778
1123.8 93915778 94307894 94572663 94753611 94906414 95000905 94992733 94918531 94829464 94710219 94559968 94439673
1146.3 94439673 94354218 94247854 94143069 94099009 94075578 94012606 93918735 93771791 93526548 93246269 93015909
1168.7 93015909 92785794 92466033 92030740 91452563 90760165 90139049 89734215 89468157 89197654 88847423
1189.1 88847423 88362998 87759024 87159896 86636764 86148357 85715699 85442013 85374075 85542643 85990071
1209.5 85990071 86606491 87144119 87475044 87604517 87491471 87122995 86600703 85978031 85226011 84401274
1229.9 84401274 83605504 82843572 82121301 81527281 81082761 80724025 80463070 80332518 80273265 80257010
1250.3 80257010 80344188 80518138 80693263 80880338 81111753 81320071 81485492 81693512 81950647 82207453
1270.7 82207453 82497746 82851619 83215469 83579135 83989245 84409088 84775126 85121077 85461199 85722303
1291.1 85722303 85913420 86118752 86344749 86571980 86851299 87198943 87570268 87985986 88475227 88974530
1311.5 88974530 89432472 89881271 90328819 90710729 90973461 91092688 90996540 90634751 90038782 89228857
1331.9 89228857 88241076 87230933 86419070 85967577 85919076 86206132 86720055 87372577 88170826 89128155
1352.3 89128155 90191483 91273957 92259419 93103218 93854177 94468129 94892299 95215791 95485842
1370.6 95485842 95774043 96155447 96542865 96878850 97143912 97296655 97430539 97669935 97875565 97889531
1391 97889531 97827721 97784072 97689503 97532457 97282404 96895975 96413964 95815068 95002252 93916339
1411.4 93916339 92564541 90994018 89273322 87772691 87209648 87811655 89324379 91052461 92378080
1429.8 92378080 92813325 92386347 91406024 90155423 89009959 88042337 87269866 86774904 86623174
1448.1 86623174 86771864 87161899 87910110 89556307 91926193 93475890 94478130 95530790 96420532
1466.5 96420532 96841669 97079474 97448152 97813141 97957414 97883546 97627497 97238237 96701771 96024442
1486.9 96024442 95282692 94547564 93961805 93689924 93689090 93472981 92801547 91835111 90474933 88503444
1507.3 88503444 87048954 86894536 88055253 90469521 93471116 95886898 97661304 98782152 99336529
1525.6 99336529 99695486 99796247 99815291 99966913 99923843 99673694 99740225 100000000 100008702 99921155 99791026
1548.1 99791026 99630994 99465406 99285907 99039412 99000442 99242240 99058491 98653114 98265308 97938305
1568.5 97938305 97596520 97098142 96670830 96658826 96792036 96844834 96913940 96897894 96728492 96476018
1588.9 96476018 96126783 95606029 94911337 94045115 92995596 91885096 90904242 90076482 89307630
1607.2 89307630 88653547 88334054 88488334 89333934 90748835 91574812 91755825 91834253 91819656 91664255
1627.6 91664255 91462338 91217768 91036725 91174918 91416734 91479248 91475022 91493219 91792244 92254692
1648 92254692 92322624 92540503 93430865 93801665 93789512 93885565 94188911 94483596 94551480 94669795 94953680
1670.5 94953680 95074594 95183331 95366573 95338261 95152289 95120925 95478338 95649368 95536989 95391953
1690.9 95391953 95135421 94909048 94804406 94813728 95099217 95294994 95484602 95818549 95986110 95944440
1711.3 95944440 95797092 95708066 95947522 96256816 96338397 96452719 96684724 96903813 97074014 97227812
1731.7 97227812 97667795 98129159 98184454 98256344 98421866 98472738 98457271 98470873 98613298 98770440 98747903
1754.1 98747903 98693150 98676580 98651892 98721826 98729867 98605591 98513561 98502827 98638535 98750508 98682332
1776.5 98682332 98591399 98571604 98577833 98578715 98509973 98319912 98210275 98312831 98342764 98250526 98239571 98352659
1801 98352659 98486263 98579526 98648876 98745495 98915684 99068964 99135172 99198228 99274969 99279791 99259371 99302125
1825.5 99302125 99325943 99376112 99466473 99455482 99399346 99360329 99279702 99168181 99187320 99284905 99266899
1847.9 99266899 99190891 99116749 99067867 99028444 98961562 98889875 98822922 98700237 98549628 98541665 98607415
1870.3 98607415 98525494 98378700 98280412 98186630 98068750 97955006 97829461 97649002 97483420 97359568
1890.7 97359568 97165513 96935230 96741152 96540910 96321458 96136349 96011436 95935702 95937455 96023375
1911.1 96023375 96108776 96161777 96297097 96488923 96592826 96668190 96738195 96751338 96730435 96708602 96695280
1933.6 96695280 96666241 96601480 96519238 96481216 96481347 96446377 96391350 96336609 96272695 96210837 96146214 96063221
1958.1 96063221 95972353 95878732 95770174 95674568 95608020 95521945 95400774 95272231 95143324 95001453 94840580
1980.5 94840580 94672048 94497347 94306779 94106776 93925351 93763268 93565649 93329555 93093234 92848694
2000.9 92848694 92587382 92322516 92052972 91766912 91464376 91146451 90815145 90483028 90145171 89778513
2021.3 89778513 89375257 88946664 88497293 88010746 87476897 86905408 86289972 85616839 84901923 84162998
2041.7 84162998 83388495 82574278 81741852 80895436 80022717 79130965 78237921 77342534 76444948 75562727
2062.1 75562727 74701101 73849434 72999996 72144169 71258074 70326084 69347990 68315059 67218524
2080.4 67218524 66078204 64939797 63857383 62899852 62137216 61609161 61326987 61301720 61543387
2098.8 61543387 62047297 62795633 63757396 64874947 66066623 67258346 68394822 69439971 70386100
2117.1 70386100 71257687 72089797 72910416 73749232 74627393 75542694 76485604 77454340 78440845 79422706
2137.5 79422706 80382425 81315237 82211471 83055043 83839989 84565461 85229343 85837919 86400175 86916840
2157.9 86916840 87394178 87847191 88277376 88677478 89058024 89432698 89789718 90118444 90429783 90728235
2178.3 90728235 91009116 91277742 91537213 91780001 92006522 92226046 92437524 92634088 92820209 93000728
2198.7 93000728 93172926 93337768 93500292 93659717 93813825 93972880 94147450 94337946 94548661 94785714
2219.1 94785714 95041364 95307475 95592695 95904779 96237808 96581471 96921813 97241080 97530925 97796392
2239.5 97796392 98039454 98255861 98448843 98622912 98779565 98927116 99069756 99198282 99308819 99409717
2259.9 99409717 99504924 99592435 99672037 99743187 99804246 99856144 99901098 99939746 99974006 100000000 100019228 100018001
2284.4 100018001 100009131 99996173 99968517 99927878 99887508 99849623 99813455 99785411 99761355 99732864 99709105 99703759
2308.9 99703759 99712735 99725115 99720037 99675882 99617237 99590117 99592477 99567544 99502653 99461371 99462450 99447232
2333.3 99447232 99410701 99404311 99443382 99541736 99772793 100059295 100000000 99554414 99120772 98965371 98978209
2355.8 98978209 99032861 99116123 99225211 99369198 99531686 99679613 99809331 99922168 100004649 100056279
2376.2 100056279 100083470 100078046 100033748 99970835 99909800 99849242 99792665 99751008 99712932 99664140 99612814 99564832
2400.6 99564832 99509424 99448574 99397075 99348301 99289793 99229234 99172044 99106002 99028921 98952007 98871982 98783827
2425.1 98783827 98699325 98621863 98543143 98471427 98417574 98370010 98320746 98282284 98256242 98230928 98210329 98202533
2449.6 98202533 98194003 98175842 98163533 98157692 98143011 98127747 98123217 98112589 98087716 98066956 98052877 98034626
2474.1 98034626 98021567 98022532 98023748 98020101 98025250 98034877 98036903 98044413 98068827 98094386 98110282 98129147 98154652
2500.6 98154652 98177958 98204523 98240399 98276824 98308444 98337644 98360443 98375368 98393267 98419219 98443031 98458970
2525.1 98458970 98475009 98492938 98507857 98526895 98554796 98578846 98595804 98616105 98638135 98660302 98690969 98727971
2549.5 98727971 98761982 98793447 98823935 98849189 98871112 98895347 98917717 98931688 98940527 98948938 98954552 98959064
2574 98959064 98969537 98983175 98996806 99015826 99037689 99054241 99068832 99089855 99116778 99142271 99162042 99178594
2598.5 99178594 99193960 99210066 99236065 99274755 99316788 99355352 99389690 99419063 99438530 99445289 99441898 99427807
2623 99427807 99404067 99377906 99361420 99366689 99391115 99421215 99449193 99471658 99484760 99489278 99489671 99486804 99482328
2649.5 99482328 99479210 99471325 99454623 99438810 99428391 99417764 99406737 99397898 99388337 99376845 99367648 99361169 99354845
2676 99354845 99346071 99332607 99313664 99291563 99273455 99261266 99252260 99246877 99246639 99246567 99238771 99229193 99222612 99209434
2704.5 99209434 99189025 99166733 99138725 99103659 99068499 99039054 99015504 98997456 98985183 98974395 98955661 98931068
2729 98931068 98914921 98906487 98901904 98903745 98901516 98890507 98885649 98892558 98892760 98873454 98843169 98809022 98772484 98738486
2757.6 98738486 98708141 98673981 98631465 98583198 98530036 98474449 98425502 98375088 98298252 98201632 98109567 98021519
2782 98021519 97935164 97863448 97806853 97742575 97664011 97593659 97540849 97485501 97413826 97340244 97273475 97205490
2806.5 97205490 97129482 97033679 96915376 96791023 96664912 96523541 96359593 96168143 95927924 95614338
2826.9 95614338 95217699 94721371 94093502 93326294 92448366 91501737 90557897 89718354 89056438 88587773
2847.3 88587773 88294047 88159990 88166726 88269782 88419229 88564450 88651472 88652086 88571894 88425857 88240010
2869.7 88240010 88057148 87897551 87766016 87694502 87700677 87750953 87794602 87793571 87725526 87573069 87332821
2892.2 87332821 87016869 86618704 86129844 85580236 85001975 84405124 83806854 83238930 82726681 82267964
2912.6 82267964 81847405 81469685 81157255 80935621 80835700 80874044 81051916 81359273 81765223 82263088
2933 82263088 82871765 83585709 84380281 85232961 86106253 86947691 87721980 88433093 89098603 89691108
2953.4 89691108 90180844 90594506 90963244 91290116 91579622 91850847 92111397 92353547 92586952 92817622
2973.8 92817622 93018740 93181849 93308461 93364745 93344051 93298972 93287808 93346465 93465018 93586248 93643719
2996.2 93643719 93573797 93353522 93018633 92603683 92131764 91655463 91240394 90908438 90647298 90433431
3016.6 90433431 90213847 89970571 89802784 89851862 90177006 90746146 91468143 92184162 92737746 93095374
3037 93095374 93308765 93390745 93313372 93092179 92823732 92638355 92600811 92723417 93021053 93448818 93931162
3059.4 93931162 94443828 94972020 95470810 95865113 96107328 96235901 96306860 96334869 96311277 96225190
3079.8 96225190 96098876 95975351 95879757 95836067 95855707 95936328 96108395 96372443 96644700 96860570
3100.2 96860570 97003198 97077501 97130466 97172552 97159499 97110742 97078580 97039801 96945047 96791542 96618873
3122.6 96618873 96481174 96420342 96433306 96488881 96578085 96679169 96762645 96806151 96787196 96730000 96672958
3145.1 96672958 96624082 96592021 96572602 96518999 96415043 96303713 96208245 96119577 96029979 95940590 95852107
3167.5 95852107 95754004 95641071 95521849 95408052 95312160 95216966 95099121 94976187 94860715 94741750
3187.9 94741750 94617027 94485354 94343770 94210553 94092846 93964005 93817949 93670225 93520027 93371791
3208.3 93371791 93226433 93076128 92925614 92768145 92610556 92464775 92314255 92159492 92016160 91885722
3228.7 91885722 91768956 91648084 91484040 91290355 91112882 90945691 90785128 90657198 90522701 90333956
3249.1 90333956 90135711 89980781 89845854 89680624 89493370 89314693 89143229 88978046 88829583 88684201
3269.5 88684201 88508129 88311064 88120168 87926090 87725478 87532330 87349337 87169969 87004787 86874908
3289.9 86874908 86757058 86604190 86418080 86225259 86042392 85894811 85771954 85618949 85417974 85185367
3310.3 85185367 84944242 84715360 84491831 84265929 84040278 83824283 83613598 83368939 83088344 82809973
3330.7 82809973 82548571 82320243 82124132 81896698 81616002 81324679 81033099 80762190 80534381 80292654
3351.1 80292654 79994875 79696107 79441792 79209661 78968900 78730941 78536004 78358537 78125185 77827603
3371.5 77827603 77534246 77290297 77076524 76867634 76652312 76445413 76259851 76084751 75928944 75781256
3391.9 75781256 75587636 75378543 75231397 75103110 74910116 74671465 74464995 74307531 74161434 74008960
3412.3 74008960 73838240 73644793 73481762 73390085 73309320 73191440 73087621 73024231 72965926 72911000 72868228
3434.7 72868228 72800666 72681266 72569817 72513819 72509944 72581041 72647011 72629535 72613603 72649235 72709835
3457.1 72709835 72781652 72865832 72975016 73119628 73274660 73363990 73384750 73436093 73552567 73674995 73793519
3479.6 73793519 73948312 74100012 74228054 74379849 74536282 74664021 74811047 75005078 75157720 75252932
3500 75252932 75456727 75734568 75860506 75961751 76219374 76483262 76641059 76768267 76910752 77071726
3520.4 77071726 77315927 77605861 77858728 78139257 78396982 78549373 78739375 79032987 79263270 79373193
3540.8 79373193 79533798 79919922 80393893 80623144 80771202 81100839 81380451 81521714 81711900 81877148
3561.1 81877148 81844091 82080334 83095145 83921635 83944553 83882684 84094024 84410906 84732729 84919161
3581.5 84919161 84871930 85100496 86097032 86818987 86738920 86825866 87320209 87720865 88080126 88416493
3601.9 88416493 88390964 88337988 88855380 89520836 89920753 90165085 90179354 90688145 91740656 91906178
3622.3 91906178 91110736 90574223 91880000 93645340 93739927 93506444 93570900 93662030 93742234 93507838
3642.7 93507838 92836595 92706454 94420928 96209723 95904481 95320445 95815212 96128398 95879388
3661.1 95879388 95629179 95133221 94611639 95192981 95974445 95774096 96754885 98160970 98002845 97448206
3681.5 97448206 96816176 96085662 96316284 97915864 98876143 98567784 98018259 97600740 97512913 98026913
3701.9 98026913 98255652 97572345 96901137 97368431 98847044 99324000 98594332 97937930 97799587 97975844
3722.3 97975844 98277664 98535019 98147452 97307944 97173846 98297316 99607408 99402142 97789097
3740.6 97789097 96913439 98131090 98494017 97796249 98813754 99910820 99222064 98368567 98522758
3759 98522758 98761463 98293442 97955179 98019069 98437041 98965240 98761886 98097271 97847241 98310423
3779.4 98310423 98609108 98437512 98458344 98507816 98346466 98025554 97623938 97534150 97404271 97387373
3799.8 97387373 98363233 98654461 98441845 99002188 98773187 97548199 96885496 97446132 97693545 97986329
3820.2 97986329 99073994 98970890 98291886 97914523 97583807 97410393 97172344 97312480 98279053 98873514
3840.6 98873514 98857701 98686129 97917342 96413726 95269966 96992707 100000000 99797112 98243326
3858.9 98243326 97343862 97484446 97914177 97660756 97797835 98661256 98950672 98703891 98006243 97726101
3879.3 97726101 98143983 98213214 98599607 98788792 98347151 98697144 99029738 98231000 97489637 97697991
3899.7 97697991 98495179 99476862 100000000 99649686 99092990 98733318 98451489 98554796 99080950 99318689
3920.1 99318689 99165791 99205738 99324775 99116379 99077487 99527365 99801719 99616176 99333906 99251729
3940.5 99251729 99503410 99691182 99629575 99764621 100000000 100010443 99929118 99908549 99923712 100001991 100129867
3962.9 100129867 100160897 100122643 100137341 100199151 100278389 100372875 100425482 100428569 100460196 100520456 100539231 100532162
3987.4 100532162 100573409 100647438 100716162 100781858 100815701
3997.6 100815701
##END=$$ End of the data block
