##TITLE=Atividade 1 G2 $$ Begin of the data block
##JCAMP-DX=5.00 $$ ACD/SpecManager v 10.08
##SPECTROMETER/DATA SYSTEM=Alpha
##DATE=19 Nov 2014 08:19:18
##DATA TYPE=INFRARED SPECTRUM
##DATA CLASS=XYDATA
##ORIGIN=
##OWNER=
##NPOINTS=1765
##FIRSTX=399.76428223
##LASTX=3997.64306641
##MAXX=3997.64306641
##MINX=399.76428223
##MAXY=1.00259078
##MINY=0.67906094
##XFACTOR=1.0000000000
##YFACTOR=0.000000010000000
##FIRSTY=1.00000000
##DELTAX=2.03961372
##XUNITS=1/CM
##YUNITS=ARBITRARY UNITS
##XYDATA=(X++(Y..Y))
399.8A00000000o62774l91984o8122N5522Q2832J52314J14787M565o5493k12389l50154
422.2I8659104l74758k84767r7591K3365L6490K6369n257n2512p6157j00529j38378
444.6I7615379j56146j32787j03063j22541j29962j20699j81795k04867j33967p1544
465I6258008o2924l7933J7459k4075j26654j32447q0264r3299j73390j93637j47516
487.5I5203328j80459k76571k83331k36887k47645k19369j19323j07515k08610k57635
507.9I3065983j76400j26016j60533r7269J5801m6670j74588j30570l7730j24890k41482
530.3I1765636j61814m0865j26768k49815j42979K7710r423j14286n4491J2946q2344
552.7I0823507j47384o7127n2625j51425j13696Q7070J38104j3035m0084J03020Q9735
$$ plain form
399.8 100000000 99337226 98945242 98877120 98932642 99015474 99167788 99282575 99287140 99221647 99009258 98659104
422.2 98659104 98284346 97999579 97901988 97925353 97961843 97988212 97982955 97930443 97854286 97753757 97615379
444.6 97615379 97459233 97326446 97223383 97100842 96970880 96850181 96668386 96463519 96329552 96258008
465 96258008 96195084 96157151 96174610 96150535 96023881 95891434 95811170 95717871 95544481 95350844 95203328
487.5 95203328 95022869 94746298 94462967 94226080 93978435 93759066 93639743 93532228 93323618 93065983
507.9 93065983 92889583 92763567 92603034 92505765 92521566 92474896 92300308 92169738 92132008 92007118 91765636
530.3 91765636 91603822 91562957 91436189 91186374 91043395 91071105 91061682 90947396 90892905 90905851 90823507
552.7 90823507 90676123 90608996 90556371 90404946 90291250 90378320 90516424 90503389 90463305 90566325 90656060
575.2I0656060j11330j82485j23376j82628k75058j22625J31333J28681l9178o7789
595.6H9811605n6004k20454l49104j61279J35500K00545J04273M6712n8961k02173
616H9250660l243M64404N55718J66339j86104j81740j1146J72227M35048O38515N21624
638.4I1822302K08724P8434J54036J24872m0317p8148L0005J47063K90585M67073N19187
660.8I3723816L20226J3339j08635J75857L21806J44529J00285J71786J33658Q2558
681.2I5079225K13731L42756K23237M0073N9390J58602J30611P0787J32775J81055
701.6I6632242P1967k2996N0170J11264J9615m0656L6931M6462r7138j76108j31696
724.1I6500057j66976l24733m06330l57706l63695m64487n36281o81162j140541j813263
$$ plain form
575.2 90656060 90544730 90362245 90238869 90056241 89781183 89658558 89789891 89918572 89879394 89811605
595.6 89811605 89755601 89535147 89186043 89024764 89160264 89360809 89465082 89511794 89452833 89250660
616 89250660 89247417 89711821 90267539 90433878 90247774 90066034 90054888 90227115 90662163 91300678 91822302
638.4 91822302 92031026 92109460 92263496 92388368 92348051 92269903 92299908 92446971 92737556 93204629 93723816
660.8 93723816 94044042 94057381 93948746 94124603 94446409 94590938 94691223 94863009 94996667 95079225
681.2 95079225 95292956 95635712 95858949 95899022 95958412 96117014 96247625 96318412 96451187 96632242
701.6 96632242 96704209 96681213 96731383 96842647 96862262 96821606 96858537 96904999 96807861 96631753 96500057
724.1 96500057 96333081 96008348 95602018 95244312 94880617 94416130 93879849 93198687 92058146 90244883
744.5I0244883k270728k256525j870995j287347o04314L7032N04035Q25214J086271
762.8H4407526J246357J205152J059998J025915J116746J156456J075351R60261Q38536
781.2I4092298O63137M93538M28594L91823K55459Q9532L3528P4190J24901K04557
801.6I6851557L45785M25517L44640K20657J94573K19584K12300K24161K93845L17150
822I9649769K17033Q8834L5376Q988m8727j35344j47468j34337j88953k75367l28785
844.4I8741019l76594m22120l85720k28774m1181M8566L0142j7757p7533j49483j39081
866.8I6981484q530O1059l6293l2324K67542N36364M32032R9749j67829k98482k85989
889.3I7548783p4184K49410M49532M22335K82323J50120J4508j69790l54433m13620
$$ plain form
744.5 90244883 87974155 85717630 83846635 82559288 81954974 81992006 82496041 83321255 84407526
762.8 84407526 85653883 86859035 87919033 88944948 90061694 91218150 92293501 93253762 94092298
781.2 94092298 94755435 95248973 95677567 96069390 96324849 96414381 96447909 96522099 96647000 96851557
801.6 96851557 97197342 97622859 97967499 98188156 98382729 98602313 98814613 99038774 99332619 99649769
822 99649769 99866802 99955636 99991012 100000000 99951273 99815929 99668461 99534124 99345171 99069804 98741019
844.4 98741019 98364425 97942305 97556585 97327811 97286630 97335196 97365338 97347581 97270048 97120565 96981484
866.8 96981484 96972954 97034013 96997720 96965396 97232938 97769302 98201334 98301083 98133254 97834772 97548783
889.3 97548783 97474599 97724009 98173541 98595876 98878199 99028319 99042827 98873037 98518604 98104984
909.7I8104984k67566L1305L10564M14866L34346J67251K8235l1573o1065j11991j50859
932.1I8768497j43838j33133j52922j65474j32537q9497r3251j32048j70559k32750
952.5I7322488l38864m24219m08584k83801r6405R9731K47282K85786K18809J37162
972.9I6759385J03706P9119J5789n4067r8938j75953l42845n34761o41668o55246n83041
995.3I3871480m10157k22504j00303m1437m4364p1162o8927m8268m0996o5654j20253
1017.8I2637455j41519n5033J01799J86366J24568J7780q65O2031J06925J09577J39075
1040.2I3288159J83446J41251K3895o0576r3919j02419k1773J89715M04793M68046
1060.6I4420618L88908K72036J58614N3119j877N346J7822K009r537p486n1618j67113
$$ plain form
909.7 98104984 97837418 97868723 98179287 98594153 98928499 99095750 99123985 99092412 99031347 98919356 98768497
932.1 98768497 98624659 98491526 98338604 98173130 98040593 97951096 97857845 97725797 97555238 97322488
952.5 97322488 96983624 96559405 96150821 95867020 95770615 95870346 96117628 96403414 96622223 96759385
972.9 96759385 96863091 96942210 96957999 96903932 96804994 96629041 96286196 95751435 95109767 94454521 93871480
995.3 93871480 93461323 93238819 93138516 93097079 93052715 92981553 92912626 92864358 92823362 92757708 92637455
1017.8 92637455 92495936 92440903 92542702 92729068 92853636 92871416 92870551 92932582 93039507 93149084 93288159
1040.2 93288159 93471605 93612856 93636751 93576175 93482256 93379837 93358064 93547779 93952572 94420618
1060.6 94420618 94809526 95081562 95240176 95293295 95291418 95296764 95314586 95316595 95307058 95299572 95247954 95080841
1085.1I5080841k80416l27266l28153l05033k48843j97178k21932l15732l88575l78257
1105.5I2089456k68286j5456L71641O83821P06446N08290K91121R6822j40846l36832
1125.9I3986177k64710R2221M23234M90785L76844K17283R126k99657p35235j206046
1146.3I3090022j401389j057965l40694L42536P74133R78560J024222R34207P38442
1164.6I5082074N12594L29477J91271N9027o6424j53190k03132k36452k33787j76013
1185I5105445j04117p2014p5782p6967p1335q7380j21242j38670j37586j40166j44380
1207.5I3935806j38039j45894k05082l04210l90822m30494m19134l48556k17730o7598
1227.9I1268247L5745N5397j2434j70088l86643n65940o39087o37609n98764n01383
$$ plain form
1085.1 95080841 94800425 94473159 94145006 93839973 93591130 93393952 93172020 92856288 92467713 92089456
1105.5 92089456 91821170 91805714 92177355 92861176 93567622 94075912 94367033 94463855 94323009 93986177
1125.9 93986177 93721467 93813688 94236922 94727707 95104551 95321834 95330960 95031303 94296068 93090022
1146.3 93090022 91688633 90630668 90289974 90632510 91406643 92385203 93409425 94343632 95082074
1164.6 95082074 95594668 95924145 96115416 96174443 96108019 95954829 95751697 95515245 95281458 95105445
1185 95105445 95001328 94929314 94853532 94776565 94705230 94617850 94496608 94357938 94220352 94080186 93935806
1207.5 93935806 93797767 93651873 93446791 93142581 92751759 92321265 91902131 91553575 91335845 91268247
1227.9 91268247 91303992 91359389 91346955 91176867 90790224 90224284 89585197 88947588 88348824 87847441
1248.2H7847441l75402l64112n31972o85221n91373k70891J27214N22458Q27617R08684
1268.6H7414443P34103M25655J40959l9029q5926K6023K64448M98116N84495M78536
1289I0441823K42680k0003j99693j89323J2559K35784L12656K63000J99091J56421
1309.4I1454995J05297M6772M1401J25420K56432L85230M79305M85814L81315K23279
1329.8I3985260J00857M9877M8220N9968M8584J1998j4293n269N1957J19472J37436
1352.3I4594067J03599M7034k062n5313j56325k43789k35057k09338j76704j07592
1372.7I3558520q4400j11145j17057j26881j37865j05000j14345k30390l18241l95108
1393.1I1818088n28311n45288l81112p0965L13884N73868N55139M08864K97016K45095
$$ plain form
1248.2 87847441 87472039 87107927 86575955 85890734 85299361 85028470 85155684 85678142 86505759 87414443
1268.6 87414443 88148546 88574201 88715160 88676131 88590205 88616228 88880676 89378792 89963287 90441823
1289 90441823 90684503 90664500 90464807 90275484 90288043 90523827 90836483 91099483 91298574 91454995
1309.4 91454995 91560292 91607064 91648465 91773885 92030317 92415547 92894852 93380666 93761981 93985260
1329.8 93985260 94086117 94135994 94184214 94244182 94292766 94304764 94290471 94285202 94337159 94456631 94594067
1352.3 94594067 94697666 94744700 94742638 94687325 94531000 94287211 94052154 93842816 93666112 93558520
1372.7 93558520 93474120 93362975 93245918 93119037 92981172 92876172 92761827 92531437 92213196 91818088
1393.1 91818088 91289777 90744489 90363377 90292412 90606296 91180164 91735303 92144167 92441183 92686278
1413.5I2686278K44993K16853O3151q7052j72180l35747n87601j014286j416349j392812
1433.9H8205248j137799p32475l90554n94002j213586j667011j419085l48825P23768
1452.2H1425679J187753J293314J090640O96349N61392K54077m93503j073891j469290
1470.6H3472520k013415j906735j063096k44194O13504J494634K132607K478760K510226
1488.9H7474811K036184J342726J044881R10157N56100L31133L91793O07270O15705
1507.3I5310760J94722Q0097J55276J73491J29527P8291j8293j73015k01863j99753
1527.7I5529240j94138j87260l14349l86023m16649r85711j747609j761216j375967
1546H8160318n32263N29837J324064J578927J316678O48773n25027j010567j069016
$$ plain form
1413.5 92686278 92931271 93148124 93211275 93124223 92952043 92616296 92028695 91014409 89598060 88205248
1433.9 88205248 87067449 86334974 85944420 85350418 84136832 82469821 81050736 80701911 81425679
1452.2 81425679 82613432 83906746 84997386 85693735 86255127 86509204 86015701 84941810 83472520
1470.6 83472520 81459105 79552370 78489274 78245080 78858584 80353218 82485825 84964585 87474811
1488.9 87474811 89510995 90853721 91898602 92808759 93364859 93695992 94087785 94695055 95310760
1507.3 95310760 95505482 95585579 95740855 95914346 96043873 96122164 96103871 95930856 95728993 95529240
1527.7 95529240 95335102 95147842 94833493 94447470 94030821 93045110 91297501 89536285 88160318
1546 88160318 87628055 88157892 89481956 91060883 92377561 93026334 92501307 91490740 90421724
1564.4I0421724j073491r55898p23064q1092O37967R41801L89665k87354q67337j473856
1584.8H6929065j879030j812834j284635o68639k94143j15514O3938K30855K13414
1603.2H1382477l5208m01467p73806j032322j141209j489812k067470j803947j237821
1621.5G1399415q46011j96731O00052J289201J723367K220112K923518K527678J734352
1639.9H3374953J521236J437569J497578J329857Q63403R04847R76574M59015L52389
1658.2I2717421M70841N37986M80347M15951M65692M25899K83122K41512K03019J88386
1678.6I6430176K79069L56800K27183J3345K6471P0524J07938J97166K03032R3013
1699I8004717n1636p2497p218k9934n0139L1394J44475K00993J15145l9965k6441N4973
$$ plain form
1564.4 90421724 89348233 88392335 87669271 87588179 88226146 89167947 89557612 89270258 88402921 86929065
1584.8 86929065 85050035 83237201 81952566 81283927 80989784 80874270 80938208 81169063 81382477
1603.2 81382477 81347269 80945802 80171996 79139674 77998465 76508653 74441183 72637236 71399415
1621.5 71399415 70553404 70356673 70956725 72245926 73969293 76189405 79112923 81640601 83374953
1639.9 83374953 84896189 86333758 87831336 89161193 90024596 90929443 91906017 92365032 92717421
1658.2 92717421 93188262 93726248 94206595 94622546 95088238 95514137 95797259 96038771 96241790 96430176
1678.6 96430176 96709245 97066045 97293228 97306573 97333044 97403568 97511506 97708672 97911704 98004717
1699 98004717 97953081 97880584 97873366 97843432 97793293 97824687 97969162 98170155 98285300 98245335 98218894 98273867
1723.5I8273867J00899J51926K12247K29579J77783M6962L7754R8365R2465Q4877J06329
1745.9I9613053J09183M3947n1576n0074l40J7316L5965K6566q255L4028J02502J10406
1770.4I9982721J7279q1217o5875j1522l189j5372j4478j2594K9206Q0770K6131o0123
1794.9I9871737l5817K1702J7274l1960l2634J7774M6623J0699l1227j3548P582K92
1819.4I9848497J7357N6749N1630K4921K527m8411n6499k3026l695J9979N5314M0638
1843.8I9985981l1620n5987m4328l5274j3393Q112J854j4323l964L4618O6305L4064
1868.3I9932045m6665o5767l8577k3532o699O920j365o992J7399L0106j2225l7562
1892.8I9747086j5808j1396k8115k6817m339J0270J97j5402j7637r364K986P582K158
$$ plain form
1723.5 98273867 98374766 98526692 98738939 98968518 99146301 99193263 99231017 99329382 99421847 99506724 99613053
1745.9 99613053 99722236 99766183 99714607 99664533 99664193 99681509 99717474 99744040 99735785 99769813 99872315 99982721
1770.4 99982721 100000000 99918783 99852908 99841386 99838197 99822825 99808347 99795753 99824959 99905729 99931860 99871737
1794.9 99871737 99835920 99857622 99874896 99842936 99810302 99828076 99874699 99885398 99854171 99840623 99848205 99848497
1819.4 99848497 99865854 99922603 99974233 99999154 100001681 99953270 99896771 99873745 99870050 99890029 99945343 99985981
1843.8 99985981 99954361 99898374 99854046 99818772 99805379 99813491 99815345 99801022 99797058 99831676 99897981 99932045
1868.3 99932045 99885380 99819613 99781036 99757504 99750805 99757725 99756360 99749368 99766767 99796873 99784648 99747086
1892.8 99747086 99731278 99719882 99691767 99664950 99660611 99670881 99671078 99655676 99638039 99628675 99631661 99639243 99641401
1919.3I9641401n73k1922m1145j7810l004j8835j9318J156Q065L951M656p183k6065
1945.8I9503374l3313k2077P86K176j7053j4687O205O241l570L516O706j0479k2906
1972.3I9404919j1122Q184M744j3375j0264Q309P957m435O26L779j4674k4599j0801
1998.8I9349248O009J567j1784m613J1414M363j1736j186J4937Q9k0158j0842P820
2025.4I9335128J377j4877o229J1754N281r960j347J1772o74j4734k599J3864K343
2051.9I9331099j6248n639J3596N543r203L743J8239L040j3226j282J3912L493q690
2078.4I9338377N090J9306M703j1576K528J7040l45j4401O044K1124M35j2994N824
2104.9I9381155J5509l123j1385R537J9497r66j0991Q100J6105l183r834J0389J8126
$$ plain form
1919.3 99641401 99640828 99618906 99577761 99559951 99556947 99538112 99518794 99519950 99528015 99531966 99536622 99529439 99503374
1945.8 99503374 99470061 99447984 99448770 99450946 99433893 99419206 99425411 99431652 99428082 99431598 99438304 99427825 99404919
1972.3 99404919 99393797 99401981 99406725 99393350 99383086 99391395 99399352 99394917 99395543 99399322 99384648 99360049 99349248
1998.8 99349248 99355257 99356824 99345040 99340427 99351841 99356204 99344468 99343282 99358219 99358308 99338150 99327308 99335128
2025.4 99335128 99336505 99321628 99315399 99327153 99332434 99322474 99321127 99332899 99332225 99317491 99314892 99328756 99331099
2051.9 99331099 99314851 99309212 99322808 99328351 99319148 99322891 99341130 99344170 99330944 99329662 99343574 99347067 99338377
2078.4 99338377 99343467 99362773 99367476 99355900 99358428 99375468 99375123 99360722 99366766 99387890 99388325 99375331 99381155
2104.9 99381155 99396664 99393541 99382156 99391693 99411190 99410224 99399233 99407333 99423438 99420255 99410421 99420810 99438936
2131.4I9438936j91o086J1635J5503l189o133J4728J7697m965q929J2988J5682n472
2157.9I9492204n156J6636J6075n638p123J1313R906r465p516R811M774j4221j0258
2184.5I9501342O789J984j1479m411P587J139r757k998O937l385j5563n615O748j103
2213I9478215j1659n895n78r560j5843q267k599r597j3488m971l272j3787j5747n103
2241.6I9357849j830j2129j6958j1622j2327j8811j5736n251m065j3071j6123j0014
2266I9219912p242j1205j2446q225p922j3268j2278m274o699k0338k4300k0522k6298
2292.5I9044895l4988l5822l6740m3357n0634n7161o4438o8415o7001o1858n9235p4291
2317I8390955j00076j03587p7117n5742o4916p7176o4021m4137m0597m5448m5878l0500
$$ plain form
2131.4 99438936 99438745 99432659 99444294 99459797 99456608 99450475 99465203 99482900 99477935 99469006 99481994 99497676 99492204
2157.9 99492204 99487048 99503684 99519759 99514121 99506998 99518311 99528217 99518752 99511236 99521047 99525821 99511600 99501342
2184.5 99501342 99508131 99510115 99498636 99494225 99501812 99502951 99493194 99490196 99497133 99493748 99478185 99472570 99479318 99478215
2213 99478215 99466556 99460661 99460083 99450523 99434680 99426413 99423814 99414217 99400729 99395758 99392486 99378699 99362952 99357849
2241.6 99357849 99356019 99343890 99326932 99315310 99302983 99284172 99268436 99263185 99259120 99246049 99229926 99219912
2266 99219912 99212670 99201465 99189019 99180794 99172872 99159604 99147326 99143052 99136353 99116015 99091715 99071193 99044895
2292.5 99044895 99009907 98974085 98937345 98893988 98843354 98786193 98721755 98653340 98586339 98524481 98465246 98390955
2317 98390955 98290879 98187292 98110175 98054433 97989517 97912341 97848320 97804183 97763586 97718138 97672260 97641760
2341.5I7641760J9103J09935J30260O384j53303k26486j94782j31381o6435j055N7268
2363.9I7191268R6214J18411J35743J45620J45221J39022J29503J16533R4682O3729
2384.3I8375946L0774N472o729j0729j6219k1523k1106k0492k2757k2233j6671j5545
2408.8I8238188k2739k5803k0641j7738j9718k0110j7154j5885j8668k0880k0313j7762
2433.3I8000777j7047j9378j8447j5646j7894j9979j7661j8865k1213j7453j3417j4501
2457.8I7789276j6815j6206j2976j2100j5283j5866j3626j5306j9157j9443j8031j7387
2482.2I7597080j6897j6308j7453j9627j8907j6826j6582j6201j2672r507j2451j6076
2506.7I7407573j3136r239r602r400q082r329j3309j8448k1541k1690k3174k6656k8550
$$ plain form
2341.5 97641760 97660863 97770798 97901058 97907442 97754139 97527653 97332871 97201490 97135055 97134000 97191268
2363.9 97191268 97287482 97405893 97541636 97687256 97832477 97971499 98101002 98217535 98312217 98375946
2384.3 98375946 98406720 98412192 98405463 98394734 98378515 98356992 98335886 98315394 98292637 98270404 98253733 98238188
2408.8 98238188 98215449 98189646 98169005 98151267 98131549 98111439 98094285 98078400 98059732 98038852 98018539 98000777
2433.3 98000777 97983730 97964352 97945905 97930259 97912365 97892386 97874725 97855860 97834647 97817194 97803777 97789276
2457.8 97789276 97772461 97756255 97743279 97731179 97715896 97700030 97686404 97671098 97651941 97632498 97614467 97597080
2482.2 97597080 97580183 97563875 97546422 97526795 97507888 97491062 97474480 97458279 97445607 97436100 97423649 97407573
2506.7 97407573 97394437 97385198 97375596 97366196 97358114 97348785 97335476 97317028 97295487 97273797 97250623 97223967 97195417
2533.2I7195417k6709k4730k7847l0023k9242l0148k9737k7859k6077k3932k1135j8382
2557.7I6879596j9140k3043k3508j9687j7315j3537r250j1063j5294j6564j4049j1063
2582.2I6686083j1182j1426j0383j1033j2666j1754r549p838m673j442J49j186n377
2608.7I6587723o121k396j639n031n239m005o575p027j145M113R24m482k611J806j389
2639.3I6546906q929j1944j0562r519j0753j2094j5080k1308k5928k3836j9270k0546
2663.7I6357137k4188k3853k1750k3478k7532k5415k2781l0905l8934l5971l1388l1847
2688.2I6019095l1936k8497k6381k9480l2694k9528k4688k4253k4289k1338j9068j9568
2712.7I5707375j7053r555o139q619p230k164q153j8073j1611j394k057q011j4275
$$ plain form
2533.2 97195417 97168708 97143978 97116131 97086108 97056866 97026718 96996981 96969122 96943045 96919113 96897978 96879596
2557.7 96879596 96860456 96837413 96813905 96794218 96776903 96763366 96754116 96743053 96727759 96711195 96697146 96686083
2582.2 96686083 96674901 96663475 96653092 96642059 96629393 96617639 96608090 96600252 96595579 96594137 96594286 96593100 96587723
2608.7 96587723 96581602 96579206 96577567 96572536 96567297 96563292 96556717 96549690 96548545 96552658 96553582 96549100 96546489 96548295 96546906
2639.3 96546906 96537977 96526033 96515471 96505952 96495199 96483105 96468025 96446717 96420789 96396953 96377683 96357137
2663.7 96357137 96332949 96309096 96287346 96263868 96236336 96210921 96188140 96157235 96118301 96082330 96050942 96019095
2688.2 96019095 95987159 95958662 95932281 95902801 95870107 95840579 95815891 95791638 95767349 95746011 95726943 95707375
2712.7 95707375 95690322 95680767 95674628 95666009 95658779 95656615 95648462 95630389 95618778 95617384 95615327 95607316 95593041
2739.2I5593041j3524o408k783m041n395p259j2392j5897j4227j5271k1565k3776k0677
2765.7I5429826k1196k5415k4104k2233l3664m8411m7672l8910l7128l8886l7318l7796
2790.2I5017093m4000m7463m1342l7116m8637o1661n6595m4101m4316n6255o2841n7602
2814.7I4415164n5915o0159n8007n4121n8860o5082o0183n0610n2107n8609n6273o7574
2839.1I3717664j00523j13302r7692q9979r8181r1559o2162l8826l1132k9557l1698
2861.6I2933053l5990m2468m7505l8856k6017l8493o1452n8908n0270n7292o0559n7673
2886.1I2357570o3944p3731p2950o6090o9660p9345p6568o8063o9183p6556p6473o7967
2910.5I1497040o9785q4710q9074p4792n5027k8592M125K9528M1461M2057M8101O2716
$$ plain form
2739.2 95593041 95579517 95573109 95570326 95566285 95560890 95553631 95541239 95525342 95511115 95495844 95474279 95450503 95429826
2765.7 95429826 95408630 95383215 95359111 95336878 95303214 95254803 95207131 95168221 95131093 95092207 95054889 95017093
2790.2 95017093 94973093 94925630 94884288 94847172 94798535 94736874 94680279 94636178 94591862 94535607 94472766 94415164
2814.7 94415164 94359249 94299090 94241083 94186962 94128102 94063020 94002837 93952227 93900120 93841511 93785238 93717664
2839.1 93717664 93617141 93503839 93406147 93316168 93217987 93126428 93064266 93025440 92994308 92964751 92933053
2861.6 92933053 92897063 92854595 92807090 92768234 92742217 92703724 92642272 92583364 92533094 92475802 92415243 92357570
2886.1 92357570 92293626 92219895 92146945 92080855 92011195 91931850 91855282 91787219 91718036 91641480 91565007 91497040
2910.5 91497040 91427255 91342545 91253471 91178679 91123652 91095060 91099185 91128713 91170174 91212231 91260332 91323048
2935I1323048O5297O1154O7735P0733N6225L6633K7752K8109K2042J2594J2208J2105
2959.5I1795635P218N520N364o61p779k396K754j2630k9475l9327o3604r1779r6357
2986I1472483q1736o2889n9330p8136r2697j10937j45554j65659j65910j55097j17987
3008.4I0236551n9987j8858j1111j4120j1247j2291k4497m7410p0089p0721n8800n9533
3032.9H9777887q1670j04779j02538j05202j39976j76179j79720j44709r6112n4520
3053.3H8592482k2376r423o74K4468N0431O9350Q0842Q4543R6405J16259J31654J28395
3077.8H9342356R3662N6714M7797M9043N2810O1524O0135N7304O2131O1167M7946K4628
3102.2I0017217Q279R519O521j1724j5640j79L28j9294m6969o6036n8311l7295k7376
$$ plain form
2935 91323048 91388345 91449499 91517234 91587967 91644192 91680825 91708577 91736686 91758728 91771322 91783530 91795635
2959.5 91795635 91802853 91808373 91813737 91813076 91805297 91802901 91805655 91793025 91763550 91724223 91660619 91568840 91472483
2986 91472483 91390747 91327858 91268528 91190392 91097695 90986758 90841204 90675545 90509635 90354538 90236551
3008.4 90236551 90176564 90157706 90146595 90132475 90121228 90108937 90084440 90037030 89966941 89896220 89837420 89777887
3032.9 89777887 89696217 89591438 89488900 89383698 89243722 89067543 88887823 88743114 88647002 88592482
3053.3 88592482 88570106 88560683 88560009 88584477 88634908 88704258 88785100 88869643 88966048 89082307 89213961 89342356
3077.8 89342356 89436018 89492732 89540529 89589572 89642382 89703906 89764041 89821345 89883476 89944643 89992589 90017217
3102.2 90017217 90025496 90035015 90041536 90029812 90014172 90013993 90014321 89995027 89948058 89882022 89823711 89786416 89759040
3128.8H9759040l3927m2135l9696l3427l9541n6327o0504n2220m5657l2872k3061m5413
3153.2H9254260p5400p5739o6990o7890o9737o5106n8461n9312o3414o5285o4885o9314
3177.7H8452727p9549q1253p5900p5794p8940q2630q8125r2352r3067r0605q9418r3532
3202.2H7431562r5516q9890q9479r6601r3246q0859p8035q5586r2029r2692r0795q9235
3226.7H6357599q3571p1758o7175q0728q9717q0204p3356p2127o7413o2364o3128o9087
3251.1H5476971o6209n8174o3622p2205o8426n9331n6571n5939m9478n5384p9340r7591
3275.6H4694701r8091q8519q6093r2864r7841r7889r4151r7913j14738j35446j56391
3298H3534765j62214j38885j15263j36209j90246k25597k28912k22796k21968k22117
$$ plain form
3128.8 89759040 89725113 89682978 89643282 89609855 89570314 89513987 89453483 89401263 89355606 89322734 89299673 89254260
3153.2 89254260 89178860 89103121 89036131 88968241 88898504 88833398 88774937 88715625 88652211 88586926 88522041 88452727
3177.7 88452727 88373178 88291925 88216025 88140231 88061291 87978661 87890536 87798184 87705117 87614512 87525094 87431562
3202.2 87431562 87336046 87246156 87156677 87060076 86966830 86885971 86807936 86722350 86630321 86537629 86446834 86357599
3226.7 86357599 86274028 86202270 86135095 86054367 85964650 85884446 85811090 85738963 85671550 85609186 85546058 85476971
3251.1 85476971 85410762 85352588 85288966 85216761 85148335 85089004 85032433 84976494 84927016 84871632 84792292 84694701
3275.6 84694701 84596610 84508091 84421998 84329134 84231293 84133404 84039253 83941340 83826602 83691156 83534765
3298 83534765 83372551 83233666 83118403 82982194 82791948 82566351 82337439 82114643 81892675 81670558
3318.4H1670558k21300k23589k33930k60776k88397k94960k86949k71600k59411k80667
3338.8G9048979l21001l38166l41863l36111l17150l31342l76326l89320l69447l54636
3359.2G5573617l58695l62682l39901l24136l61920m14252m07726l51703l14057l11803
3379.6G2026742l14534l00247k71672k31552j89650j94102k40350k42555j83583j49810
3400F9708687j96665k47616k16454j57160j35666j41954j54299j45006j11723r4467
3420.4F8107677r2918p2056l2234k146k229N400L5721K9862l588P331O0260J01918
3444.9F8142998J08862R9808J10078J33640J53178J75285J92702J83332J81442K20996
3465.3F9702321K41125J98263J50537J58972K02083K41554K44922K08574J97238K23368
$$ plain form
3318.4 81670558 81449258 81225669 80991739 80730963 80442566 80147606 79860657 79589057 79329646 79048979
3338.8 79048979 78727978 78389812 78047949 77711838 77394688 77063346 76687020 76297700 75928253 75573617
3359.2 75573617 75214922 74852240 74512339 74188203 73826283 73412031 73004305 72652602 72338545 72026742
3379.6 72026742 71712208 71411961 71140289 70908737 70719087 70524985 70284635 70042080 69858497 69708687
3400 69708687 69512022 69264406 69047952 68890792 68755126 68613172 68458873 68313867 68202144 68107677
3420.4 68107677 68014759 67942703 67910469 67908323 67906094 67911494 67947215 67977077 67973489 67980820 68041080 68142998
3444.9 68142998 68251860 68351668 68461746 68595386 68748564 68923849 69116551 69299883 69481325 69702321
3465.3 69702321 69943446 70141709 70292246 70451218 70653301 70894855 71139777 71348351 71545589 71768957
3485.7G1768957K26313K12294K23267K45023K54089K48742K52974K60186K28012K00152
3506.1G4120009K28405K61944K67816K54107K36421K45005K81185L16376L00312K53325
3526.5G6764905K42997K64096K88206L10028L08275K92218L17401L59308L54380K96723
3546.9G9798537K61295K86168L08764L08669L24195L53003L65776L65126L83180L96616
3567.3H3151329L40128K96098L25161L67284L89969M11647M27616M36241M51874M33988
3587.7H7031335L67111L46034L90542M21685M16660M04108L84497L78693M04095M29243
3608.1I0974003M13156L90142L69936L39806L49963L36850K59584K50387L24106L92050
3628.5I4399983L07578J91474K01678K28518K32607K43318K60216L00050L66724L61394
$$ plain form
3485.7 71768957 71995270 72207564 72430831 72675854 72929943 73178685 73431659 73691845 73919857 74120009
3506.1 74120009 74348414 74610358 74878174 75132281 75368702 75613707 75894892 76211268 76511580 76764905
3526.5 76764905 77007902 77271998 77560204 77870232 78178507 78470725 78788126 79147434 79501814 79798537
3546.9 79798537 80059832 80346000 80654764 80963433 81287628 81640631 82006407 82371533 82754713 83151329
3567.3 83151329 83491457 83787555 84112716 84480000 84869969 85281616 85709232 86145473 86597347 87031335
3587.7 87031335 87398446 87744480 88135022 88556707 88973367 89377475 89761972 90140665 90544760 90974003
3608.1 90974003 91387159 91777301 92147237 92487043 92837006 93173856 93433440 93683827 94007933 94399983
3628.5 94399983 94707561 94899035 95100713 95329231 95561838 95805156 96065372 96365422 96732146 97093540
3648.8I7093540J67281K6548Q1891J63221J40154R7001R7579J35415J91731K20579
3669.2I8414940J64503J07008Q9550L463m4239m47O6292J41883K03491J35386k4045
3691.7I9257785n6213m542L8147O4743N8823J8311K7364R8056J33187N5474m6206n2160
3716.2I9592769n698K9999L2598J1259q058J275O1238J42753J31965R900n8818l6174
3740.6I9905008K4873O5678L1752O687p510o8301p5990k5177m696l1788l1042J0544
3765.1I9800038K9213O532l4147m6790o217M6057M1628j4109k8765k0599k9010j5920
3789.6I9727911J1444L5113N6893N5760M8059K3627l8767n0139m1908n0759j4615N2511
3814.1I9815130R0236O4182J8513m5609q2648n1725j9836J2421N4300P0417N9104J5515
$$ plain form
3648.8 97093540 97260821 97287369 97369260 97532481 97672635 97769636 97867215 98002630 98194361 98414940
3669.2 98414940 98579443 98686451 98776001 98779464 98735225 98734778 98801070 98942953 99146444 99281830 99257785
3691.7 99257785 99201572 99197030 99235177 99299920 99358743 99377054 99404418 99502474 99635661 99691135 99644929 99592769
3716.2 99592769 99587071 99617070 99649668 99660927 99652869 99654144 99715382 99858135 99990100 100000000 99941182 99905008
3740.6 99905008 99929881 99995559 100027311 100033998 100026488 99958187 99882197 99857020 99852324 99820536 99789494 99800038
3765.1 99800038 99829251 99835783 99801636 99754846 99748629 99794686 99836314 99822205 99793440 99772841 99743831 99727911
3789.6 99727911 99739355 99774468 99831361 99887121 99935180 99958807 99920040 99869901 99827993 99777234 99762619 99815130
3814.1 99815130 99905366 99969548 99988061 99942452 99859804 99808079 99788243 99800664 99854964 99925381 99984485 100000000
3838.5A00000000m0221p0769o8223l3379L3099R3400Q7810j9765q5885n4729J0246
3861I9851584N0712K8986J49R227j997l7938m2069j3859L7289M8697R698j3858l3641
3887.5I9892980j9461R394r102r227M0496O4808L0112j8263p0292q6552m4637J1289
3912I9791545M6295N3507K6691k522l743N01n114K527K4486K0986q261j6230K742K3126
3940.5I9956536K8545J4919R286J4365L648n531L69M852P427J3566J2183L827N734
3967A00069726J7356K1053J4221J1766J2458J0931J5831K2292J7989R406L957L171
3991.5A00230157O926J0419J1576
3997.6A00259078
$$ plain form
3838.5 100000000 99959779 99889010 99820787 99787408 99820507 99913907 100001717 99981952 99896067 99841338 99851584
3861 99851584 99902296 99931282 99931431 99940658 99938661 99900723 99858654 99844795 99882084 99930781 99940479 99926621 99892980
3887.5 99892980 99873519 99882913 99873811 99864584 99905080 99969888 100000000 99981737 99911445 99824893 99780256 99791545
3912 99791545 99837840 99891347 99918038 99915516 99911773 99912274 99907160 99909687 99934173 99955159 99946898 99930668 99933410 99956536
3940.5 99956536 99985081 100000000 100009286 100023651 100027299 100021768 100022137 100026989 100034416 100047982 100060165 100063992 100069726
3967 100069726 100087082 100108135 100122356 100134122 100146580 100157511 100173342 100195634 100213623 100223029 100226986 100230157
3991.5 100230157 100237083 100247502 100259078
3997.6 100259078
##END=$$ End of the data block
