##TITLE=Anti terra U80 $$ Begin of the data block
##JCAMP-DX=5.00 $$ ACD/SpecManager v 10.08
##SPECTROMETER/DATA SYSTEM=Alpha
##DATE=29 Oct 2014 08:57:22
##DATA TYPE=INFRARED SPECTRUM
##DATA CLASS=XYDATA
##ORIGIN=
##OWNER=
##NPOINTS=1667
##FIRSTX=599.64648438
##LASTX=3997.64306641
##MAXX=3997.64306641
##MINX=599.64648438
##MAXY=1.11493361
##MINY=0.51972228
##XFACTOR=1.0000000000
##YFACTOR=0.000000010000000
##FIRSTY=1.07411838
##DELTAX=2.03961372
##XUNITS=1/CM
##YUNITS=ARBITRARY UNITS
##XYDATA=(X++(Y..Y))
599.6A07411838M9948O7342N6910P0393J21343J51003J31774J01816J02783R9301P1239
$$ 107411838 107461786 107529128 107586038 107656431 107777774 107928777 108060551 108162367 108265150 108364451 108435690
622.1A08435690K2626k0635j8298q429j3124j4377r465j514j1945l8052o6685r6011
$$ 108435690 108458316 108437681 108419383 108410954 108397830 108383453 108373988 108372474 108360529 108322477 108255792 108159781
646.6A08159781j11640j02210p5531o8617j01864j53613j83213j84763j95574k65873
$$ 108159781 108048141 107945931 107870400 107801783 107699919 107546306 107363093 107178330 106982756 106716883
667A06716883k17020J5831O7866K1076p75J8108J4746l8457q7047j05631r8693p6330
$$ 106716883 106499863 106515694 106583560 106604636 106603861 106621969 106636715 106598258 106511211 106405580 106306887 106230557
691.4A06230557o9809q0514o4111m3916q1218j39939j59288j63913j77824j85442k16723
$$ 106230557 106160748 106080234 106016123 105972207 105890989 105751050 105591762 105427849 105250025 105064583 104847860
713.9A04847860k77948l35479l59738k83229p8774J55306L17729L96800L90911L52681
$$ 104847860 104569912 104234433 103874695 103591466 103512692 103667998 103985727 104382527 104773438 105126119
734.3A05126119L85928M58777M74465M38153L95930L45028K86269K54297K35629J95253
$$ 105126119 105512047 105970824 106445289 106883442 107279372 107624400 107910669 108164966 108400595 108595848
754.7A08595848J47438J20390J20008R9980L6502j7237l3141l3426k5475J8442P4661
$$ 108595848 108743286 108863676 108983684 109083664 109120166 109102929 109069788 109036362 109010887 109029329 109103990
777.1A09103990Q5938O5684N3000L6538Q953J1885L9577O2001P1609N1892J2541k8229
$$ 109103990 109189928 109255612 109308612 109345150 109354103 109365988 109405565 109467566 109539175 109591067 109603608 109575379
801.6A09575379n8329n9772m5347m0972m8721o5684q2016q5545q5354j00493j10138
$$ 109575379 109517050 109457278 109411931 109370959 109322238 109256554 109174538 109088993 109003639 108903146 108793008
824A08793008j01590j20425j48404j41024j25635j20223j20353j25230j26266j18947
$$ 108793008 108691418 108570993 108422589 108281565 108155930 108035707 107915354 107790124 107663858 107544911
844.4A07544911j09935j13606j34004j49774j47820j33156j16170j04546q4687l7288
$$ 107544911 107434976 107321370 107187366 107037592 106889772 106756616 106640446 106535900 106451213 106413925
864.8A06413925L8254J15836J58178J54901J36662J06036L5858l8886p0142p5710o9082
$$ 106413925 106452179 106568015 106726193 106881094 107017756 107123792 107159650 107120764 107050622 106974912 106905830
887.2A06905830l0553K3043O4075Q8536R0552O0642Q237m8161j02222j40619j53649
$$ 106905830 106875277 106898320 106962395 107050931 107141483 107202125 107210362 107162201 107059979 106919360 106765711
909.7A06765711j42967j23024r4653n6707m0889m3261m6218p1442j14941j46437j70660
$$ 106765711 106622744 106499720 106405067 106348360 106307471 106264210 106217992 106146550 106031609 105885172 105714512
932.1A05714512j93155j96528j94276k08676k22098k16735j91009j42825q9848m7850
$$ 105714512 105521357 105324829 105130553 104921877 104699779 104483044 104292035 104149210 104059362 104011512
952.5A04011512j3745N782j121k8133n8747q4829j00124j07217j33514j97566k60400
$$ 104011512 103997767 104003549 104002428 103974295 103915548 103830719 103730595 103623378 103489864 103292298 103031898
974.9A03031898k61724j89841o1548J02329K45166L10612L11947K87330K43270J97947
$$ 103031898 102770174 102580333 102518785 102621114 102866280 103176892 103488839 103776169 104019439 104217386
995.3A04217386J65260J21856O7615J1862n8365j38879k01082k27046k42985k86686
$$ 104217386 104382646 104504502 104572117 104583979 104525614 104386735 104185653 103958607 103715622 103428936
1015.7A03428936l52287m12929m69494n37503o09779o48737o40446o21236o15817o10387
$$ 103428936 103076649 102663720 102194226 101656723 101046944 100398207 99757761 99136525 98520708 97910321
1036.1I7910321n90933n54907m81087l65388k50572j52993o0320P987K5850O765l3056
$$ 97910321 97319388 96764481 96283394 95918006 95667434 95514441 95454121 95462108 95487958 95494723 95461667
1058.6I5461667r8873j79427k57463l23933l70580l81666l39878k61396j92064j81657
$$ 95461667 95362794 95183367 94925904 94601971 94231391 93849725 93509847 93248451 93056387 92874730
1079I2874730k35212l04896l68649m41777n25970o14261o92702p40402p65127p88141
$$ 92874730 92639518 92334622 91965973 91524196 90998226 90383965 89691263 88950861 88185734 87397593
1099.4H7397593q06796q08162p86525p45791p18111p22962p37322p29102o62094n30893
$$ 87397593 86590797 85782635 84996110 84250319 83532208 82809246 82071924 81342822 80680728 80149835
1119.8H0149835l72624k18058q2796J8227R4825J89286L19517M41867N18679N67520
$$ 80149835 79777211 79559153 79476357 79494584 79589409 79778695 80098212 80540079 81058758 81626278
1140.1H1626278O17480O81293P46567P95745Q09968P42674N81825M05377K90811K32273
$$ 81626278 82243758 82925051 83671618 84467363 85277331 86020005 86601830 87007207 87298018 87530291
1160.5H7530291J77217R8449J1080o2364q5974k6375R8234K45089L95298N30362O12479
$$ 87530291 87707508 87805957 87817037 87754673 87668699 87642324 87740558 87985647 88380945 88911307 89523786
1183H9523786O43367O50078O27172N74875N23108M73738M05437L34358K65276J86306
$$ 89523786 90167153 90817231 91444403 92019278 92542386 93016124 93421561 93755919 94021195 94207501
1203.4I4207501J25117Q7755M7213P278k2703n8353j05888j49792j70035j60616j45614
$$ 94207501 94332618 94420373 94467586 94474864 94452161 94393808 94287920 94138128 93968093 93807477 93661863
1225.8I3661863j67066k44195l54242m64445n61261o35630o74308o80399o54375n85932
$$ 93661863 93494797 93250602 92896360 92431915 91870654 91235024 90560716 89880317 89225942 88640010
1246.2H8640010m90939l91829k97255k03234p3480J14572L13061M38601M57740M07636
$$ 88640010 88149071 87757242 87459987 87256753 87183273 87297845 87610906 88049507 88507247 88914883
1266.6H8914883L29137K41727J56921Q3893L0524n609l5965o5369j08093j94222l13037
$$ 88914883 89244020 89485747 89642668 89726561 89757085 89751476 89715511 89650142 89542049 89347827 89034790
1289H9034790l92896l60507j90174Q6873L75396N88560P30688Q33589R08404R45527
$$ 89034790 88641894 88281387 88091213 88178086 88553482 89142042 89872730 90706319 91614723 92560250
1309.4I2560250R16141Q17412O68901M98724L47585K50470K15364J99920J52707P2944
$$ 92560250 93476391 94293803 94962704 95461428 95809013 96059483 96274847 96474767 96627474 96700418
1329.8I6700418j7232j02353j76579k59333l63058m86172o52998p84654p21973m76312
$$ 96700418 96683186 96580833 96404254 96144921 95781863 95295691 94642693 93858039 93136066 92659754
1350.2I2659754k00308n501Q9538R3025K9611l7944m7541n0509r0742j61063l29817
$$ 92659754 92459446 92453945 92543483 92636508 92666119 92628175 92580634 92530125 92439383 92278320 91948503
1372.7I1948503n35530m97424j57953K50894M77416M89306M67521M66722M01932L04658
$$ 91948503 91412973 90915549 90757596 91008490 91485906 91975212 92442733 92909455 93311387 93616045
1393.1I3616045K60311K79677L23558L71289L97712M25619L97295K75778J14781m0197
$$ 93616045 93876356 94156033 94479591 94850880 95248592 95674211 96071506 96347284 96462065 96421868
1413.5I6421868j51146k03222j62679p4696r6077k10112l72512n68199o25086n53029
$$ 96421868 96270722 96067500 95904821 95830125 95734048 95523936 95151424 94583225 93958139 93405110
1433.9I3405110n65917n02151l04431k62391l29274m54390o54119p95871q46369q24427
$$ 93405110 92839193 92337042 92032611 91770220 91440946 90986556 90332437 89536566 88690197 87865770
1454.3H7865770p59602l80784J01912J60557J47170O30718J486510K198679K576995
$$ 87865770 87106168 86725384 86827296 86987853 87135023 87765741 89252251 91450930 94027925
1472.6I4027925K032530J184398P27534M77755L34162K37405J80268K02930K75213
$$ 94027925 96060455 97244853 97972387 98450142 98784304 99021709 99201977 99404907 99680120
1491I9680120K50524J43683N9402K9397N102n2786j93155l52227k37322j75148k64120
$$ 99680120 99930644 100074327 100133729 100163126 100168228 100115442 99922287 99570060 99332738 99157590 98893470
1513.4I8893470l67445m21959m34149n07235m98051m50033m55516m08918m28384m77994
$$ 98893470 98526025 98104066 97669917 97162682 96664631 96214598 95759082 95350164 94921780 94443786
1533.8I4443786l48109k74426m07934l62909j53082n1499j1420K1011P5853J09452
$$ 94443786 94095677 93821251 93413317 93050408 92897326 92845827 92834407 92855418 92931271 93040723
1554.2I3040723J09911J49661L09157L19857K74461K56688K50208K70736K38353J77425
$$ 93040723 93150634 93300295 93609452 93929309 94203770 94460458 94710666 94981402 95219755 95397180
1574.6I5397180J76436J85442J53029J26702J18899J11180R9713R6464J00380R5189
$$ 95397180 95573616 95759058 95912087 96038789 96157688 96268868 96368581 96465045 96565425 96660614
1595I6660614O9368K6292k5243p0036r9593j18130j32102j29545j34027j86092k49075
$$ 96660614 96729982 96756274 96731031 96660995 96561402 96443272 96311170 96181625 96047598 95861506 95612431
1617.4I5612431k34288k69926l73912m06432m37665m83966m76849n72121q46732q19766
$$ 95612431 95378143 95108217 94734305 94327873 93890208 93406242 92929393 92357272 91510540 90690774
1637.8I0690774o27154o02919n84883n87684m11707r8318K3413K08855M44883N37759
$$ 90690774 90063620 89460701 88875818 88288134 87876427 87778109 87801522 88010377 88455260 88993019
1658.2H8993019O36649P60573P69776O14465N55467O05059N50926N78558O94531O86246
$$ 88993019 89629668 90390241 91160017 91774482 92329949 92935008 93485934 94064492 94759023 95445269
1678.6I5445269O52117P12144Q61198O34724L15171J42473m0328k69002m42630n41049
$$ 95445269 96097386 96809530 97670728 98305452 98620623 98763096 98722768 98453766 98011136 97470087
1699I7470087o75726n96571o07824p50524q32612r85437j248580j693404k429950k607251
$$ 97470087 96794361 96197790 95589966 94839442 94006830 93021393 91772813 90079409 87649459 85042208
1719.4H5042208k187901k123142k037757j722074j453936j195806j054591n00184M27544
$$ 85042208 82854307 80731165 78693408 76971334 75517398 74321592 73267001 72766817 73194361
1737.8G3194361J387840K386505L126317L575218L761238L818863L368539K407151
$$ 73194361 74582201 76968706 80095023 83670241 87431479 91250342 94618881 97026032
1754.1I7026032J789642J449281J070678Q64410O56450M57501L71778L41285L55422
$$ 97026032 98815674 100264955 101335633 102200043 102856493 103313994 103685772 104027057 104382479
1772.4A04382479L23093K41029K04361K04885J91367J82688J58298J01030P4386J28091
$$ 104382479 104705572 104946601 105150962 105355847 105547214 105729902 105888200 105989230 106063616 106191707
1792.8A06191707J29974Q3732P3552Q3864R3484P9393O0022M8626N7149N5933M9996
$$ 106191707 106321681 106405413 106478965 106562829 106656313 106735706 106795728 106844354 106901503 106957436 107007432
1815.3A07007432N0616N3108M1354K5546L2866L2354M4024O8712N9998L5107K5833
$$ 107007432 107058048 107111156 107152510 107178056 107210922 107243276 107287300 107356012 107416010 107451117 107476950
1837.7A07476950Q487r274J8132N3656M9925M2319L3307J9658J6927J6797J7559J3864
$$ 107476950 107485437 107476163 107494295 107547951 107597876 107640195 107673502 107693160 107710087 107726884 107744443 107758307
1862.2A07758307k455k2602L314N1665M3559K5439K1053J2803N996O413P272O449J1278
$$ 107758307 107755852 107733250 107736564 107788229 107831788 107857227 107878280 107891083 107897079 107903492 107910764 107917213 107928491
1888.7A07928491K3353K1326J6523K0516J5342J0156Q202L421n149J728J8025R417
$$ 107928491 107951844 107973170 107989693 108010209 108025551 108035707 108043909 108047330 108042181 108043909 108061934 108071351
1913.2A08071351r513r89J5092P641J2898K0814R966J884L469R262Q214j824j0073
$$ 108071351 108061838 108060849 108075941 108083582 108096480 108117294 108127260 108129144 108132613 108141875 108150089 108148265 108138192
1939.7A08138192K02K2149K4903J7059J7524J5795J4186J9491K0289J7107J8525J4067
$$ 108138192 108138394 108160543 108185446 108202505 108220029 108235824 108250010 108269501 108289790 108306897 108325422 108339489
1964.2A08339489J1444K4139K5845J8621K3686L2425L3224K3341J2314Q917J5009K5010
$$ 108339489 108350933 108375072 108400917 108419538 108443224 108475649 108508873 108532214 108544528 108553445 108568454 108593464
1988.7A08593464K9576K9552K6464K0158J4949J6129K5022L1126K5892J7369R131M685
$$ 108593464 108623040 108652592 108679056 108699214 108714163 108730292 108755314 108786440 108812332 108829701 108838832 108843517
2013.1A08843517Q047J3685J8931J9264J8203K0659J9443J5652J6403K2269K5928J9490
$$ 108843517 108851564 108865249 108884180 108903444 108921647 108942306 108961749 108977401 108993804 109016073 109042001 109061491
2037.6A09061491R966J1146J8812K0504K0742K0087J4973J4865J8430J8799J6093J2136
$$ 109061491 109071457 109082603 109101415 109121919 109142661 109162748 109177721 109192586 109211016 109229815 109245908 109258044
2062.1A09258044J2612J5617J8489K0707J6307R072R585J0168N794Q487J4520J1850
$$ 109258044 109270656 109286273 109304762 109325469 109341776 109350848 109360433 109370601 109376395 109384882 109399402 109411252
2086.6A09411252J3363K4152K3830J1992O557J3792J4353K325j848O532J5343J1050
$$ 109411252 109424615 109448767 109472597 109484589 109491146 109504938 109519291 109521616 109519768 109526300 109541643 109552693
2111A09552693K849K861Q286J6152J9277J4209O330K075M541Q345Q810J0979R870K551
$$ 109552693 109555542 109558403 109566689 109582841 109602118 109616327 109622657 109624732 109629273 109637618 109646428 109657407 109667277 109669828
2139.6A09669828m17K527M471J383j312K778O652M828O973J0610Q571Q607Q953L457
$$ 109669828 109669411 109671938 109676409 109677792 109676480 109679258 109685910 109690738 109697711 109708321 109716892 109725499 109734452 109737909
2168.1A09737909j2N102J3256J5032J1278Q750M553M781J0156Q560P307J0383J3256
$$ 109737909 109737897 109742999 109756255 109771287 109782565 109791315 109795868 109800649 109810805 109819365 109826672 109837055 109850311
2194.6A09850311J2887N185J91K229N448N949J240J382O569N364M685R811R704L648
$$ 109850311 109863198 109868383 109868574 109870803 109876251 109882200 109883440 109884822 109891391 109896755 109901440 109911251 109920955 109924603
2223.2A09924603j765m387J192N007n12j32M101J19l778o104j1182j1492q964p51R727
$$ 109924603 109922838 109918451 109919643 109924650 109924138 109924006 109928107 109928226 109924448 109918344 109907162 109895670 109886706 109885955 109895682
2253.8A09895682L779m923k551m709j0919j1576j2696j1563j275O163M124K754K337
$$ 109895682 109899461 109894538 109891987 109887278 109876359 109864783 109852087 109840524 109839249 109845412 109849536 109852290 109854627
2280.3A09854627p356k0039k4032k2888k7442l3391k6381j7083j9526k4593l2854n1093
$$ 109854627 109847271 109827232 109803200 109780312 109752870 109719479 109693098 109676015 109656489 109631896 109599042 109547949
2304.8A09547949o0105n2476m7446m0281l0386m5347p1311o4361k9815q106j7774k7192
$$ 109547949 109487844 109435368 109387922 109347641 109317255 109271908 109200597 109136236 109106421 109098315 109080541 109053349
2329.3A09053349j0550n722j7809k1255k3890j9419J3852N6016L9018k3246o7449q1301
$$ 109053349 109042799 109037077 109019268 108998013 108974123 108954704 108968556 109024572 109063590 109040344 108972895 108891594
2353.7A08891594q5830o2061P63J6153r942K0242O0224M3834K7513N1963P7451P6782
$$ 108891594 108805764 108743703 108744466 108760619 108750677 108770919 108831143 108874977 108902490 108954453 109031904 109108686
2378.2A09108686P4983P6866O1310L5679J4460j276l635l970j6224k0636j8107k1029
$$ 109108686 109183669 109260535 109321845 109357524 109371984 109370708 109367073 109363103 109346879 109326243 109308136 109287107
2402.7A09287107j8466j2397q607m959n353j0764j2637m518l469j1324j1385j0014
$$ 109287107 109268641 109256244 109247637 109242678 109237325 109226561 109213924 109209406 109205937 109194613 109183228 109173214
2427.2A09173214n960l624r871o568j109m375l910p343j4567j0848m804n687r513j0776
$$ 109173214 109167254 109163630 109153759 109147191 109146082 109141707 109137797 109130454 109115887 109105039 109100235 109094548 109085035 109074259
2455.7A09074259q476q786j1730j2445j0515q976r668q476m458n484j0931j0312p510
$$ 109074259 109065783 109056997 109045267 109032822 109022307 109013331 109003663 108995187 108990729 108985245 108974314 108964002 108956492
2482.2A08956492o700n495q750j4079j7953j4221k671k968j1790r167l624r513j6987
$$ 108956492 108949792 108944297 108935547 108921468 108903515 108889294 108886623 108883655 108871865 108862698 108859074 108849561 108832574
2508.7A08832574j5760j6951k6202k6834j4711k551l159j1301r632q762j5700j4806
$$ 108832574 108816814 108799863 108773661 108746827 108732116 108729565 108726406 108715105 108705473 108696711 108681011 108666205
2533.2A08666205o961m423p546q619o080p927j0312l373m530j5700j1802J836K790
$$ 108666205 108659244 108654821 108647275 108638656 108632576 108624649 108614337 108610964 108606434 108590734 108578932 108580768 108583558
2559.7A08583558j0086k0146j7691q022n138j5831k6632k3317j1456p367j2589j6987
$$ 108583558 108573472 108553326 108535635 108527613 108522475 108506644 108480012 108456695 108445239 108437872 108425283 108408296
2584.2A08408296j3840p892j2099k1279j8919r239o103j0586j9538k3091j6678j2385
$$ 108408296 108394456 108386564 108374465 108353186 108334267 108325028 108318925 108308339 108288801 108265710 108249032 108236647
2608.7A08236647j4866k5761l5751l3486k8681k2900j6404k0456l3641m3487m4036
$$ 108236647 108221781 108196020 108160269 108126783 108098102 108075202 108058798 108038342 108004701 107961214 107917178
2631.1A07917178l4726k3615k4784k2697o795o223k3675l4404l9768m0174l2925l7480
$$ 107917178 107882452 107858837 107834053 107811356 107804561 107798338 107774663 107740259 107700491 107660317 107627392 107589912
2655.6A07589912m8458m1723k9922l3522m3702m2653l3819k8492k5391k8598m0377
$$ 107589912 107541454 107499731 107469809 107436287 107392585 107349932 107316113 107287621 107262230 107233632 107193255
2678A07193255l9398k3163j8763k6655l2020l5882l6085k7668k4867l7170m2307k9039
$$ 107193255 107153857 107130694 107111931 107085276 107053256 107017374 106981289 106953621 106928754 106891584 106849277 106820238
2702.5A06820238k4212m0483m6885l5155l5596m8447n2929n5646o4075o9154o4361
$$ 106820238 106796026 106755543 106708658 106673503 106637907 106589460 106536531 106480885 106416810 106347656 106283295
2724.9A06283295m4596k6321k5285k7799k5893j9931j7906k1338j7154j7238k5964
$$ 106283295 106238699 106212378 106187093 106159294 106133401 106113470 106095564 106074226 106057072 106039834 106013870
2747.4A06013870k1720r525j1861k1684k4092l3140m8709n6947o1011o5029p9369j08123
$$ 106013870 105992150 105982625 105970764 105949080 105924988 105891848 105843139 105786192 105725181 105660152 105580783 105472660
2771.8A05472660j29878j19532j02174j17731j42848j55926j68622j79052j74105j61004
$$ 105472660 105342782 105223250 105121076 105003345 104860497 104704571 104535949 104356897 104182792 104021788
2792.2A04021788j64640j87183k04849k03526k04861k26629k55072k84481l08025l21972
$$ 104021788 103857148 103669965 103465116 103261590 103056729 102830100 102575028 102290547 101982522 101660550
2812.6A01660550l50154l92878m36985m85677n36525o07562p05803q08143r17143j050562
$$ 101660550 101310396 100917518 100480533 99994856 99458331 98850769 98144966 97336823 96419680 95369118
2833I5369118j235473j510906j905900k438706l069324l654456m016053l994930l443223
$$ 95369118 94133645 92622739 90716839 88278133 85208809 81554353 77538300 73543370 70100147
2851.4G0100147k331299q80027N22804J518101J949924J881707J471162R31251N51074
$$ 70100147 67768848 66888821 67411625 68929726 70879650 72761357 74232519 75163770 75714844
2869.7G5714844N63938Q80432J138777J106560Q30167M68529J38378j30850l46500
$$ 75714844 76278782 77159214 78297991 79404551 80234718 80703247 80841625 80710775 80364275
2888.1H0364275n09489o35504p40379q31551r24134j029408j157838j321966j524549
$$ 80364275 79854786 79219282 78478903 77647352 76723218 75693810 74535972 73214006 71689457
2906.5G1689457j746095j985776k256864k527595k729511k749783k479607j902711
$$ 71689457 69943362 67957586 65700722 63173127 60443616 57693833 55214226 53311515
2922.8E3311515j112402k26885O36566J368338J985955K507109K832055K882802K690202
$$ 53311515 52199113 51972228 52608794 53977132 55963087 58470196 61302251 64185053 66875255
2941.1F6875255K312654J790214J176405N71763J40673J2929K20674P03621J317322
$$ 66875255 69187909 70978123 72154528 72726291 72866964 72879893 73100567 73804188 75121510
2959.5G5121510J900196K342826K612877K700228K598983K353584K049667J749492
$$ 75121510 77021706 79364532 81977409 84677637 87276620 89630204 91679871 93429363
2975.8I3429363J467621J212239J001585Q19647O33675M54527K72525O9302j26654
$$ 93429363 94896984 96109223 97110808 97930455 98564130 99018657 99291182 99360484 99233830
2994.2I9233830l26639n42671p20209p96717p28858m96363j21040L19434P20721R98694
$$ 99233830 98907191 98364520 97644311 96847594 96118736 95622373 95501333 95820767 96541488 97540182
3014.5I7540182J116919J090664R70376Q00120O24860M89211L79431K79784K04885
$$ 97540182 98657101 99747765 100718141 101518261 102143121 102632332 103011763 103291547 103496432
3032.9A03496432J70017J56259J08695N4467M6658N4968M2009J4234N960J9658J8573
$$ 103496432 103666449 103822708 103931403 103985870 104032528 104087496 104129505 104143739 104149699 104169357 104187930
3055.3A04187930M458k170o377j2446k2196m793M9246P8141O0988J7595r251L0208
$$ 104187930 104192388 104190218 104183841 104171395 104149199 104144406 104193652 104271793 104332781 104350376 104341125 104371333
3079.8A04371333Q0836Q3649Q5735R6894R0027R2029R8515P4529M0782M8256Q2159
$$ 104371333 104452169 104535818 104621553 104718447 104808474 104900503 104999018 105073547 105114329 105162585 105244744
3102.2A05244744P7414L8743K8026N4181N0259M625r179J6665N6601R4151Q4854L3164
$$ 105244744 105322158 105360901 105388927 105443108 105493367 105497992 105488813 105505478 105562079 105656230 105741084 105774248
3126.7A05774248J263J1611K2900R036k2673m1294r787L4558L3462k372l7873n0938
$$ 105774248 105775511 105787122 105810022 105819058 105796385 105755091 105745304 105779862 105813324 105810952 105773079 105722141
3151.2A05722141k3401J3662J4734r632l2723l4380k6750l3904m0972l9732m6289n9104
$$ 105722141 105698740 105712402 105727136 105717504 105684781 105650401 105623651 105589747 105548775 105509043 105462754 105403650
3175.7A05403650n8413n1856o1261p3386p1931o2882m7660m2963o3908p5579n3299
$$ 105403650 105345237 105293381 105232120 105158734 105086803 105023921 104976261 104933298 104869390 104793811 104740512
3198.1A04740512m1318n5551n3477m4513m4429l8422m1699m9090m0794l3736l9411
$$ 104740512 104699194 104643643 104590166 104545653 104501224 104462802 104421103 104372013 104331219 104297483 104258072
3220.5A04258072m9960n7578n9128n7876p8881j13976r4759m2522l2592o2382r8527
$$ 104258072 104208112 104150534 104091406 104033530 103954649 103840673 103745914 103703392 103670800 103608418 103509891
3243A03509891j16384r7597o2215o5732j01173j08313p9704o4182p4971p6473p6830
$$ 103509891 103393507 103295910 103233695 103167963 103066790 102958477 102878773 102814591 102739620 102663147 102586317
3265.4A02586317j06096j28114q3411j8573o545k4676m1544m8590l6335k6202n2417
$$ 102586317 102480221 102352107 102268696 102250123 102243578 102218902 102177358 102128768 102092433 102066231 102013814
3287.8A02013814r4962r7739n5075j1182J7762K0075l4499r2447o6376J9086P4184
$$ 102013814 101918852 101821113 101766038 101754856 101772618 101792693 101758194 101665747 101599371 101618457 101692641
3310.3A01692641O2847K7084J4687J0025l516j6582j6368Q965L1543L5715K7418p260
$$ 101692641 101755488 101782572 101797259 101807284 101803768 101787186 101770818 101779783 101811326 101847041 101874459 101867199
3334.8A01867199m0150q428M4584M8292M5097L7193m184o437M4274O0201L2913J1933
$$ 101867199 101827049 101818621 101863205 101911497 101956594 101993787 101989603 101983166 102027440 102087641 102120554 102132487
3359.2A02132487J8108K7359L302j1862J5200N2023P1728O4075M2105L8456N7149O6352
$$ 102132487 102150595 102177954 102181256 102169394 102184594 102236617 102308345 102372420 102414525 102452981 102510130 102576482
3383.7A02576482N6649K8634k242J6368P6890R1052M0483J9801P7725J27768R8062
$$ 102576482 102633131 102661765 102659523 102675891 102752781 102843833 102884316 102904117 102981842 103109610 103207672
3406.1A03207672N1510M4012N2726O9559P7736N2715M5156O9356N8532J6045k193J4746
$$ 103207672 103259182 103303194 103355920 103425479 103503215 103555930 103601086 103670442 103728974 103745019 103742826 103757572
3430.6A03757572J1730j1348K9492J07169J25230Q7857M9150L5774M8244N5910M5538
$$ 103757572 103769302 103757954 103787446 103894615 104019845 104107702 104156852 104192626 104240870 104296780 104342318
3453.1A04342318L5727J4197j1003J8824M5299k0230o1559L4177J53160J46580N8448
$$ 104342318 104378045 104392242 104381239 104400063 104445362 104425132 104363573 104397750 104550910 104697490 104755938
3475.5A04755938j0431j6248N4669R0623L2187j514K5546K7121O19M89J9956K2685
$$ 104755938 104745507 104729259 104783928 104874551 104906738 104905224 104930770 104957891 104958510 104958999 104978955 105001640
3500A05001640J4651N1189R1242O4290K5833L0744N9211P2312O1751L8206J5402L2199
$$ 105001640 105016291 105067480 105158722 105223012 105248845 105279589 105338800 105411112 105472863 105511069 105526471 105558670
3524.4A05558670Q0144J01650R5308P4756M1878M5824R7477R5940K4617O854Q5759
$$ 105558670 105638814 105740464 105835772 105910528 105952406 105998230 106095707 106191647 106216264 106223118 106308877
3546.9A06308877J41097J07085Q0633J09637J16444P0715M2236L9851L0935O6686J23429
$$ 106308877 106449974 106557059 106637692 106747329 106863773 106934488 106976724 107016575 107047510 107114196 107237625
3569.3A07237625J27936J06406Q6868Q1992Q1491N3787N985R775R6679J40595R1708
$$ 107237625 107365561 107471967 107558835 107640827 107722318 107776105 107782090 107791865 107888544 108029139 108120847
3591.7A08120847O4635O3539N6862P0024R2339Q7667P6306R7132J07383Q1063P8189
$$ 108120847 108185482 108249021 108305883 108375907 108468246 108555913 108632219 108729351 108836734 108917797 108995986
3614.2A08995986Q8167Q1742Q4710Q8394N6207J4317N7745J33288J01066P9309R2888
$$ 108995986 109084153 109165895 109250605 109338999 109395206 109409523 109467268 109600556 109701622 109780931 109873819
3636.6A09873819Q8895P8904N6470Q535n841N6052J17290J03295P5340O2430M1390
$$ 109873819 109962714 110041618 110098088 110106623 110100782 110156834 110274124 110377419 110452759 110515189 110556579
3659A10556579L9100N6196L5309j1444K837M8650L5798N5087O4337K2078K7513L2377
$$ 110556579 110595679 110651875 110687184 110675740 110678577 110727227 110763025 110818112 110882449 110904527 110932040 110964417
3683.5A10964417r954l6609L8183J19746Q5401K9493J1325J3434K1852J7428m864k0397
$$ 110964417 110954463 110917854 110956037 111075783 111161184 111190677 111202002 111215436 111237288 111254716 111249852 111229455
3708A11229455n900L2591L2640M637j6284k6870j5390m88K348j311j0216l1424m3821
$$ 111229455 111223555 111256146 111288786 111293423 111277139 111250269 111234879 111234391 111236739 111235428 111225212 111193788 111149967
3734.5A11149967N352N2631M0639K5594K3842l910k3067R572L6383N877l243L6657
$$ 111149967 111155319 111207950 111248589 111274183 111298025 111294115 111271048 111280620 111317003 111322880 111319637 111356294
3759A11356294M7267l839l9089j8775J3256K7359L1006J1504k8563l4559O020K2352
$$ 111356294 111403561 111399722 111360633 111341858 111355114 111382473 111413479 111424983 111396420 111361861 111367881 111390233
3783.5A11390233K1470K8491K4032K790l1472n0938l3140J1981M2987J7976P749K2399
$$ 111390233 111411703 111440194 111464226 111467016 111435544 111384606 111351466 111363447 111406434 111424410 111432159 111454558
3807.9A11454558o723l6871j8824J1599j4960m0746O294L9697K7048J0300L898k694
$$ 111454558 111447835 111410964 111392140 111403739 111388779 111348033 111354327 111394024 111421072 111431372 111435270 111432576
3832.4A11432576l2341l8576L111K9540K9254J3435j2160k3448j6153K9934N6457J1993
$$ 111432576 111400235 111361659 111364770 111394310 111423564 111436999 111424839 111401391 111385238 111415172 111471629 111483622
3856.9A11483622p022k7764l9780r632j264N341K9171K1219J4496L779j8037l0732
$$ 111483622 111476600 111448836 111409056 111399424 111398160 111403501 111432672 111453891 111468387 111472166 111454129 111423397
3881.4A11423397m2736j0276N4717M7683P129k491k0623m1259k4473j288J0455L0040
$$ 111423397 111380661 111370385 111425102 111472785 111479914 111477423 111456800 111415541 111391068 111389780 111400235 111430275
3905.8A11430275L8755K4331m005k5630l1698j4484K2757K5308o32J681r668m4453
$$ 111430275 111469030 111493361 111489356 111463726 111432028 111417544 111440301 111465609 111464977 111466658 111456990 111412537
3930.3A11412537k1481K5105J8728r811k6620j7380N293l767k3067r871J5700K2995
$$ 111412537 111391056 111416161 111434889 111425078 111398458 111381078 111386371 111382604 111359537 111349666 111365366 111388361
3954.8A11388361P761j0157j4066j0407q834p283k933J872N006N377K336j4949l0803
$$ 111388361 111396122 111385965 111371899 111361492 111352658 111345375 111342442 111344314 111349320 111354697 111357033 111342084 111311281
3981.3A11311281j0491K5916K4641r501k2531j6057q655j037
$$ 111311281 111300790 111326706 111351347 111341846 111319315 111303258 111294603 111293566
3997.6A11293566
$$ 111293566
##END=$$ End of the data block
