##TITLE=Amostra desc Manuchar dez 2015 $$ Begin of the data block
##JCAMP-DX=5.00 $$ ACD/SpecManager v 10.08
##SPECTROMETER/DATA SYSTEM=Alpha
##DATE=15 Dec 2015 10:27:34
##DATA TYPE=INFRARED SPECTRUM
##DATA CLASS=XYDATA
##ORIGIN=
##OWNER=
##NPOINTS=1765
##FIRSTX=399.76428223
##LASTX=3997.64306641
##MAXX=3997.64306641
##MINX=399.76428223
##MAXY=0.67153507
##MINY=0.20401831
##XFACTOR=1.0000000000
##YFACTOR=1.000000000000000e-9
##FIRSTY=0.67153507
##DELTAX=2.03961372
##XUNITS=1/CM
##YUNITS=ARBITRARY UNITS
##XYDATA=(X++(Y..Y))
399.8 671535075 668658257 666873753 666877806 666466415 665010512 664430678 665031910 665528595 665112257 664038360
420.2 664038360 662663341 660165071 657426953 656037033 654754043 652543008 650986433 650395155 648949146
438.5 648949146 646691263 645139754 643958569 641477227 638424993 636953354 636114180 634027421 631718993
456.9 631718993 630225539 628188312 625012040 622474909 621208906 619445145 616630971 613989055
473.2 613989055 611664951 608550191 605234265 603298068 601665974 598411858 594717860 592145920
489.5 592145920 589466870 585579753 581877768 579156756 576181471 572159708 568124235 564614117
505.8 564614117 560429156 555517197 551175177 547402978 542954445 537716508 532879233 528320968
522.1 528320968 523026526 517286360 512065887 506834447 500864446 495005429 489748806 484111875
538.5 484111875 477790415 471861124 466502547 460661888 454325616 448522776 443278134 437778950
554.8 437778950 432182848 427275956 422806054 418164760 413810343 410240471 407061338 403836310
571.1 403836310 400946558 398668587 396352768 393651366 391080588 388961464 386789232 384412885
587.4 384412885 382498920 381243080 380037785 378891826 378578693 379224658 380395830 382285565 385544091
605.8 385544091 389939219 394720942 399837583 405715615 411983997 417982876 423928499 430093020
622.1 430093020 435735643 440016478 443449885 446637630 449002206 450057000 450511426 450875133 450618863
640.4 450618863 449664533 448962063 448913366 448912352 449192554 450896442 454501718 459814578 467608809 478928447
660.8 478928447 492326289 504107893 514752150 525841951 532127142 533804536 533413410 532001793
677.2 532001793 528751016 522552550 514704883 510023236 515023232 531791329 555023909 578190923
693.5 578190923 598548412 614846289 626058042 633645475 640088677 645885646 650812984 653938532
709.8 653938532 654012501 652477682 651613414 651095390 649738908 648540616 648517430 648410857 647192121
728.1 647192121 646020651 645606458 644604325 642485678 640585661 639285743 637196362 634090006 631327510
746.5 631327510 629025638 625895917 622056067 618771553 615748227 611834049 607455254 603704810
762.8 603704810 600086689 595696270 591157079 587270081 583322883 578670859 574211836 570630908
779.1 570630908 567170441 563431382 560272753 557988405 555761099 553399742 551677167 550633490
795.4 550633490 549416959 547950625 546957195 546370447 545355976 543943107 542856276 541858733 540223598
813.8 540223598 538188457 536273718 534057558 530935347 527242601 523359776 518743515 512960017
830.1 512960017 506509125 499622852 491271675 480155796 465403348 445647597 419650793 390561074
846.4 390561074 369733453 369614780 388275206 410174817 423165023 425118834 419002205 409905314
862.8 409905314 403431654 403198421 410180986 422739178 436733663 447984368 455133080 460021436
879.1 460021436 465287596 471602291 477837026 483307064 488098651 491462529 491984874 489485353 485568225
897.4 485568225 482157379 480256855 480130941 481539041 483695775 485957980 488424808 491270065 494127035
915.8 494127035 496691614 499217033 501908958 504476905 506703317 508841455 511034250 512927175
932.1 512927175 514367938 515754223 517218053 518348336 519043863 519733846 520531476 521067798 521311760
950.5 521311760 521635711 521980047 521976352 521806538 521921694 522143185 522012532 521688282 521572948 521505892
970.9 521505892 521132588 520644367 520381331 520136654 519582212 518972397 518646836 518333673 517757773 517276347
991.3 517276347 517168939 517054141 516685307 516396463 516355038 516211271 515826344 515567124 515532136 515357316
1011.6 515357316 514993548 514855564 514989972 515003622 514886200 515023947 515406668 515672207 515900850 516542315
1032 516542315 517629802 518903852 520739079 523980498 529148519 536384046 544445574 548022628 540673494
1050.4 540673494 524088740 507784545 497984082 493663520 491794527 490661532 488810450 485258281
1066.7 485258281 482842863 484759957 488410026 490222037 490447223 490430653 490524471 490418285 490071326
1085.1 490071326 489820778 489684939 489320517 488752037 488359392 488104880 487645209 487095445 486808330 486600846
1105.5 486600846 486109734 485523820 485188395 484945238 484503120 484027237 483757496 483450770 482843697 482164651
1125.9 482164651 481669486 481219977 480655313 480113924 479685873 479146242 478366524 477600366 476959914 476162851
1146.3 476162851 475131482 474129587 473143250 471838772 470206976 468580335 466978192 465136290
1162.6 465136290 463127822 461275905 459577054 457792491 456005901 454484731 453138649 451744080
1178.9 451744080 450449646 449498922 448762566 448046267 447504550 447318465 447330415 447367638 447568864 448050290
1199.3 448050290 448610932 449079722 449642926 450446963 451293319 452059120 452918351 453946143 454920769
1217.7 454920769 455760211 456683993 457724690 458613068 459327430 460134149 461029708 461757094 462324023
1236 462324023 462965071 463627905 464086056 464412957 464841455 465275496 465471596 465534270 465690762 465831816
1256.4 465831816 465744704 465577096 465559900 465557247 465373069 465179980 465114236 464962661 464625835 464339614
1276.8 464339614 464182734 463886917 463381201 462911278 462525398 461948782 461164773 460459024 459859192 459105253
1297.2 459105253 458178520 457311541 456468433 455441684 454271704 453211635 452186763 450915903 449537069
1315.6 449537069 448285997 446912676 445244670 443565786 442046672 440488517 438663483 436750144
1331.9 436750144 434964865 433221340 431295276 429125518 426923186 424730211 422414899 420057863
1348.2 420057863 417728424 415257841 412594944 409907281 407391191 404794842 401551872 397913694
1364.5 397913694 394480407 390936434 387316346 383897096 380293369 376669824 373162329 369233191
1380.8 369233191 364845157 360510409 355945468 350811899 345846176 341192484 337133974 334556460
1397.1 334556460 332483321 329362690 324841052 318907112 313033730 309303582 309112877 312534362
1413.5 312534362 317046285 318625927 314080209 305963159 296921372 287294865 278115690 268915147
1429.8 268915147 260201871 252867341 244897187 235896930 228627667 222619087 217273667 212764323
1446.1 212764323 208813667 205877721 204368740 204018310 204304650 204799399 205744937 207500756 210204929
1464.5 210204929 213535354 217220277 221907899 228286117 235248879 242065534 249222100 257081658
1480.8 257081658 265592158 274280429 283399254 293109119 302201569 309585124 316729009 324597389
1497.1 324597389 331634909 337408870 342784077 349220097 356709808 361499250 364935130 368960291
1513.4 368960291 373742640 378721982 383268625 387684733 391534090 394872844 398137927 401325613
1529.7 401325613 405009419 408769369 411812365 415353209 420060426 423248649 424846172 426584095
1546 426584095 428863436 431469828 434068024 437106729 440848053 444712520 446234822 446917862 448648959
1564.4 448648959 450980693 453458875 455604792 457433671 459578395 461415648 462339729 463252962 464244038
1582.8 464244038 465190470 466130197 466852397 467185080 467318982 467287838 466843486 466079354 465257406 464356244
1603.2 464356244 463181883 461748689 460072279 458322167 456849813 455179423 452463865 450130969
1619.5 450130969 448597103 446602911 444368660 442304552 440263569 439134151 439143389 438619882 436900824
1637.8 436900824 435737073 435602605 436313868 437079817 437016994 437295079 438048333 436886132 435201705
1656.2 435201705 434706628 434722364 434336513 433454424 433029056 432627529 431120723 429372668 427625418
1674.5 427625418 425420225 423812896 423312694 423166156 421595603 419700325 419002920 418912023 419406056
1692.9 419406056 420421600 421503693 422659695 423739582 424755991 426048934 427156657 428143471
1709.2 428143471 429629117 431799740 434278548 435935229 436444283 437118262 438243479 439439774 440870672
1727.6 440870672 442723453 444735140 446214974 446845800 447749108 449039102 450215429 451469094 453040481
1745.9 453040481 454625458 455554605 455709130 456060529 456967264 458201945 459697396 461009562 461726636
1764.3 461726636 462414116 463605821 465283215 466787159 467767507 468987286 470681548 472400695 473942548
1782.6 473942548 475504011 477141649 478988051 481064141 482728124 483802587 484935641 486362100
1799 486362100 487769693 488838971 489810944 491096914 492653668 493973583 494906425 495925009 497157604
1817.3 497157604 498352349 499586493 501033306 502518535 503858805 504934490 505632699 506388068 507337272
1835.7 507337272 508263588 509383380 510869503 512164593 512792885 513338983 514066458 514820397 515638471
1854 515638471 516610444 517592907 518415868 519254148 520414472 521817982 522822917 523187459 523593724
1872.4 523593724 524278283 524976313 525720239 526582479 527398467 528131127 529016435 530013025 530692220 531204224
1892.8 531204224 531903505 532642245 533239543 533813834 534529090 535367846 536153913 536801398 537416637 538085163
1913.2 538085163 538849056 539619148 540313244 540985525 541500688 541894019 542460263 543103755 543638229 544188261
1933.6 544188261 544846237 545511842 546184003 546918333 547513783 547883868 548208296 548678398 549288094 549839675
1954 549839675 550304949 550829947 551414013 551922977 552443624 553050280 553532958 553822637 554156780 554673135
1974.4 554673135 555230141 555673838 556090593 556617200 557178378 557696164 558274806 558934271 559406221 559652090
1994.8 559652090 559992373 560509324 561019301 561451614 561909497 562408507 562833011 563193917 563672781 564243555
2015.2 564243555 564647615 564861774 565070093 565168977 565188229 565642178 566514134 567251027 567711413 568104923
2035.6 568104923 568561196 569005609 569347382 569678128 570080578 570463061 570792735 571161866 571582496 571969628
2056 571969628 572322369 572722912 573171258 573568285 573884368 574235976 574643433 575015426 575375855 575791121
2076.4 575791121 576206326 576552033 576888859 577264667 577623129 577930033 578230143 578553975 578860462 579121470
2096.8 579121470 579371214 579611242 579811633 580021858 580308437 580653429 581026971 581471562 582006693 582554698
2117.1 582554698 583043098 583494186 583957911 584420025 584845901 585258186 585683703 586081207 586435199 586795092
2137.5 586795092 587173581 587519407 587839782 588199675 588566244 588874161 589161813 589496672 589836776 590132833
2157.9 590132833 590441048 590792418 591104984 591312885 591499865 591785491 592132032 592425227 592680991 592937708
2178.3 592937708 593140483 593291223 593493402 593754411 593969822 594151974 594376683 594603419 594750345 594849169
2198.7 594849169 594978750 595128894 595252991 595381379 595555186 595703602 595765412 595814049 595914960 595993817
2219.1 595993817 596006095 596038818 596129894 596181333 596148789 596111655 596115828 596113801 596084654 596083283 596088827 596022844
2243.6 596022844 595919788 595857382 595802426 595713139 595645010 595636010 595640361 595607579 595571876 595582187 595606804 595618725
2268.1 595618725 595691204 595849872 595995426 596093297 596224308 596430838 596639991 596781611 596898019 597061574
2288.5 597061574 597221196 597320437 597434223 597583890 597681880 597731829 597825348 597925365 597933054 597886384 597882211
2310.9 597882211 597913504 597915113 597859144 597756565 597628593 597483635 597392678 597381711 597338378 597265005 597321808
2333.3 597321808 597480834 597540021 597513020 597633481 598003924 598687589 599621356 600314021 600344002 599803865
2353.7 599803865 599204004 598911345 598952591 599158168 599566400 600304306 601220727 602083564 602898538 603792489
2374.1 603792489 604718447 605579317 606396616 607181311 607839525 608290434 608619213 608955562 609278619 609534860
2394.5 609534860 609790564 610101283 610394120 610608876 610812247 611058056 611282706 611458004 611653090 611871421
2414.9 611871421 612038910 612158537 612291753 612431169 612508774 612527251 612556517 612562835 612458766 612280548
2435.3 612280548 612117231 611959517 611768425 611597717 611512959 611483097 611403525 611184895 610753000 609950244
2455.7 609950244 608606756 606743753 604614496 602599740 601058602 600193381 599981844 600222647 600754082
2474.1 600754082 601545632 602540016 603570402 604489684 605258584 605860293 606280506 606580377 606862128
2492.4 606862128 607131004 607324004 607425988 607447445 607391238 607293189 607235312 607293665 607477605 607735276
2512.8 607735276 608029008 608339429 608652472 608962059 609260142 609558523 609852135 610117733 610365987 610613883
2533.2 610613883 610854447 611085832 611333907 611605585 611874580 612138987 612416685 612700939 612970173 613220811
2553.6 613220811 613475978 613745749 614001453 614203691 614346802 614489496 614684761 614895761 615079522 615250170
2574 615250170 615416884 615590811 615804017 616050661 616296887 616545200 616814315 617091060 617344916 617582083
2594.4 617582083 617827475 618079722 618323684 618537664 618724763 618920624 619114697 619278133 619429767 619579494
2614.8 619579494 619724154 619873166 620019734 620144606 620235980 620299220 620351136 620395958 620420516 620428085 620442688
2637.2 620442688 620461524 620445848 620384037 620322287 620297313 620274544 620211899 620124042 620029390 619923174 619800806
2659.7 619800806 619674623 619555891 619420469 619240105 619042873 618875623 618718803 618530631 618321240 618108571
2680.1 618108571 617863178 617573857 617299616 617060244 616808355 616522849 616227746 615932047 615601778 615253985
2700.5 615253985 614917219 614558220 614176750 613807201 613455057 613087595 612678349 612249017 611838698 611426711
2720.9 611426711 610955000 610465348 610033095 609613299 609148622 608676970 608230591 607761145 607227683 606703699
2741.2 606703699 606239676 605755508 605213284 604681194 604181826 603649437 603073597 602503359 601926804 601325631
2761.6 601325631 600734770 600172460 599588037 598930240 598239243 597584903 596950054 596295595 595647573 595008790
2782 595008790 594312847 593529761 592730045 591983080 591251850 590473354 589673221 588914216 588177443 587403536
2802.4 587403536 586616337 585845590 585041761 584221900 583444178 582660556 581799150 580881655 579985976 579094052
2822.8 579094052 578136325 577145696 576162875 575137079 574036002 572911859 571805775 570675135 569438457
2841.2 569438457 568069160 566583991 564990938 563360810 561868131 560627222 559566557 558595240
2857.5 558595240 557719469 556909084 556028664 555009425 553927541 552801371 551561117 550288200 549129605
2875.9 549129605 548014045 546806216 545542717 544302106 543043911 541697800 540307462 538920522
2892.2 538920522 537474573 535944641 534405529 532868505 531255901 529560983 527847469 526081562
2908.5 526081562 524145305 522030354 519872963 517780006 515728235 513700664 511788011 510036051
2924.8 510036051 508343875 506693184 505229831 503926933 502578795 501166642 499792933 498398751
2941.1 498398751 496904165 495417625 494051129 492709875 491267443 489800096 488409221 487036824
2957.4 487036824 485640198 484287471 483001560 481715500 480421007 479231924 478222579 477338582
2973.8 477338582 476530463 475788862 475079089 474343836 473602116 472940475 472323954 471639186 470896870 470164567
2994.2 470164567 469417065 468613356 467783809 466978639 466183782 465350091 464500427 463689476 462870687 461969554
3014.5 461969554 461049974 460210234 459406942 458547741 457684338 456901699 456166416 455423355 454695523 454041719
3034.9 454041719 453433186 452836335 452287406 451802343 451361299 450941384 450555801 450228304 449951887 449711591
3055.3 449711591 449502081 449320734 449180126 449112892 449111819 449100345 449039191 448997706 449059546 449203551 449338734
3077.8 449338734 449436396 449521124 449576586 449590355 449625731 449710906 449780881 449836880 449954748 450105518 450176150
3100.2 450176150 450130999 450072318 450090051 450117111 450091630 450086445 450141907 450152338 450067014 449953049 449802935
3122.6 449802935 449597359 449411571 449306935 449222207 449048966 448828399 448682249 448546678 448289633 447985232
3143 447985232 447767764 447601140 447404116 447207808 447000325 446693659 446311057 445942491 445630074 445345908
3163.4 445345908 445046991 444735795 444407612 444038182 443651974 443291128 442926347 442511678 442071706 441648960
3183.8 441648960 441243768 440830976 440404028 439979464 439541698 439075977 438599020 438110203 437616706 437142462
3204.2 437142462 436722845 436352164 435942680 435464114 434978753 434514880 434039474 433531821 433017224 432529747
3224.6 432529747 432081312 431651354 431229055 430816978 430340409 429769844 429218888 428752661 428333133 427930772
3245 427930772 427521855 427076012 426655203 426322877 426022947 425693005 425327003 424957275 424612045 424288183
3265.4 424288183 424026042 423865139 423710823 423456907 423124343 422784120 422475487 422187686 421898812 421607107
3285.8 421607107 421324670 421072155 420822918 420509994 420109779 419615328 419083595 418640435 418293566 417902291
3306.2 417902291 417331159 416576743 415763021 415013134 414308608 413581491 412830710 412054330 411220491 410274506
3326.6 410274506 409232408 408181280 407144368 406096756 405001402 403797299 402487993 401145339
3342.9 401145339 399808586 398482054 397153974 395786405 394334823 392816573 391336679 389947802
3359.2 389947802 388569653 387169659 385840803 384604394 383329153 381947130 380592972 379373103
3375.5 379373103 378234059 377128303 376056343 374985576 373899907 372872025 371927649 370937288 369796306
3393.9 369796306 368588269 367419630 366251498 364935249 363421857 361857355 360300422 358652145
3410.2 358652145 356858522 354936481 352936119 350878477 348651946 346216798 343709528 341197431
3426.5 341197431 338669151 336113632 333565682 331068873 328577846 326089144 323717743 321542144
3442.9 321542144 319513619 317509830 315572709 313890934 312479258 311292708 310392678 309828281 309488147
3461.2 309488147 309327155 309512585 310071915 310811609 311625332 312605947 313828290 315290779 316890478
3479.6 316890478 318467051 320049703 321741521 323457748 325114459 326753139 328394860 330043763
3495.9 330043763 331699848 333378851 335039884 336557537 337975025 339499921 341123462 342734694
3512.2 342734694 344360471 346043020 347802520 349667549 351661503 353641897 355493128 357274503
3528.5 357274503 359085888 361039460 363160759 365307212 367407799 369652599 372104049 374521554
3544.8 374521554 376646966 378636688 380766422 382948458 385066092 387288183 389705032 392207772
3561.1 392207772 394865751 397718519 400274366 402192593 404054403 406244129 408652604 411144495
3577.5 411144495 413682252 416297048 419136971 422191411 424879789 426972687 429176360 431780428
3593.8 431780428 434414804 436886758 439292729 441656828 444142431 446922481 449763209 452330619
3610.1 452330619 454791933 457233727 459652543 462066531 464038163 465659112 467699945 470469773
3626.4 470469773 473346680 475197881 476515770 478044838 479731202 481532097 483445078 485510737
3642.7 485510737 488010257 491017103 493500829 494314730 494690806 495676994 496872902 497882336 498905599
3661.1 498905599 500003695 501380920 503321290 505319953 506618261 507833481 508886278 508954942 508912683
3679.4 508912683 509330332 510238886 511759162 513674736 514867306 514848292 514761031 515174091 516005039
3697.8 516005039 517060161 517830849 518200815 518932819 520315289 521683216 522043586 521750569 521833301
3716.2 521833301 522416592 523198485 523862422 524235308 524336696 524630606 525649011 527225435 528343379
3734.5 528343379 528215766 527707934 527977705 529001772 529802322 530228734 530967236 531217158 530511260
3752.9 530511260 530141771 530423105 530672193 530595541 530719578 531156063 531592309 531834781 531689346 531475365
3773.3 531475365 531718552 532430649 532996953 533050597 533052266 533137143 533181310 533341110 533722281 534338713
3793.7 534338713 535061181 535781503 536540449 536757886 536442935 536301851 536028743 535763264 536087453 536902726
3814.1 536902726 537623227 538161874 538625598 538376510 537899792 537799358 537878633 538202465 538774490 539485395
3834.4 539485395 540191114 540403366 540047050 539535284 539045572 538918018 539578855 541017890 542010427
3852.8 542010427 541135311 540113211 539981067 540483534 541092634 541234434 541300654 541594744 541607618 541322649
3873.2 541322649 541027665 541104674 541617692 541941583 542039096 541965365 541692734 541769266 541915178 541693389
3893.6 541693389 541768909 542475700 543278277 543622255 543310463 542491376 541813910 541642070 541809678 542192876
3914 542192876 542660594 542869925 542796969 542757690 542769432 542706490 542801321 543083787 543129206 542873681 542700887
3936.4 542700887 542814732 543137372 543376863 543401420 543450296 543502927 543402314 543304861 543299437 543331921 543431640
3958.9 543431640 543544054 543548524 543523073 543581665 543705463 543805122 543842673 543868482 543908596 543979466 544091702
3981.3 544091702 544166684 544151306 544171333 544296563 544371307 544355154 544369876 544412017
3997.6 544412017
##END=$$ End of the data block
